All pastes #272133 Raw Edit

Mine

public text v1 · immutable
·published 2006-12-08 19:26 UTC
rendered paste body
------ Build started: Project: project_final, Configuration: Debug Win32 ------
Compiling...
project_final.c
c:\documents and settings\kyle\my documents\visual studio 2005\projects\project_final\project_final\randint.h(28) : warning C4244: 'function' : conversion from 'time_t' to 'unsigned int', possible loss of data
c:\documents and settings\kyle\my documents\visual studio 2005\projects\project_final\project_final\randint.h(39) : error C2143: syntax error : missing ';' before 'type'
c:\documents and settings\kyle\my documents\visual studio 2005\projects\project_final\project_final\randint.h(40) : error C2065: 'rm' : undeclared identifier
c:\documents and settings\kyle\my documents\visual studio 2005\projects\project_final\project_final\gamefuncs.h(74) : warning C4244: 'function' : conversion from 'time_t' to 'unsigned int', possible loss of data
c:\documents and settings\kyle\my documents\visual studio 2005\projects\project_final\project_final\gamefuncs.h(78) : warning C4244: 'function' : conversion from 'time_t' to 'unsigned int', possible loss of data
c:\documents and settings\kyle\my documents\visual studio 2005\projects\project_final\project_final\gamefuncs.h(90) : warning C4244: 'function' : conversion from 'time_t' to 'unsigned int', possible loss of data
c:\documents and settings\kyle\my documents\visual studio 2005\projects\project_final\project_final\gamefuncs.h(260) : warning C4018: '>=' : signed/unsigned mismatch
c:\documents and settings\kyle\my documents\visual studio 2005\projects\project_final\project_final\gamefuncs.h(268) : warning C4267: '=' : conversion from 'size_t' to 'int', possible loss of data
c:\documents and settings\kyle\my documents\visual studio 2005\projects\project_final\project_final\project_final.c(62) : error C2275: 'stats' : illegal use of this type as an expression
        c:\documents and settings\kyle\my documents\visual studio 2005\projects\project_final\project_final\project_final.c(53) : see declaration of 'stats'
c:\documents and settings\kyle\my documents\visual studio 2005\projects\project_final\project_final\project_final.c(62) : error C2065: 'player' : undeclared identifier
c:\documents and settings\kyle\my documents\visual studio 2005\projects\project_final\project_final\project_final.c(62) : error C2065: 'baddie' : undeclared identifier
c:\documents and settings\kyle\my documents\visual studio 2005\projects\project_final\project_final\project_final.c(62) : error C2100: illegal indirection
c:\documents and settings\kyle\my documents\visual studio 2005\projects\project_final\project_final\project_final.c(63) : error C2275: 'stats' : illegal use of this type as an expression
        c:\documents and settings\kyle\my documents\visual studio 2005\projects\project_final\project_final\project_final.c(53) : see declaration of 'stats'
c:\documents and settings\kyle\my documents\visual studio 2005\projects\project_final\project_final\project_final.c(63) : error C2146: syntax error : missing ';' before identifier 'play3r'
c:\documents and settings\kyle\my documents\visual studio 2005\projects\project_final\project_final\project_final.c(63) : error C2065: 'play3r' : undeclared identifier
c:\documents and settings\kyle\my documents\visual studio 2005\projects\project_final\project_final\project_final.c(63) : error C2065: 'baddi3' : undeclared identifier
c:\documents and settings\kyle\my documents\visual studio 2005\projects\project_final\project_final\project_final.c(64) : warning C4047: '=' : 'int' differs in levels of indirection from 'int *__w64 '
c:\documents and settings\kyle\my documents\visual studio 2005\projects\project_final\project_final\project_final.c(65) : warning C4047: '=' : 'int' differs in levels of indirection from 'int *__w64 '
c:\documents and settings\kyle\my documents\visual studio 2005\projects\project_final\project_final\project_final.c(66) : error C2223: left of '->level' must point to struct/union
c:\documents and settings\kyle\my documents\visual studio 2005\projects\project_final\project_final\project_final.c(66) : error C2223: left of '->hp' must point to struct/union
c:\documents and settings\kyle\my documents\visual studio 2005\projects\project_final\project_final\project_final.c(66) : error C2223: left of '->str' must point to struct/union
c:\documents and settings\kyle\my documents\visual studio 2005\projects\project_final\project_final\project_final.c(66) : error C2223: left of '->exp' must point to struct/union
c:\documents and settings\kyle\my documents\visual studio 2005\projects\project_final\project_final\project_final.c(66) : error C2223: left of '->maxhp' must point to struct/union
c:\documents and settings\kyle\my documents\visual studio 2005\projects\project_final\project_final\project_final.c(66) : error C2223: left of '->exp' must point to struct/union
c:\documents and settings\kyle\my documents\visual studio 2005\projects\project_final\project_final\project_final.c(81) : error C2223: left of '->hp' must point to struct/union
c:\documents and settings\kyle\my documents\visual studio 2005\projects\project_final\project_final\project_final.c(85) : warning C4034: sizeof returns 0
c:\documents and settings\kyle\my documents\visual studio 2005\projects\project_final\project_final\project_final.c(120) : error C2223: left of '->level' must point to struct/union
c:\documents and settings\kyle\my documents\visual studio 2005\projects\project_final\project_final\project_final.c(121) : error C2223: left of '->str' must point to struct/union
c:\documents and settings\kyle\my documents\visual studio 2005\projects\project_final\project_final\project_final.c(121) : error C2223: left of '->exp' must point to struct/union
c:\documents and settings\kyle\my documents\visual studio 2005\projects\project_final\project_final\project_final.c(122) : error C2223: left of '->hp' must point to struct/union
c:\documents and settings\kyle\my documents\visual studio 2005\projects\project_final\project_final\project_final.c(122) : error C2223: left of '->maxhp' must point to struct/union
c:\documents and settings\kyle\my documents\visual studio 2005\projects\project_final\project_final\project_final.c(139) : error C2223: left of '->level' must point to struct/union
c:\documents and settings\kyle\my documents\visual studio 2005\projects\project_final\project_final\project_final.c(139) : error C2223: left of '->level' must point to struct/union
c:\documents and settings\kyle\my documents\visual studio 2005\projects\project_final\project_final\project_final.c(139) : error C2198: 'generateMonsterLvl' : too few arguments for call
c:\documents and settings\kyle\my documents\visual studio 2005\projects\project_final\project_final\project_final.c(140) : error C2223: left of '->hp' must point to struct/union
c:\documents and settings\kyle\my documents\visual studio 2005\projects\project_final\project_final\project_final.c(140) : error C2223: left of '->level' must point to struct/union
c:\documents and settings\kyle\my documents\visual studio 2005\projects\project_final\project_final\project_final.c(140) : error C2198: 'generateMonsterHP' : too few arguments for call
c:\documents and settings\kyle\my documents\visual studio 2005\projects\project_final\project_final\project_final.c(141) : error C2223: left of '->str' must point to struct/union
c:\documents and settings\kyle\my documents\visual studio 2005\projects\project_final\project_final\project_final.c(141) : error C2223: left of '->level' must point to struct/union
c:\documents and settings\kyle\my documents\visual studio 2005\projects\project_final\project_final\project_final.c(141) : error C2198: 'generateMonsterStr' : too few arguments for call
c:\documents and settings\kyle\my documents\visual studio 2005\projects\project_final\project_final\project_final.c(142) : error C2223: left of '->level' must point to struct/union
c:\documents and settings\kyle\my documents\visual studio 2005\projects\project_final\project_final\project_final.c(142) : error C2223: left of '->hp' must point to struct/union
c:\documents and settings\kyle\my documents\visual studio 2005\projects\project_final\project_final\project_final.c(142) : error C2223: left of '->str' must point to struct/union
c:\documents and settings\kyle\my documents\visual studio 2005\projects\project_final\project_final\project_final.c(157) : error C2223: left of '->hp' must point to struct/union
c:\documents and settings\kyle\my documents\visual studio 2005\projects\project_final\project_final\project_final.c(157) : error C2223: left of '->level' must point to struct/union
c:\documents and settings\kyle\my documents\visual studio 2005\projects\project_final\project_final\project_final.c(157) : error C2223: left of '->hp' must point to struct/union
c:\documents and settings\kyle\my documents\visual studio 2005\projects\project_final\project_final\project_final.c(157) : error C2223: left of '->str' must point to struct/union
c:\documents and settings\kyle\my documents\visual studio 2005\projects\project_final\project_final\project_final.c(157) : error C2223: left of '->level' must point to struct/union
c:\documents and settings\kyle\my documents\visual studio 2005\projects\project_final\project_final\project_final.c(157) : error C2223: left of '->hp' must point to struct/union
c:\documents and settings\kyle\my documents\visual studio 2005\projects\project_final\project_final\project_final.c(157) : error C2223: left of '->str' must point to struct/union
c:\documents and settings\kyle\my documents\visual studio 2005\projects\project_final\project_final\project_final.c(157) : warning C4047: 'function' : 'int' differs in levels of indirection from 'int *'
c:\documents and settings\kyle\my documents\visual studio 2005\projects\project_final\project_final\project_final.c(157) : warning C4024: 'battle' : different types for formal and actual parameter 1
c:\documents and settings\kyle\my documents\visual studio 2005\projects\project_final\project_final\project_final.c(157) : error C2198: 'battle' : too few arguments for call
c:\documents and settings\kyle\my documents\visual studio 2005\projects\project_final\project_final\project_final.c(159) : error C2223: left of '->hp' must point to struct/union
c:\documents and settings\kyle\my documents\visual studio 2005\projects\project_final\project_final\project_final.c(161) : error C2223: left of '->exp' must point to struct/union
c:\documents and settings\kyle\my documents\visual studio 2005\projects\project_final\project_final\project_final.c(162) : error C2223: left of '->level' must point to struct/union
c:\documents and settings\kyle\my documents\visual studio 2005\projects\project_final\project_final\project_final.c(162) : error C2223: left of '->exp' must point to struct/union
c:\documents and settings\kyle\my documents\visual studio 2005\projects\project_final\project_final\project_final.c(162) : error C2223: left of '->hp' must point to struct/union
c:\documents and settings\kyle\my documents\visual studio 2005\projects\project_final\project_final\project_final.c(162) : error C2223: left of '->maxhp' must point to struct/union
c:\documents and settings\kyle\my documents\visual studio 2005\projects\project_final\project_final\project_final.c(162) : error C2223: left of '->str' must point to struct/union
c:\documents and settings\kyle\my documents\visual studio 2005\projects\project_final\project_final\project_final.c(162) : error C2198: 'level' : too few arguments for call
c:\documents and settings\kyle\my documents\visual studio 2005\projects\project_final\project_final\project_final.c(165) : error C2223: left of '->hp' must point to struct/union
c:\documents and settings\kyle\my documents\visual studio 2005\projects\project_final\project_final\project_final.c(169) : error C2223: left of '->hp' must point to struct/union
c:\documents and settings\kyle\my documents\visual studio 2005\projects\project_final\project_final\project_final.c(177) : error C2223: left of '->level' must point to struct/union
c:\documents and settings\kyle\my documents\visual studio 2005\projects\project_final\project_final\project_final.c(177) : error C2223: left of '->level' must point to struct/union
c:\documents and settings\kyle\my documents\visual studio 2005\projects\project_final\project_final\project_final.c(177) : error C2198: 'run' : too few arguments for call
c:\documents and settings\kyle\my documents\visual studio 2005\projects\project_final\project_final\project_final.c(181) : error C2223: left of '->hp' must point to struct/union
c:\documents and settings\kyle\my documents\visual studio 2005\projects\project_final\project_final\project_final.c(187) : error C2223: left of '->exp' must point to struct/union
c:\documents and settings\kyle\my documents\visual studio 2005\projects\project_final\project_final\project_final.c(187) : error C2223: left of '->level' must point to struct/union
c:\documents and settings\kyle\my documents\visual studio 2005\projects\project_final\project_final\project_final.c(202) : error C2223: left of '->hp' must point to struct/union
c:\documents and settings\kyle\my documents\visual studio 2005\projects\project_final\project_final\project_final.c(259) : error C2223: left of '->hp' must point to struct/union
c:\documents and settings\kyle\my documents\visual studio 2005\projects\project_final\project_final\project_final.c(259) : error C2223: left of '->maxhp' must point to struct/union
c:\documents and settings\kyle\my documents\visual studio 2005\projects\project_final\project_final\project_final.c(259) : error C2198: 'sleep' : too few arguments for call
c:\documents and settings\kyle\my documents\visual studio 2005\projects\project_final\project_final\project_final.c(263) : error C2223: left of '->level' must point to struct/union
c:\documents and settings\kyle\my documents\visual studio 2005\projects\project_final\project_final\project_final.c(263) : error C2198: 'oorzaquit' : too few arguments for call
c:\documents and settings\kyle\my documents\visual studio 2005\projects\project_final\project_final\project_final.c(274) : error C2223: left of '->level' must point to struct/union
c:\documents and settings\kyle\my documents\visual studio 2005\projects\project_final\project_final\project_final.c(274) : error C2198: 'highscore' : too few arguments for call
Build log was saved at "file://c:\Documents and Settings\Kyle\My Documents\Visual Studio 2005\Projects\project_final\project_final\Debug\BuildLog.htm"
project_final - 66 error(s), 11 warning(s)
========== Build: 0 succeeded, 1 failed, 0 up-to-date, 0 skipped ==========