rendered paste bodymake[1]: Entering directory `/usr/src/asterisk/apps'
gcc -pipe -Wall -Wstrict-prototypes -Wmissing-prototypes -Wmissing-declarations -g -Iinclude -I../include -D_REENTRANT -D_GNU_SOURCE -O6 -march=i686 -DZAPTEL_OPTIMIZATIONS -DASTERISK_VERSION=\"CVS-v1-0-12/06/04-15:26:48\" -DINSTALL_PREFIX=\"\" -DASTETCDIR=\"/etc/asterisk\" -DASTLIBDIR=\"/usr/lib/asterisk\" -DASTVARLIBDIR=\"/var/lib/asterisk\" -DASTVARRUNDIR=\"/var/run\" -DASTSPOOLDIR=\"/var/spool/asterisk\" -DASTLOGDIR=\"/var/log/asterisk\" -DASTCONFPATH=\"/etc/asterisk/asterisk.conf\" -DASTMODDIR=\"/usr/lib/asterisk/modules\" -DASTAGIDIR=\"/var/lib/asterisk/agi-bin\" -DBUSYDETECT_MARTIN -fPIC -c -o app_rxfax.o app_rxfax.c
app_rxfax.c: In function `phase_e_handler':
app_rxfax.c:86: error: structure has no member named `cid'
app_rxfax.c: At top level:
app_rxfax.c:55: warning: `t30_flush' defined but not used
make[1]: *** [app_rxfax.o] Error 1
make[1]: Leaving directory `/usr/src/asterisk/apps'
make: *** [subdirs] Error 1
root@rapid:/usr/src/asterisk#