All pastes #270918 Raw Edit

Miscellany

public text v1 · immutable
·published 2006-12-07 23:53 UTC
rendered paste body
lontra@debian:~/GNUstep/netclasses-1.06$ make
Making all in Source...
make[1]: Entering directory `/home/lontra/GNUstep/netclasses-1.06/Source'
Making build-headers for framework netclasses...
Making all for framework netclasses...
 Compiling file NetBase.m ...
In file included from NetBase.m:28:
NetBase.h:23:32: warning: Foundation/NSObject.h: No such file or directory
NetBase.h:24:33: warning: Foundation/NSRunLoop.h: No such file or director
NetBase.h:25:34: warning: Foundation/NSMapTable.h: No such file or directo
In file included from NetBase.m:28:
NetBase.h:40: error: cannot find protocol declaration for ‘NSObject’
NetBase.h:68: error: expected ‘)’ before ‘BOOL’
NetBase.h:91: error: cannot find protocol declaration for ‘NSObject’
NetBase.h:122: error: cannot find protocol declaration for ‘NSObject’
NetBase.h:172: error: expected ‘)’ before ‘NSDate’
NetBase.h:186: error: cannot find interface declaration for ‘NSObject’
rclass of ‘NetApplication’
NetBase.h:191: error: expected specifier-qualifier-list before ‘NSMapTab
NetBase.h:217: error: expected ‘)’ before ‘NSDate’
NetBase.m:30:31: warning: Foundation/NSArray.h: No such file or directory
NetBase.m:32:32: warning: Foundation/NSString.h: No such file or directory
NetBase.m:34:36: warning: Foundation/NSDictionary.h: No such file or direc
NetBase.m:35:30: warning: Foundation/NSDate.h: No such file or directory
NetBase.m:36:35: warning: Foundation/NSException.h: No such file or direct
NetBase.m:37:41: warning: Foundation/NSAutoreleasePool.h: No such file or
ory
NetBase.m:42: error: cannot find interface declaration for ‘NXConstantSt
™
NetBase.m:48:43: warning: CoreFoundation/CoreFoundation.h: No such file or
tory
NetBase.m:50: error: expected ‘=’, ‘,’, ‘;’, ‘asm’ or ‘_
bute__’ before ‘*’ token
NetBase.m:53: error: expected specifier-qualifier-list before ‘CFSocketR
NetBase.m:59: error: expected ‘)’ before ‘s’
NetBase.m: In function ‘remove_info_for_socket’:
NetBase.m:66: warning: implicit declaration of function ‘NSMapGet’
NetBase.m:66: error: ‘desc_to_info’ undeclared (first use in this func
NetBase.m:66: error: (Each undeclared identifier is reported only once
NetBase.m:66: error: for each function it appears in.)
NetBase.m:66: warning: assignment makes pointer from integer without a cas
NetBase.m:70: warning: implicit declaration of function ‘CFRunLoopRemove
’
NetBase.m:70: warning: implicit declaration of function ‘CFRunLoopGetCur
™
NetBase.m:70: error: ‘net_socket_info’ has no member named ‘sourceâ€
NetBase.m:71: error: ‘kCFRunLoopDefaultMode’ undeclared (first use in
unction)
NetBase.m:73: warning: implicit declaration of function ‘CFRelease’
NetBase.m:73: error: ‘net_socket_info’ has no member named ‘sourceâ€
NetBase.m:74: error: ‘net_socket_info’ has no member named ‘socketâ€
NetBase.m:75: warning: implicit declaration of function ‘NSFreeMapTableâ
NetBase.m:75: error: ‘net_socket_info’ has no member named ‘watchers
NetBase.m:76: warning: implicit declaration of function ‘free’
NetBase.m:78: warning: implicit declaration of function ‘NSMapRemove’
NetBase.m: At top level:
NetBase.m:83: error: expected ‘=’, ‘,’, ‘;’, ‘asm’ or ‘_
bute__’ before ‘is_info_for_socket’
NetBase.m: In function ‘info_for_socket’:
NetBase.m:90: error: ‘CFSocketRef’ undeclared (first use in this funct
NetBase.m:90: error: expected ‘;’ before ‘sock’
NetBase.m:91: error: ‘CFRunLoopSourceRef’ undeclared (first use in thi
tion)
NetBase.m:91: error: expected ‘;’ before ‘source’
NetBase.m:94: error: ‘desc_to_info’ undeclared (first use in this func
NetBase.m:94: warning: assignment makes pointer from integer without a cas
NetBase.m:98: error: ‘sock’ undeclared (first use in this function)
NetBase.m:98: warning: implicit declaration of function ‘CFSocketCreateW
ive’
NetBase.m:99: error: ‘kCFSocketReadCallBack’ undeclared (first use in
unction)
NetBase.m:99: error: ‘kCFSocketWriteCallBack’ undeclared (first use in
function)
NetBase.m:99: error: ‘handle_cf_events’ undeclared (first use in this
on)
NetBase.m:101: warning: implicit declaration of function ‘CFSocketDisabl
acks’
NetBase.m:105: error: ‘source’ undeclared (first use in this function)
NetBase.m:105: warning: implicit declaration of function ‘CFSocketCreate
pSource’
NetBase.m:116: error: ‘net_socket_info’ has no member named ‘socketâ
NetBase.m:117: error: ‘net_socket_info’ has no member named ‘sourceâ
NetBase.m:118: error: ‘net_socket_info’ has no member named ‘modesâ€
NetBase.m:119: error: ‘net_socket_info’ has no member named ‘watcher
NetBase.m:119: warning: implicit declaration of function ‘NSCreateMapTab
NetBase.m:119: error: ‘NSIntMapKeyCallBacks’ undeclared (first use in
unction)
NetBase.m:120: error: ‘NSObjectMapValueCallBacks’ undeclared (first us
his function)
NetBase.m:122: warning: implicit declaration of function ‘NSMapInsert’
NetBase.m:124: warning: implicit declaration of function ‘CFRunLoopAddSo
™
NetBase.m:124: error: ‘kCFRunLoopDefaultMode’ undeclared (first use in
function)
NetBase.m: At top level:
NetBase.m:129: error: expected ‘)’ before ‘s’
NetBase.m:160: error: cannot find interface declaration for ‘NSRunLoopâ€
make[2]: *** [shared_obj/NetBase.o] Error 1
make[1]: *** [netclasses.all.framework.variables] Error 2
make[1]: Leaving directory `/home/lontra/GNUstep/netclasses-1.06/Source'
make: *** [internal-all] Error 2