All pastes #270626 Raw Edit

gentoo emerge error

public text v1 · immutable
·published 2006-12-07 15:46 UTC
rendered paste body
echo "local: *; };" >> .libs/libgstcheck-0.10.ver
 x86_64-pc-linux-gnu-gcc -shared  .libs/libgstcheck_0.10_la-gstbufferstraw.o .libs/libgstcheck_0.10_la-gstcheck.o  -Wl,--rpath -Wl,/var/tmp/portage/gstreamer-0.10.10/work/gstreamer-0.10.10/gst/.libs /usr/lib64/libgobject-2.0.so -L/usr/lib64 /usr/lib64/libgthread-2.0.so /usr/lib64/libgmodule-2.0.so -ldl /usr/lib64/libglib-2.0.so -lcheck ../../../gst/.libs/libgstreamer-0.10.so  -march=k8 -pthread -Wl,--export-dynamic -Wl,-soname -Wl,libgstcheck-0.10.so.0 -Wl,-version-script -Wl,.libs/libgstcheck-0.10.ver -o .libs/libgstcheck-0.10.so.0.9.0
/usr/lib/gcc/x86_64-pc-linux-gnu/3.4.5/../../../../x86_64-pc-linux-gnu/bin/ld: /usr/lib64/libcheck.a(check.o): relocation R_X86_64_32 against `a local symbol' can not be used when making a shared object; recompile with -fPIC
/usr/lib64/libcheck.a: could not read symbols: Bad value
collect2: ld returned 1 exit status
make[4]: *** [libgstcheck-0.10.la] Error 1
make[4]: Leaving directory `/var/tmp/portage/gstreamer-0.10.10/work/gstreamer-0.10.10/libs/gst/check'
make[3]: *** [all-recursive] Error 1
make[3]: Leaving directory `/var/tmp/portage/gstreamer-0.10.10/work/gstreamer-0.10.10/libs/gst'
make[2]: *** [all-recursive] Error 1
make[2]: Leaving directory `/var/tmp/portage/gstreamer-0.10.10/work/gstreamer-0.10.10/libs'
make[1]: *** [all-recursive] Error 1
make[1]: Leaving directory `/var/tmp/portage/gstreamer-0.10.10/work/gstreamer-0.10.10'
make: *** [all] Error 2

!!! ERROR: media-libs/gstreamer-0.10.10 failed.
Call stack:
  ebuild.sh, line 1546:   Called dyn_compile
  ebuild.sh, line 937:   Called src_compile
  gstreamer-0.10.10.ebuild, line 29:   Called die

!!! compile failed
!!! If you need support, post the topmost build error, and the call stack if relevant.