All pastes #270407 Raw Edit

Unnamed

public text v1 · immutable
·published 2006-12-07 10:10 UTC
rendered paste body
/home/xtc/openwrt-bastel/openwrt/staging_dir_mips/bin/mips-linux-uclibc-gcc -I/home/xtc/openwrt-bastel/openwrt/build_mips/busybox-1.1.0/include -I/home/xtc/openwrt-bastel/openwrt/build_mips/busybox-1.1.0/include -I/home/xtc/openwrt-bastel/openwrt/build_mips/busybox-1.1.0/libbb -funsigned-char -D_LARGEFILE_SOURCE -D_LARGEFILE64_SOURCE -D_FILE_OFFSET_BITS=64 -Wall -Wstrict-prototypes -Wshadow -Os -fomit-frame-pointer -D_GNU_SOURCE -DNDEBUG   -Os  -Os -pipe -mips32 -mtune=mips32 -funit-at-a-time  -c -o /home/xtc/openwrt-bastel/openwrt/build_mips/busybox-1.1.0/applets/applets.o /home/xtc/openwrt-bastel/openwrt/build_mips/busybox-1.1.0/applets/applets.c
In file included from /home/xtc/openwrt-bastel/openwrt/build_mips/busybox-1.1.0/include/busybox.h:27,
                 from /home/xtc/openwrt-bastel/openwrt/build_mips/busybox-1.1.0/applets/applets.c:33:
/home/xtc/openwrt-bastel/openwrt/build_mips/busybox-1.1.0/include/bb_config.h:1: error: syntax error before '-' token
/home/xtc/openwrt-bastel/openwrt/build_mips/busybox-1.1.0/include/bb_config.h:1: error: syntax error at '#' token
In file included from /home/xtc/openwrt-bastel/openwrt/build_mips/busybox-1.1.0/include/busybox.h:27,
                 from /home/xtc/openwrt-bastel/openwrt/build_mips/busybox-1.1.0/applets/applets.c:33:
/home/xtc/openwrt-bastel/openwrt/build_mips/busybox-1.1.0/include/bb_config.h:799:2: #endif without #if
In file included from /home/xtc/openwrt-bastel/openwrt/build_mips/busybox-1.1.0/include/libbb.h:39,
                 from /home/xtc/openwrt-bastel/openwrt/build_mips/busybox-1.1.0/include/busybox.h:50,
                 from /home/xtc/openwrt-bastel/openwrt/build_mips/busybox-1.1.0/applets/applets.c:33:
/home/xtc/openwrt-bastel/openwrt/build_mips/busybox-1.1.0/include/bb_config.h:1: error: syntax error before '-' token
/home/xtc/openwrt-bastel/openwrt/build_mips/busybox-1.1.0/include/bb_config.h:1: error: syntax error at '#' token
In file included from /home/xtc/openwrt-bastel/openwrt/build_mips/busybox-1.1.0/include/libbb.h:39,
                 from /home/xtc/openwrt-bastel/openwrt/build_mips/busybox-1.1.0/include/busybox.h:50,
                 from /home/xtc/openwrt-bastel/openwrt/build_mips/busybox-1.1.0/applets/applets.c:33:
/home/xtc/openwrt-bastel/openwrt/build_mips/busybox-1.1.0/include/bb_config.h:799:2: #endif without #if
In file included from /home/xtc/openwrt-bastel/openwrt/build_mips/busybox-1.1.0/include/pwd_.h:24,
                 from /home/xtc/openwrt-bastel/openwrt/build_mips/busybox-1.1.0/include/libbb.h:44,
                 from /home/xtc/openwrt-bastel/openwrt/build_mips/busybox-1.1.0/include/busybox.h:50,
                 from /home/xtc/openwrt-bastel/openwrt/build_mips/busybox-1.1.0/applets/applets.c:33:
/home/xtc/openwrt-bastel/openwrt/staging_dir_mips/lib/gcc/mips-linux-uclibc/3.4.6/../../../../mips-linux-uclibc/sys-include/pwd.h:59: error: syntax error before '}' token
In file included from /home/xtc/openwrt-bastel/openwrt/build_mips/busybox-1.1.0/include/busybox.h:50,
                 from /home/xtc/openwrt-bastel/openwrt/build_mips/busybox-1.1.0/applets/applets.c:33:
/home/xtc/openwrt-bastel/openwrt/build_mips/busybox-1.1.0/include/libbb.h:94: error: syntax error before "va_list"
/home/xtc/openwrt-bastel/openwrt/build_mips/busybox-1.1.0/include/libbb.h:94: warning: function declaration isn't a prototype
/home/xtc/openwrt-bastel/openwrt/build_mips/busybox-1.1.0/include/libbb.h:102: error: syntax error before "va_list"
/home/xtc/openwrt-bastel/openwrt/build_mips/busybox-1.1.0/include/libbb.h:102: warning: function declaration isn't a prototype
/home/xtc/openwrt-bastel/openwrt/build_mips/busybox-1.1.0/include/libbb.h:103: error: syntax error before "va_list"
/home/xtc/openwrt-bastel/openwrt/build_mips/busybox-1.1.0/include/libbb.h:103: warning: function declaration isn't a prototype
/home/xtc/openwrt-bastel/openwrt/build_mips/busybox-1.1.0/include/libbb.h:158: error: syntax error before "va_list"
/home/xtc/openwrt-bastel/openwrt/build_mips/busybox-1.1.0/include/libbb.h:158: warning: function declaration isn't a prototype
/home/xtc/openwrt-bastel/openwrt/build_mips/busybox-1.1.0/include/libbb.h:159: error: syntax error before "va_list"
/home/xtc/openwrt-bastel/openwrt/build_mips/busybox-1.1.0/include/libbb.h:160: warning: function declaration isn't a prototype
make[6]: *** [/home/xtc/openwrt-bastel/openwrt/build_mips/busybox-1.1.0/applets/applets.o] Fehler 1
make[6]: Verlasse Verzeichnis '/home/xtc/openwrt-bastel/openwrt/build_mips/busybox-1.1.0'
make[5]: *** [_all] Fehler 2
make[5]: Verlasse Verzeichnis '/home/xtc/openwrt-bastel/openwrt/build_mips/busybox-1.1.0'
make[4]: *** [/home/xtc/openwrt-bastel/openwrt/build_mips/busybox-1.1.0/.built] Fehler 2
make[4]: Verlasse Verzeichnis '/home/xtc/openwrt-bastel/openwrt/package/busybox'
make[3]: *** [compile] Fehler 2
make[3]: Verlasse Verzeichnis '/home/xtc/openwrt-bastel/openwrt/package/busybox'
make[2]: *** [busybox-compile] Fehler 2
make[2]: Verlasse Verzeichnis '/home/xtc/openwrt-bastel/openwrt/package'
make[1]: *** [package/compile] Fehler 2
make[1]: Verlasse Verzeichnis '/home/xtc/openwrt-bastel/openwrt'
make: *** [world] Fehler 2