rendered paste body ./configure --prefix=/web --with-apache=../apache_1.3.37 --enable-module=status --enable-module=rewrite --enable-module=ssl --enable-module=so
./configure --with-layout=Apache --prefix=/web --enable-module=status --enable-module=rewrite --enable-module=so --enable-module=ssl
gcc -c -I../../os/unix -I../../include -DLINUX=22 -DHAVE_SET_DUMPABLE -I/usr/include/gdbm -DMOD_SSL=208128 -DUSE_HSREGEX -DEAPI `../../apaci` -DSSL_COMPAT -DSSL_USE_SDBM -DSSL_ENGINE -DMOD_SSL_VERSION=\"2.8.28\" mod_ssl.c
In file included from /usr/include/openssl/ssl.h:179,
from mod_ssl.h:120,
from mod_ssl.c:65:
/usr/include/openssl/kssl.h:72:18: krb5.h: No such file or directory
In file included from /usr/include/openssl/ssl.h:179,
from mod_ssl.h:120,
from mod_ssl.c:65:
/usr/include/openssl/kssl.h:134: syntax error before "krb5_enctype"
/usr/include/openssl/kssl.h:136: syntax error before '*' token
/usr/include/openssl/kssl.h:137: syntax error before '}' token
/usr/include/openssl/kssl.h:149: syntax error before "kssl_ctx_setstring"
/usr/include/openssl/kssl.h:149: syntax error before '*' token
/usr/include/openssl/kssl.h:150: syntax error before '*' token
/usr/include/openssl/kssl.h:151: syntax error before '*' token
/usr/include/openssl/kssl.h:151: syntax error before '*' token
/usr/include/openssl/kssl.h:152: syntax error before '*' token
/usr/include/openssl/kssl.h:153: syntax error before "kssl_ctx_setprinc"
/usr/include/openssl/kssl.h:153: syntax error before '*' token
/usr/include/openssl/kssl.h:155: syntax error before "kssl_cget_tkt"
/usr/include/openssl/kssl.h:155: syntax error before '*' token
/usr/include/openssl/kssl.h:157: syntax error before "kssl_sget_tkt"
/usr/include/openssl/kssl.h:157: syntax error before '*' token
/usr/include/openssl/kssl.h:159: syntax error before "kssl_ctx_setkey"
/usr/include/openssl/kssl.h:159: syntax error before '*' token
/usr/include/openssl/kssl.h:161: syntax error before "context"
/usr/include/openssl/kssl.h:162: syntax error before "kssl_build_principal_2"
/usr/include/openssl/kssl.h:162: syntax error before "context"
/usr/include/openssl/kssl.h:165: syntax error before "kssl_validate_times"
/usr/include/openssl/kssl.h:165: syntax error before "atime"
/usr/include/openssl/kssl.h:167: syntax error before "kssl_check_authent"
/usr/include/openssl/kssl.h:167: syntax error before '*' token
/usr/include/openssl/kssl.h:169: syntax error before "enctype"
In file included from mod_ssl.h:120,
from mod_ssl.c:65:
/usr/include/openssl/ssl.h:909: syntax error before "KSSL_CTX"
/usr/include/openssl/ssl.h:931: syntax error before '}' token
make[4]: *** [mod_ssl.o] Error 1
make[3]: *** [all] Error 1
make[2]: *** [subdirs] Error 1
make[2]: Leaving directory `/usr/src/packages/apache_1.3.37/src'
make[1]: *** [build-std] Error 2
make[1]: Leaving directory `/usr/src/packages/apache_1.3.37'
make: *** [build] Error 2