All pastes #268576 Raw Edit

Stuff

public text v1 · immutable
·published 2006-12-05 20:57 UTC
rendered paste body
In file included from WinMain.cpp:23:
../Engine/EngineCommon/CEGUICommonFileDialog.h:63: error: `const' can only be specified for objects and functions
../Engine/EngineCommon/CEGUICommonFileDialog.h:129: error: `hash_map' has not been declared
../Engine/EngineCommon/CEGUICommonFileDialog.h:129: error: expected `,' or `...' before '<' token
../Engine/EngineCommon/CEGUICommonFileDialog.h:130: error: ISO C++ forbids declaration of `parameter' with no type
../Engine/EngineCommon/CEGUICommonFileDialog.h: In function `T CEGUI::getEntryFromHashMap(Z, int)':
../Engine/EngineCommon/CEGUICommonFileDialog.h:132: error: `hashMap' undeclared (first use this function)
../Engine/EngineCommon/CEGUICommonFileDialog.h:132: error: (Each undeclared identifier is reported only once for each function it appears in.)
../Engine/EngineCommon/CEGUICommonFileDialog.h:134: error: `hash_map' undeclared (first use this function)
../Engine/EngineCommon/CEGUICommonFileDialog.h:134: error: expected primary-expression before ',' token
../Engine/EngineCommon/CEGUICommonFileDialog.h:134: error: expected primary-expression before '>' token
../Engine/EngineCommon/CEGUICommonFileDialog.h:134: error: missing template arguments before "hashMapIterator"
../Engine/EngineCommon/CEGUICommonFileDialog.h:134: error: expected `;' before "hashMapIterator"
../Engine/EngineCommon/CEGUICommonFileDialog.h:135: error: `hashMapIterator' undeclared (first use this function)
../Engine/EngineCommon/CEGUICommonFileDialog.h: At global scope:
../Engine/EngineCommon/CEGUICommonFileDialog.h:154: error: `hash_map' has not been declared
../Engine/EngineCommon/CEGUICommonFileDialog.h:154: error: expected `,' or `...' before '<' token
../Engine/EngineCommon/CEGUICommonFileDialog.h:155: error: ISO C++ forbids declaration of `parameter' with no type
../Engine/EngineCommon/CEGUICommonFileDialog.h: In function `void CEGUI::addEntryToHashMap(Z, T, int)':
../Engine/EngineCommon/CEGUICommonFileDialog.h:156: error: `hashMap' undeclared (first use this function)
../Engine/EngineCommon/CEGUICommonFileDialog.h: At global scope:
../Engine/EngineCommon/CEGUICommonFileDialog.h:185: error: `hash_map' has not been declared
../Engine/EngineCommon/CEGUICommonFileDialog.h:185: error: expected `,' or `...' before '<' token
../Engine/EngineCommon/CEGUICommonFileDialog.h:186: error: ISO C++ forbids declaration of `parameter' with no type
../Engine/EngineCommon/CEGUICommonFileDialog.h: In function `void CEGUI::eraseEntryFromHashMap(Z, int)':
../Engine/EngineCommon/CEGUICommonFileDialog.h:188: error: `hashMap' undeclared (first use this function)
../Engine/EngineCommon/CEGUICommonFileDialog.h:190: error: `hash_map' undeclared (first use this function)
../Engine/EngineCommon/CEGUICommonFileDialog.h:190: error: expected primary-expression before ',' token
../Engine/EngineCommon/CEGUICommonFileDialog.h:190: error: expected primary-expression before '>' token
../Engine/EngineCommon/CEGUICommonFileDialog.h:190: error: missing template arguments before "hashMapIterator"
../Engine/EngineCommon/CEGUICommonFileDialog.h:190: error: expected `;' before "hashMapIterator"
../Engine/EngineCommon/CEGUICommonFileDialog.h:191: error: `hashMapIterator' undeclared (first use this function)
../Engine/EngineCommon/CEGUICommonFileDialog.h: At global scope:
../Engine/EngineCommon/CEGUICommonFileDialog.h:207: error: `hash_map' has not been declared
../Engine/EngineCommon/CEGUICommonFileDialog.h:207: error: expected `,' or `...' before '<' token
../Engine/EngineCommon/CEGUICommonFileDialog.h:208: error: ISO C++ forbids declaration of `parameter' with no type
../Engine/EngineCommon/CEGUICommonFileDialog.h: In function `void CEGUI::deleteEntryFromHashMap(Z, int)':
../Engine/EngineCommon/CEGUICommonFileDialog.h:210: error: `hashMap' undeclared (first use this function)
../Engine/EngineCommon/CEGUICommonFileDialog.h:212: error: `hash_map' undeclared (first use this function)
../Engine/EngineCommon/CEGUICommonFileDialog.h:212: error: expected primary-expression before ',' token
../Engine/EngineCommon/CEGUICommonFileDialog.h:212: error: expected primary-expression before '>' token
../Engine/EngineCommon/CEGUICommonFileDialog.h:212: error: missing template arguments before "hashMapIterator"
../Engine/EngineCommon/CEGUICommonFileDialog.h:212: error: expected `;' before "hashMapIterator"
../Engine/EngineCommon/CEGUICommonFileDialog.h:213: error: `hashMapIterator' undeclared (first use this function)
../Engine/EngineCommon/CEGUICommonFileDialog.h: At global scope:
../Engine/EngineCommon/CEGUICommonFileDialog.h:230: error: variable or field `deleteAllEntriesFromHashMap' declared void
../Engine/EngineCommon/CEGUICommonFileDialog.h:230: error: template declaration of `int CEGUI::deleteAllEntriesFromHashMap'
../Engine/EngineCommon/CEGUICommonFileDialog.h:230: error: `hash_map' was not declared in this scope
../Engine/EngineCommon/CEGUICommonFileDialog.h:230: error: expected primary-expression before ',' token
../Engine/EngineCommon/CEGUICommonFileDialog.h:230: error: expected primary-expression before '>' token
../Engine/EngineCommon/CEGUICommonFileDialog.h:230: error: `hashMap' was not declared in this scope
../Engine/EngineCommon/CEGUICommonFileDialog.h:231: confused by earlier errors, bailing out
make[1]: *** [obj/Debug/WinMain.o] Error 1
make: *** [EngineTest] Error 2