# make
make all-recursive
make[1]: Entering directory `/usr/src/HMM/OPENSYNC/opensync-svn/evolution2'
Making all in src
make[2]: Entering directory `/usr/src/HMM/OPENSYNC/opensync-svn/evolution2/src'
if /bin/sh ../libtool --tag=CC --mode=compile gcc -DHAVE_CONFIG_H -I. -I. -I.. -I/usr/include/glib-2.0 -I/usr/lib/glib-2.0/include -I/usr/local/include/opensync-1.0 -I/usr/include/evolution-data-server-1.0 -Wall -Werror -Wno-return-type -g -O2 -MT evolution2_sync.lo -MD -MP -MF ".deps/evolution2_sync.Tpo" -c -o evolution2_sync.lo evolution2_sync.c; \
then mv -f ".deps/evolution2_sync.Tpo" ".deps/evolution2_sync.Plo"; else rm -f ".deps/evolution2_sync.Tpo"; exit 1; fi
gcc -DHAVE_CONFIG_H -I. -I. -I.. -I/usr/include/glib-2.0 -I/usr/lib/glib-2.0/include -I/usr/local/include/opensync-1.0 -I/usr/include/evolution-data-server-1.0 -Wall -Werror -Wno-return-type -g -O2 -MT evolution2_sync.lo -MD -MP -MF .deps/evolution2_sync.Tpo -c evolution2_sync.c -fPIC -DPIC -o .libs/evolution2_sync.o
In file included from /usr/include/evolution-data-server-1.0/libecal/e-cal.h:27,
from evolution2_sync.h:7,
from evolution2_sync.c:21:
/usr/include/evolution-data-server-1.0/libedataserver/e-source-list.h:26:25: error: libxml/tree.h: No such file or directory
/usr/include/evolution-data-server-1.0/libedataserver/e-source-list.h:27:32: error: gconf/gconf-client.h: No such file or directory
In file included from /usr/include/evolution-data-server-1.0/libedataserver/e-source-group.h:42,
from /usr/include/evolution-data-server-1.0/libedataserver/e-source-list.h:29,
from /usr/include/evolution-data-server-1.0/libecal/e-cal.h:27,
from evolution2_sync.h:7,
from evolution2_sync.c:21:
/usr/include/evolution-data-server-1.0/libedataserver/e-source.h:64: error: expected ')' before 'node'
/usr/include/evolution-data-server-1.0/libedataserver/e-source.h:72: error: expected declaration specifiers or '...' before 'xmlNodePtr'
/usr/include/evolution-data-server-1.0/libedataserver/e-source.h:75: error: expected ')' before 'node'
/usr/include/evolution-data-server-1.0/libedataserver/e-source.h:103: error: expected declaration specifiers or '...' before 'xmlNodePtr'
In file included from /usr/include/evolution-data-server-1.0/libedataserver/e-source-list.h:29,
from /usr/include/evolution-data-server-1.0/libecal/e-cal.h:27,
from evolution2_sync.h:7,
from evolution2_sync.c:21:
/usr/include/evolution-data-server-1.0/libedataserver/e-source-group.h:67: error: expected ')' before 'doc'
/usr/include/evolution-data-server-1.0/libedataserver/e-source-group.h:73: error: expected declaration specifiers or '...' before 'xmlDocPtr'
/usr/include/evolution-data-server-1.0/libedataserver/e-source-group.h:76: error: expected ')' before 'doc'
In file included from /usr/include/evolution-data-server-1.0/libecal/e-cal.h:27,
from evolution2_sync.h:7,
from evolution2_sync.c:21:
/usr/include/evolution-data-server-1.0/libedataserver/e-source-list.h:65: error: expected ')' before '*' token
In file included from /usr/include/evolution-data-server-1.0/libecal/e-cal-view.h:25,
from /usr/include/evolution-data-server-1.0/libecal/e-cal.h:31,
from evolution2_sync.h:7,
from evolution2_sync.c:21:
/usr/include/evolution-data-server-1.0/libecal/Evolution-DataServer-Calendar.h:9:31: error: orbit/orbit-types.h: No such file or directory
/usr/include/evolution-data-server-1.0/libecal/Evolution-DataServer-Calendar.h:17:27: error: bonobo/Bonobo.h: No such file or directory
In file included from /usr/include/evolution-data-server-1.0/libecal/e-cal-view.h:25,
from /usr/include/evolution-data-server-1.0/libecal/e-cal.h:31,
from evolution2_sync.h:7,
from evolution2_sync.c:21:
/usr/include/evolution-data-server-1.0/libecal/Evolution-DataServer-Calendar.h:20: error: expected '=', ',', ';', 'asm' or '__attribute__' before 'GNOME_Evolution_Calendar_CalObj'
/usr/include/evolution-data-server-1.0/libecal/Evolution-DataServer-Calendar.h:97: error: expected specifier-qualifier-list before 'CORBA_unsigned_long'
/usr/include/evolution-data-server-1.0/libecal/Evolution-DataServer-Calendar.h:395: error: expected '=', ',', ';', 'asm' or '__attribute__' before 'GNOME_Evolution_Calendar_CalObjUID'
/usr/include/evolution-data-server-1.0/libecal/Evolution-DataServer-Calendar.h:441: error: expected '=', ',', ';', 'asm' or '__attribute__' before 'GNOME_Evolution_Calendar_CalRecurID'
/usr/include/evolution-data-server-1.0/libecal/Evolution-DataServer-Calendar.h:816: error: expected '=', ',', ';', 'asm' or '__attribute__' before 'GNOME_Evolution_Calendar_CalTimezoneObj'
/usr/include/evolution-data-server-1.0/libecal/Evolution-DataServer-Calendar.h:862: error: expected '=', ',', ';', 'asm' or '__attribute__' before 'GNOME_Evolution_Calendar_CalTimezoneObjUID'
/usr/include/evolution-data-server-1.0/libecal/Evolution-DataServer-Calendar.h:908: error: expected '=', ',', ';', 'asm' or '__attribute__' before 'GNOME_Evolution_Calendar_CalAlarmUID'
/usr/include/evolution-data-server-1.0/libecal/Evolution-DataServer-Calendar.h:954: error: expected '=', ',', ';', 'asm' or '__attribute__' before 'GNOME_Evolution_Calendar_CalObjType'
/usr/include/evolution-data-server-1.0/libecal/Evolution-DataServer-Calendar.h:1016: error: expected '=', ',', ';', 'asm' or '__attribute__' before 'GNOME_Evolution_Calendar_CalObjModType'
/usr/include/evolution-data-server-1.0/libecal/Evolution-DataServer-Calendar.h:1078: error: expected '=', ',', ';', 'asm' or '__attribute__' before 'GNOME_Evolution_Calendar_CalMode'
/usr/include/evolution-data-server-1.0/libecal/Evolution-DataServer-Calendar.h:1136: error: expected '=', ',', ';', 'asm' or '__attribute__' before 'GNOME_Evolution_Calendar_CalObjChangeType'
/usr/include/evolution-data-server-1.0/libecal/Evolution-DataServer-Calendar.h:1194: error: expected '=', ',', ';', 'asm' or '__attribute__' before 'GNOME_Evolution_Calendar_Time_t'
/usr/include/evolution-data-server-1.0/libecal/Evolution-DataServer-Calendar.h:1242: error: expected specifier-qualifier-list before 'GNOME_Evolution_Calendar_CalObjUID'
/usr/include/evolution-data-server-1.0/libecal/Evolution-DataServer-Calendar.h:1321: error: expected specifier-qualifier-list before 'CORBA_unsigned_long'
/usr/include/evolution-data-server-1.0/libecal/Evolution-DataServer-Calendar.h:1417: error: expected specifier-qualifier-list before 'GNOME_Evolution_Calendar_CalObj'
/usr/include/evolution-data-server-1.0/libecal/Evolution-DataServer-Calendar.h:1495: error: expected specifier-qualifier-list before 'CORBA_unsigned_long'
/usr/include/evolution-data-server-1.0/libecal/Evolution-DataServer-Calendar.h:1589: error: expected '=', ',', ';', 'asm' or '__attribute__' before 'GNOME_Evolution_Calendar_User'
/usr/include/evolution-data-server-1.0/libecal/Evolution-DataServer-Calendar.h:1904: error: expected '=', ',', ';', 'asm' or '__attribute__' before 'GNOME_Evolution_Calendar_CalView'
/usr/include/evolution-data-server-1.0/libecal/Evolution-DataServer-Calendar.h:1905: error: expected '=', ',', ';', 'asm' or '__attribute__' before 'GNOME_Evolution_Calendar_CalView__classid'
/usr/include/evolution-data-server-1.0/libecal/Evolution-DataServer-Calendar.h:1949: error: expected '=', ',', ';', 'asm' or '__attribute__' before 'GNOME_Evolution_Calendar_CalViewListener'
/usr/include/evolution-data-server-1.0/libecal/Evolution-DataServer-Calendar.h:1950: error: expected '=', ',', ';', 'asm' or '__attribute__' before 'GNOME_Evolution_Calendar_CalViewListener__classid'
/usr/include/evolution-data-server-1.0/libecal/Evolution-DataServer-Calendar.h:1994: error: expected '=', ',', ';', 'asm' or '__attribute__' before 'GNOME_Evolution_Calendar_Cal'
/usr/include/evolution-data-server-1.0/libecal/Evolution-DataServer-Calendar.h:1995: error: expected '=', ',', ';', 'asm' or '__attribute__' before 'GNOME_Evolution_Calendar_Cal__classid'
/usr/include/evolution-data-server-1.0/libecal/Evolution-DataServer-Calendar.h:2139: error: expected '=', ',', ';', 'asm' or '__attribute__' before 'GNOME_Evolution_Calendar_CalListener'
/usr/include/evolution-data-server-1.0/libecal/Evolution-DataServer-Calendar.h:2140: error: expected '=', ',', ';', 'asm' or '__attribute__' before 'GNOME_Evolution_Calendar_CalListener__classid'
/usr/include/evolution-data-server-1.0/libecal/Evolution-DataServer-Calendar.h:2230: error: expected '=', ',', ';', 'asm' or '__attribute__' before 'GNOME_Evolution_Calendar_CalFactory'
/usr/include/evolution-data-server-1.0/libecal/Evolution-DataServer-Calendar.h:2231: error: expected '=', ',', ';', 'asm' or '__attribute__' before 'GNOME_Evolution_Calendar_CalFactory__classid'
/usr/include/evolution-data-server-1.0/libecal/Evolution-DataServer-Calendar.h:2427: error: expected ')' before '_servant'
cc1: warnings being treated as errors
/usr/include/evolution-data-server-1.0/libecal/Evolution-DataServer-Calendar.h:2428: warning: no semicolon at end of struct or union
/usr/include/evolution-data-server-1.0/libecal/Evolution-DataServer-Calendar.h:2430: error: expected specifier-qualifier-list before 'PortableServer_ServantBase__epv'
/usr/include/evolution-data-server-1.0/libecal/Evolution-DataServer-Calendar.h:2438: error: expected ')' before 'servant'
/usr/include/evolution-data-server-1.0/libecal/Evolution-DataServer-Calendar.h:2439: error: expected ')' before 'servant'
/usr/include/evolution-data-server-1.0/libecal/Evolution-DataServer-Calendar.h:2445: error: expected ')' before '_servant'
/usr/include/evolution-data-server-1.0/libecal/Evolution-DataServer-Calendar.h:2446: error: expected ';' before 'void'
/usr/include/evolution-data-server-1.0/libecal/Evolution-DataServer-Calendar.h:2452: error: expected specifier-qualifier-list before 'PortableServer_ServantBase__epv'
/usr/include/evolution-data-server-1.0/libecal/Evolution-DataServer-Calendar.h:2460: error: expected ')' before 'servant'
/usr/include/evolution-data-server-1.0/libecal/Evolution-DataServer-Calendar.h:2461: error: expected ')' before 'servant'
/usr/include/evolution-data-server-1.0/libecal/Evolution-DataServer-Calendar.h:2467: error: expected specifier-qualifier-list before 'CORBA_string'
/usr/include/evolution-data-server-1.0/libecal/Evolution-DataServer-Calendar.h:2493: error: expected specifier-qualifier-list before 'PortableServer_ServantBase__epv'
/usr/include/evolution-data-server-1.0/libecal/Evolution-DataServer-Calendar.h:2501: error: expected ')' before 'servant'
/usr/include/evolution-data-server-1.0/libecal/Evolution-DataServer-Calendar.h:2502: error: expected ')' before 'servant'
/usr/include/evolution-data-server-1.0/libecal/Evolution-DataServer-Calendar.h:2508: error: expected ')' before '_servant'
/usr/include/evolution-data-server-1.0/libecal/Evolution-DataServer-Calendar.h:2509: error: expected ';' before 'void'
/usr/include/evolution-data-server-1.0/libecal/Evolution-DataServer-Calendar.h:2535: error: expected specifier-qualifier-list before 'PortableServer_ServantBase__epv'
/usr/include/evolution-data-server-1.0/libecal/Evolution-DataServer-Calendar.h:2543: error: expected ')' before 'servant'
/usr/include/evolution-data-server-1.0/libecal/Evolution-DataServer-Calendar.h:2544: error: expected ')' before 'servant'
/usr/include/evolution-data-server-1.0/libecal/Evolution-DataServer-Calendar.h:2550: error: expected specifier-qualifier-list before 'GNOME_Evolution_Calendar_Cal'
/usr/include/evolution-data-server-1.0/libecal/Evolution-DataServer-Calendar.h:2553: error: expected specifier-qualifier-list before 'PortableServer_ServantBase__epv'
/usr/include/evolution-data-server-1.0/libecal/Evolution-DataServer-Calendar.h:2561: error: expected ')' before 'servant'
/usr/include/evolution-data-server-1.0/libecal/Evolution-DataServer-Calendar.h:2562: error: expected ')' before 'servant'
/usr/include/evolution-data-server-1.0/libecal/Evolution-DataServer-Calendar.h:2566: error: expected declaration specifiers or '...' before 'CORBA_Context'
/usr/include/evolution-data-server-1.0/libecal/Evolution-DataServer-Calendar.h:2566: error: expected declaration specifiers or '...' before 'CORBA_Environment'
/usr/include/evolution-data-server-1.0/libecal/Evolution-DataServer-Calendar.h:2566: error: expected ')' before '_servant'
/usr/include/evolution-data-server-1.0/libecal/Evolution-DataServer-Calendar.h:2567: error: expected declaration specifiers or '...' before 'CORBA_Context'
/usr/include/evolution-data-server-1.0/libecal/Evolution-DataServer-Calendar.h:2567: error: expected declaration specifiers or '...' before 'CORBA_Environment'
/usr/include/evolution-data-server-1.0/libecal/Evolution-DataServer-Calendar.h:2567: error: expected ')' before '_servant'
/usr/include/evolution-data-server-1.0/libecal/Evolution-DataServer-Calendar.h:2568: error: expected declaration specifiers or '...' before 'CORBA_Context'
/usr/include/evolution-data-server-1.0/libecal/Evolution-DataServer-Calendar.h:2568: error: expected declaration specifiers or '...' before 'CORBA_Environment'
/usr/include/evolution-data-server-1.0/libecal/Evolution-DataServer-Calendar.h:2568: error: expected ')' before '_servant'
/usr/include/evolution-data-server-1.0/libecal/Evolution-DataServer-Calendar.h:2569: error: expected declaration specifiers or '...' before 'CORBA_Context'
/usr/include/evolution-data-server-1.0/libecal/Evolution-DataServer-Calendar.h:2569: error: expected declaration specifiers or '...' before 'CORBA_Environment'
/usr/include/evolution-data-server-1.0/libecal/Evolution-DataServer-Calendar.h:2569: error: expected ')' before '_servant'
/usr/include/evolution-data-server-1.0/libecal/Evolution-DataServer-Calendar.h:2570: error: expected declaration specifiers or '...' before 'CORBA_Context'
/usr/include/evolution-data-server-1.0/libecal/Evolution-DataServer-Calendar.h:2570: error: expected declaration specifiers or '...' before 'CORBA_Environment'
/usr/include/evolution-data-server-1.0/libecal/Evolution-DataServer-Calendar.h:2570: error: expected ')' before '_servant'
/usr/include/evolution-data-server-1.0/libecal/Evolution-DataServer-Calendar.h:2571: error: expected declaration specifiers or '...' before 'CORBA_Context'
/usr/include/evolution-data-server-1.0/libecal/Evolution-DataServer-Calendar.h:2571: error: expected declaration specifiers or '...' before 'CORBA_Environment'
/usr/include/evolution-data-server-1.0/libecal/Evolution-DataServer-Calendar.h:2571: error: expected ')' before '_servant'
/usr/include/evolution-data-server-1.0/libecal/Evolution-DataServer-Calendar.h:2572: error: expected declaration specifiers or '...' before 'CORBA_Context'
/usr/include/evolution-data-server-1.0/libecal/Evolution-DataServer-Calendar.h:2572: error: expected declaration specifiers or '...' before 'CORBA_Environment'
/usr/include/evolution-data-server-1.0/libecal/Evolution-DataServer-Calendar.h:2572: error: expected declaration specifiers or '...' before 'CORBA_string'
/usr/include/evolution-data-server-1.0/libecal/Evolution-DataServer-Calendar.h:2573: error: expected declaration specifiers or '...' before 'CORBA_Context'
/usr/include/evolution-data-server-1.0/libecal/Evolution-DataServer-Calendar.h:2573: error: expected declaration specifiers or '...' before 'CORBA_Environment'
/usr/include/evolution-data-server-1.0/libecal/Evolution-DataServer-Calendar.h:2573: error: expected ')' before '_servant'
/usr/include/evolution-data-server-1.0/libecal/Evolution-DataServer-Calendar.h:2574: error: expected declaration specifiers or '...' before 'CORBA_Context'
/usr/include/evolution-data-server-1.0/libecal/Evolution-DataServer-Calendar.h:2574: error: expected declaration specifiers or '...' before 'CORBA_Environment'
/usr/include/evolution-data-server-1.0/libecal/Evolution-DataServer-Calendar.h:2574: error: expected ')' before '_servant'
/usr/include/evolution-data-server-1.0/libecal/Evolution-DataServer-Calendar.h:2575: error: expected declaration specifiers or '...' before 'CORBA_Context'
/usr/include/evolution-data-server-1.0/libecal/Evolution-DataServer-Calendar.h:2575: error: expected declaration specifiers or '...' before 'CORBA_Environment'
/usr/include/evolution-data-server-1.0/libecal/Evolution-DataServer-Calendar.h:2575: error: expected ')' before '_servant'
/usr/include/evolution-data-server-1.0/libecal/Evolution-DataServer-Calendar.h:2576: error: expected declaration specifiers or '...' before 'CORBA_Context'
/usr/include/evolution-data-server-1.0/libecal/Evolution-DataServer-Calendar.h:2576: error: expected declaration specifiers or '...' before 'CORBA_Environment'
/usr/include/evolution-data-server-1.0/libecal/Evolution-DataServer-Calendar.h:2576: error: expected ')' before '_servant'
/usr/include/evolution-data-server-1.0/libecal/Evolution-DataServer-Calendar.h:2577: error: expected declaration specifiers or '...' before 'CORBA_Context'
/usr/include/evolution-data-server-1.0/libecal/Evolution-DataServer-Calendar.h:2577: error: expected declaration specifiers or '...' before 'CORBA_Environment'
/usr/include/evolution-data-server-1.0/libecal/Evolution-DataServer-Calendar.h:2577: error: expected ')' before '_servant'
/usr/include/evolution-data-server-1.0/libecal/Evolution-DataServer-Calendar.h:2578: error: expected declaration specifiers or '...' before 'CORBA_Context'
/usr/include/evolution-data-server-1.0/libecal/Evolution-DataServer-Calendar.h:2578: error: expected declaration specifiers or '...' before 'CORBA_Environment'
/usr/include/evolution-data-server-1.0/libecal/Evolution-DataServer-Calendar.h:2578: error: expected ')' before '_servant'
/usr/include/evolution-data-server-1.0/libecal/Evolution-DataServer-Calendar.h:2579: error: expected declaration specifiers or '...' before 'CORBA_Context'
/usr/include/evolution-data-server-1.0/libecal/Evolution-DataServer-Calendar.h:2579: error: expected declaration specifiers or '...' before 'CORBA_Environment'
/usr/include/evolution-data-server-1.0/libecal/Evolution-DataServer-Calendar.h:2579: error: expected ')' before '_servant'
/usr/include/evolution-data-server-1.0/libecal/Evolution-DataServer-Calendar.h:2580: error: expected declaration specifiers or '...' before 'CORBA_Context'
/usr/include/evolution-data-server-1.0/libecal/Evolution-DataServer-Calendar.h:2580: error: expected declaration specifiers or '...' before 'CORBA_Environment'
/usr/include/evolution-data-server-1.0/libecal/Evolution-DataServer-Calendar.h:2580: error: expected ')' before '_servant'
/usr/include/evolution-data-server-1.0/libecal/Evolution-DataServer-Calendar.h:2581: error: expected declaration specifiers or '...' before 'CORBA_Context'
/usr/include/evolution-data-server-1.0/libecal/Evolution-DataServer-Calendar.h:2581: error: expected declaration specifiers or '...' before 'CORBA_Environment'
/usr/include/evolution-data-server-1.0/libecal/Evolution-DataServer-Calendar.h:2581: error: expected ')' before '_servant'
/usr/include/evolution-data-server-1.0/libecal/Evolution-DataServer-Calendar.h:2582: error: expected declaration specifiers or '...' before 'CORBA_Context'
/usr/include/evolution-data-server-1.0/libecal/Evolution-DataServer-Calendar.h:2582: error: expected declaration specifiers or '...' before 'CORBA_Environment'
/usr/include/evolution-data-server-1.0/libecal/Evolution-DataServer-Calendar.h:2582: error: expected ')' before '_servant'
/usr/include/evolution-data-server-1.0/libecal/Evolution-DataServer-Calendar.h:2583: error: expected declaration specifiers or '...' before 'CORBA_Context'
/usr/include/evolution-data-server-1.0/libecal/Evolution-DataServer-Calendar.h:2583: error: expected declaration specifiers or '...' before 'CORBA_Environment'
/usr/include/evolution-data-server-1.0/libecal/Evolution-DataServer-Calendar.h:2583: error: expected ')' before '_servant'
/usr/include/evolution-data-server-1.0/libecal/Evolution-DataServer-Calendar.h:2584: error: expected declaration specifiers or '...' before 'CORBA_Context'
/usr/include/evolution-data-server-1.0/libecal/Evolution-DataServer-Calendar.h:2584: error: expected declaration specifiers or '...' before 'CORBA_Environment'
/usr/include/evolution-data-server-1.0/libecal/Evolution-DataServer-Calendar.h:2584: error: expected ')' before '_servant'
/usr/include/evolution-data-server-1.0/libecal/Evolution-DataServer-Calendar.h:2585: error: expected declaration specifiers or '...' before 'CORBA_Context'
/usr/include/evolution-data-server-1.0/libecal/Evolution-DataServer-Calendar.h:2585: error: expected declaration specifiers or '...' before 'CORBA_Environment'
/usr/include/evolution-data-server-1.0/libecal/Evolution-DataServer-Calendar.h:2585: error: expected ')' before '_servant'
/usr/include/evolution-data-server-1.0/libecal/Evolution-DataServer-Calendar.h:2586: error: expected declaration specifiers or '...' before 'CORBA_Context'
/usr/include/evolution-data-server-1.0/libecal/Evolution-DataServer-Calendar.h:2586: error: expected declaration specifiers or '...' before 'CORBA_Environment'
/usr/include/evolution-data-server-1.0/libecal/Evolution-DataServer-Calendar.h:2586: error: expected ')' before '_servant'
/usr/include/evolution-data-server-1.0/libecal/Evolution-DataServer-Calendar.h:2587: error: expected declaration specifiers or '...' before 'CORBA_Context'
/usr/include/evolution-data-server-1.0/libecal/Evolution-DataServer-Calendar.h:2587: error: expected declaration specifiers or '...' before 'CORBA_Environment'
/usr/include/evolution-data-server-1.0/libecal/Evolution-DataServer-Calendar.h:2587: error: expected ')' before '_servant'
/usr/include/evolution-data-server-1.0/libecal/Evolution-DataServer-Calendar.h:2588: error: expected declaration specifiers or '...' before 'CORBA_Context'
/usr/include/evolution-data-server-1.0/libecal/Evolution-DataServer-Calendar.h:2588: error: expected declaration specifiers or '...' before 'CORBA_Environment'
/usr/include/evolution-data-server-1.0/libecal/Evolution-DataServer-Calendar.h:2588: error: expected ')' before '_servant'
/usr/include/evolution-data-server-1.0/libecal/Evolution-DataServer-Calendar.h:2589: error: expected declaration specifiers or '...' before 'CORBA_Context'
/usr/include/evolution-data-server-1.0/libecal/Evolution-DataServer-Calendar.h:2589: error: expected declaration specifiers or '...' before 'CORBA_Environment'
/usr/include/evolution-data-server-1.0/libecal/Evolution-DataServer-Calendar.h:2589: error: expected ')' before '_servant'
/usr/include/evolution-data-server-1.0/libecal/Evolution-DataServer-Calendar.h:2590: error: expected declaration specifiers or '...' before 'CORBA_Context'
/usr/include/evolution-data-server-1.0/libecal/Evolution-DataServer-Calendar.h:2590: error: expected declaration specifiers or '...' before 'CORBA_Environment'
/usr/include/evolution-data-server-1.0/libecal/Evolution-DataServer-Calendar.h:2590: error: expected ')' before '_servant'
/usr/include/evolution-data-server-1.0/libecal/Evolution-DataServer-Calendar.h:2591: error: expected declaration specifiers or '...' before 'CORBA_Context'
/usr/include/evolution-data-server-1.0/libecal/Evolution-DataServer-Calendar.h:2591: error: expected declaration specifiers or '...' before 'CORBA_Environment'
/usr/include/evolution-data-server-1.0/libecal/Evolution-DataServer-Calendar.h:2591: error: expected ')' before '_servant'
/usr/include/evolution-data-server-1.0/libecal/Evolution-DataServer-Calendar.h:2592: error: expected declaration specifiers or '...' before 'CORBA_Context'
/usr/include/evolution-data-server-1.0/libecal/Evolution-DataServer-Calendar.h:2592: error: expected declaration specifiers or '...' before 'CORBA_Environment'
/usr/include/evolution-data-server-1.0/libecal/Evolution-DataServer-Calendar.h:2592: error: expected ')' before '_servant'
/usr/include/evolution-data-server-1.0/libecal/Evolution-DataServer-Calendar.h:2593: error: expected declaration specifiers or '...' before 'CORBA_Context'
/usr/include/evolution-data-server-1.0/libecal/Evolution-DataServer-Calendar.h:2593: error: expected declaration specifiers or '...' before 'CORBA_Environment'
/usr/include/evolution-data-server-1.0/libecal/Evolution-DataServer-Calendar.h:2593: error: expected ')' before '_servant'
/usr/include/evolution-data-server-1.0/libecal/Evolution-DataServer-Calendar.h:2594: error: expected declaration specifiers or '...' before 'CORBA_Context'
/usr/include/evolution-data-server-1.0/libecal/Evolution-DataServer-Calendar.h:2594: error: expected declaration specifiers or '...' before 'CORBA_Environment'
/usr/include/evolution-data-server-1.0/libecal/Evolution-DataServer-Calendar.h:2594: error: expected ')' before '_servant'
/usr/include/evolution-data-server-1.0/libecal/Evolution-DataServer-Calendar.h:2595: error: expected declaration specifiers or '...' before 'CORBA_Context'
/usr/include/evolution-data-server-1.0/libecal/Evolution-DataServer-Calendar.h:2595: error: expected declaration specifiers or '...' before 'CORBA_Environment'
/usr/include/evolution-data-server-1.0/libecal/Evolution-DataServer-Calendar.h:2595: error: expected ')' before '_servant'
/usr/include/evolution-data-server-1.0/libecal/Evolution-DataServer-Calendar.h:2596: error: expected declaration specifiers or '...' before 'CORBA_Context'
/usr/include/evolution-data-server-1.0/libecal/Evolution-DataServer-Calendar.h:2596: error: expected declaration specifiers or '...' before 'CORBA_Environment'
/usr/include/evolution-data-server-1.0/libecal/Evolution-DataServer-Calendar.h:2596: error: expected ')' before '_servant'
/usr/include/evolution-data-server-1.0/libecal/Evolution-DataServer-Calendar.h:2597: error: expected declaration specifiers or '...' before 'CORBA_Context'
/usr/include/evolution-data-server-1.0/libecal/Evolution-DataServer-Calendar.h:2597: error: expected declaration specifiers or '...' before 'CORBA_Environment'
/usr/include/evolution-data-server-1.0/libecal/Evolution-DataServer-Calendar.h:2597: error: expected ')' before '_servant'
/usr/include/evolution-data-server-1.0/libecal/Evolution-DataServer-Calendar.h:2598: error: expected declaration specifiers or '...' before 'CORBA_Context'
/usr/include/evolution-data-server-1.0/libecal/Evolution-DataServer-Calendar.h:2598: error: expected declaration specifiers or '...' before 'CORBA_Environment'
/usr/include/evolution-data-server-1.0/libecal/Evolution-DataServer-Calendar.h:2598: error: expected ')' before '_servant'
/usr/include/evolution-data-server-1.0/libecal/Evolution-DataServer-Calendar.h:2599: error: expected declaration specifiers or '...' before 'CORBA_Context'
/usr/include/evolution-data-server-1.0/libecal/Evolution-DataServer-Calendar.h:2599: error: expected declaration specifiers or '...' before 'CORBA_Environment'
/usr/include/evolution-data-server-1.0/libecal/Evolution-DataServer-Calendar.h:2599: error: expected ')' before '_servant'
/usr/include/evolution-data-server-1.0/libecal/Evolution-DataServer-Calendar.h:2600: error: expected declaration specifiers or '...' before 'CORBA_Context'
/usr/include/evolution-data-server-1.0/libecal/Evolution-DataServer-Calendar.h:2600: error: expected declaration specifiers or '...' before 'CORBA_Environment'
/usr/include/evolution-data-server-1.0/libecal/Evolution-DataServer-Calendar.h:2600: error: expected ')' before '_servant'
/usr/include/evolution-data-server-1.0/libecal/Evolution-DataServer-Calendar.h:2601: error: expected declaration specifiers or '...' before 'CORBA_Context'
/usr/include/evolution-data-server-1.0/libecal/Evolution-DataServer-Calendar.h:2601: error: expected declaration specifiers or '...' before 'CORBA_Environment'
/usr/include/evolution-data-server-1.0/libecal/Evolution-DataServer-Calendar.h:2601: error: expected ')' before '_servant'
/usr/include/evolution-data-server-1.0/libecal/Evolution-DataServer-Calendar.h:2602: error: expected declaration specifiers or '...' before 'CORBA_Context'
/usr/include/evolution-data-server-1.0/libecal/Evolution-DataServer-Calendar.h:2602: error: expected declaration specifiers or '...' before 'CORBA_Environment'
/usr/include/evolution-data-server-1.0/libecal/Evolution-DataServer-Calendar.h:2602: error: expected ')' before '_servant'
/usr/include/evolution-data-server-1.0/libecal/Evolution-DataServer-Calendar.h:2603: error: expected declaration specifiers or '...' before 'CORBA_Context'
/usr/include/evolution-data-server-1.0/libecal/Evolution-DataServer-Calendar.h:2603: error: expected declaration specifiers or '...' before 'CORBA_Environment'
/usr/include/evolution-data-server-1.0/libecal/Evolution-DataServer-Calendar.h:2603: error: expected ')' before '_servant'
/usr/include/evolution-data-server-1.0/libecal/Evolution-DataServer-Calendar.h:2604: error: expected declaration specifiers or '...' before 'CORBA_Context'
/usr/include/evolution-data-server-1.0/libecal/Evolution-DataServer-Calendar.h:2604: error: expected declaration specifiers or '...' before 'CORBA_Environment'
/usr/include/evolution-data-server-1.0/libecal/Evolution-DataServer-Calendar.h:2604: error: expected ')' before '_servant'
/usr/include/evolution-data-server-1.0/libecal/Evolution-DataServer-Calendar.h:2605: error: expected declaration specifiers or '...' before 'CORBA_Context'
/usr/include/evolution-data-server-1.0/libecal/Evolution-DataServer-Calendar.h:2605: error: expected declaration specifiers or '...' before 'CORBA_Environment'
/usr/include/evolution-data-server-1.0/libecal/Evolution-DataServer-Calendar.h:2605: error: expected ')' before '_servant'
/usr/include/evolution-data-server-1.0/libecal/Evolution-DataServer-Calendar.h:2606: error: expected declaration specifiers or '...' before 'CORBA_Context'
/usr/include/evolution-data-server-1.0/libecal/Evolution-DataServer-Calendar.h:2606: error: expected declaration specifiers or '...' before 'CORBA_Environment'
/usr/include/evolution-data-server-1.0/libecal/Evolution-DataServer-Calendar.h:2606: error: expected ')' before '_servant'
/usr/include/evolution-data-server-1.0/libecal/Evolution-DataServer-Calendar.h:2607: error: expected declaration specifiers or '...' before 'CORBA_Context'
/usr/include/evolution-data-server-1.0/libecal/Evolution-DataServer-Calendar.h:2607: error: expected declaration specifiers or '...' before 'CORBA_Environment'
/usr/include/evolution-data-server-1.0/libecal/Evolution-DataServer-Calendar.h:2607: error: expected ')' before '_servant'
/usr/include/evolution-data-server-1.0/libecal/Evolution-DataServer-Calendar.h:2608: error: expected declaration specifiers or '...' before 'CORBA_Context'
/usr/include/evolution-data-server-1.0/libecal/Evolution-DataServer-Calendar.h:2608: error: expected declaration specifiers or '...' before 'CORBA_Environment'
/usr/include/evolution-data-server-1.0/libecal/Evolution-DataServer-Calendar.h:2608: error: expected ')' before '_servant'
/usr/include/evolution-data-server-1.0/libecal/Evolution-DataServer-Calendar.h:2609: error: expected declaration specifiers or '...' before 'CORBA_Context'
/usr/include/evolution-data-server-1.0/libecal/Evolution-DataServer-Calendar.h:2609: error: expected declaration specifiers or '...' before 'CORBA_Environment'
/usr/include/evolution-data-server-1.0/libecal/Evolution-DataServer-Calendar.h:2609: error: expected ')' before '_servant'
/usr/include/evolution-data-server-1.0/libecal/Evolution-DataServer-Calendar.h:2610: error: expected declaration specifiers or '...' before 'CORBA_Context'
/usr/include/evolution-data-server-1.0/libecal/Evolution-DataServer-Calendar.h:2610: error: expected declaration specifiers or '...' before 'CORBA_Environment'
/usr/include/evolution-data-server-1.0/libecal/Evolution-DataServer-Calendar.h:2610: error: expected ')' before '_servant'
/usr/include/evolution-data-server-1.0/libecal/Evolution-DataServer-Calendar.h:2611: error: expected declaration specifiers or '...' before 'CORBA_Context'
/usr/include/evolution-data-server-1.0/libecal/Evolution-DataServer-Calendar.h:2611: error: expected declaration specifiers or '...' before 'CORBA_Environment'
/usr/include/evolution-data-server-1.0/libecal/Evolution-DataServer-Calendar.h:2611: error: expected ')' before '_servant'
/usr/include/evolution-data-server-1.0/libecal/Evolution-DataServer-Calendar.h:2612: error: expected declaration specifiers or '...' before 'CORBA_Context'
/usr/include/evolution-data-server-1.0/libecal/Evolution-DataServer-Calendar.h:2612: error: expected declaration specifiers or '...' before 'CORBA_Environment'
/usr/include/evolution-data-server-1.0/libecal/Evolution-DataServer-Calendar.h:2612: error: expected ')' before '_servant'
/usr/include/evolution-data-server-1.0/libecal/Evolution-DataServer-Calendar.h:2613: error: expected declaration specifiers or '...' before 'CORBA_Context'
/usr/include/evolution-data-server-1.0/libecal/Evolution-DataServer-Calendar.h:2613: error: expected declaration specifiers or '...' before 'CORBA_Environment'
/usr/include/evolution-data-server-1.0/libecal/Evolution-DataServer-Calendar.h:2613: error: expected ')' before '_servant'
/usr/include/evolution-data-server-1.0/libecal/Evolution-DataServer-Calendar.h:2614: error: expected declaration specifiers or '...' before 'CORBA_Context'
/usr/include/evolution-data-server-1.0/libecal/Evolution-DataServer-Calendar.h:2614: error: expected declaration specifiers or '...' before 'CORBA_Environment'
/usr/include/evolution-data-server-1.0/libecal/Evolution-DataServer-Calendar.h:2614: error: expected ')' before '_servant'
/usr/include/evolution-data-server-1.0/libecal/Evolution-DataServer-Calendar.h:2615: error: expected declaration specifiers or '...' before 'CORBA_Context'
/usr/include/evolution-data-server-1.0/libecal/Evolution-DataServer-Calendar.h:2615: error: expected declaration specifiers or '...' before 'CORBA_Environment'
/usr/include/evolution-data-server-1.0/libecal/Evolution-DataServer-Calendar.h:2615: error: expected ')' before '_servant'
/usr/include/evolution-data-server-1.0/libecal/Evolution-DataServer-Calendar.h:2616: error: expected declaration specifiers or '...' before 'CORBA_Context'
/usr/include/evolution-data-server-1.0/libecal/Evolution-DataServer-Calendar.h:2616: error: expected declaration specifiers or '...' before 'CORBA_Environment'
/usr/include/evolution-data-server-1.0/libecal/Evolution-DataServer-Calendar.h:2616: error: expected ')' before '_servant'
/usr/include/evolution-data-server-1.0/libecal/Evolution-DataServer-Calendar.h:2617: error: expected declaration specifiers or '...' before 'CORBA_Context'
/usr/include/evolution-data-server-1.0/libecal/Evolution-DataServer-Calendar.h:2617: error: expected declaration specifiers or '...' before 'CORBA_Environment'
/usr/include/evolution-data-server-1.0/libecal/Evolution-DataServer-Calendar.h:2617: error: expected ')' before '_servant'
/usr/include/evolution-data-server-1.0/libecal/Evolution-DataServer-Calendar.h:2618: error: expected declaration specifiers or '...' before 'CORBA_Context'
/usr/include/evolution-data-server-1.0/libecal/Evolution-DataServer-Calendar.h:2618: error: expected declaration specifiers or '...' before 'CORBA_Environment'
/usr/include/evolution-data-server-1.0/libecal/Evolution-DataServer-Calendar.h:2618: error: expected ')' before '_servant'
/usr/include/evolution-data-server-1.0/libecal/Evolution-DataServer-Calendar.h:2619: error: expected declaration specifiers or '...' before 'CORBA_Context'
/usr/include/evolution-data-server-1.0/libecal/Evolution-DataServer-Calendar.h:2619: error: expected declaration specifiers or '...' before 'CORBA_Environment'
/usr/include/evolution-data-server-1.0/libecal/Evolution-DataServer-Calendar.h:2619: error: expected ')' before '_servant'
/usr/include/evolution-data-server-1.0/libecal/Evolution-DataServer-Calendar.h:2620: error: expected declaration specifiers or '...' before 'CORBA_Context'
/usr/include/evolution-data-server-1.0/libecal/Evolution-DataServer-Calendar.h:2620: error: expected declaration specifiers or '...' before 'CORBA_Environment'
/usr/include/evolution-data-server-1.0/libecal/Evolution-DataServer-Calendar.h:2620: error: expected ')' before '_servant'
/usr/include/evolution-data-server-1.0/libecal/Evolution-DataServer-Calendar.h:2621: error: expected declaration specifiers or '...' before 'CORBA_Context'
/usr/include/evolution-data-server-1.0/libecal/Evolution-DataServer-Calendar.h:2621: error: expected declaration specifiers or '...' before 'CORBA_Environment'
/usr/include/evolution-data-server-1.0/libecal/Evolution-DataServer-Calendar.h:2621: error: expected declaration specifiers or '...' before 'GNOME_Evolution_Calendar_Cal'
/usr/include/evolution-data-server-1.0/libecal/Evolution-DataServer-Calendar.h:2627: error: expected ')' before '_obj'
/usr/include/evolution-data-server-1.0/libecal/Evolution-DataServer-Calendar.h:2631: error: expected ')' before '_obj'
/usr/include/evolution-data-server-1.0/libecal/Evolution-DataServer-Calendar.h:2632: error: expected ')' before '_obj'
/usr/include/evolution-data-server-1.0/libecal/Evolution-DataServer-Calendar.h:2633: error: expected ')' before '_obj'
/usr/include/evolution-data-server-1.0/libecal/Evolution-DataServer-Calendar.h:2634: error: expected ')' before '_obj'
/usr/include/evolution-data-server-1.0/libecal/Evolution-DataServer-Calendar.h:2635: error: expected ')' before '_obj'
/usr/include/evolution-data-server-1.0/libecal/Evolution-DataServer-Calendar.h:2639: error: expected '=', ',', ';', 'asm' or '__attribute__' before 'GNOME_Evolution_Calendar_Cal__get_uri'
/usr/include/evolution-data-server-1.0/libecal/Evolution-DataServer-Calendar.h:2640: error: expected ')' before '_obj'
/usr/include/evolution-data-server-1.0/libecal/Evolution-DataServer-Calendar.h:2641: error: expected ')' before '_obj'
/usr/include/evolution-data-server-1.0/libecal/Evolution-DataServer-Calendar.h:2642: error: expected ')' before '_obj'
/usr/include/evolution-data-server-1.0/libecal/Evolution-DataServer-Calendar.h:2643: error: expected ')' before '_obj'
/usr/include/evolution-data-server-1.0/libecal/Evolution-DataServer-Calendar.h:2644: error: expected ')' before '_obj'
/usr/include/evolution-data-server-1.0/libecal/Evolution-DataServer-Calendar.h:2645: error: expected ')' before '_obj'
/usr/include/evolution-data-server-1.0/libecal/Evolution-DataServer-Calendar.h:2646: error: expected ')' before '_obj'
/usr/include/evolution-data-server-1.0/libecal/Evolution-DataServer-Calendar.h:2647: error: expected ')' before '_obj'
/usr/include/evolution-data-server-1.0/libecal/Evolution-DataServer-Calendar.h:2648: error: expected ')' before '_obj'
/usr/include/evolution-data-server-1.0/libecal/Evolution-DataServer-Calendar.h:2649: error: expected ')' before '_obj'
/usr/include/evolution-data-server-1.0/libecal/Evolution-DataServer-Calendar.h:2650: error: expected ')' before '_obj'
/usr/include/evolution-data-server-1.0/libecal/Evolution-DataServer-Calendar.h:2651: error: expected ')' before '_obj'
/usr/include/evolution-data-server-1.0/libecal/Evolution-DataServer-Calendar.h:2652: error: expected ')' before '_obj'
/usr/include/evolution-data-server-1.0/libecal/Evolution-DataServer-Calendar.h:2653: error: expected ')' before '_obj'
/usr/include/evolution-data-server-1.0/libecal/Evolution-DataServer-Calendar.h:2654: error: expected ')' before '_obj'
/usr/include/evolution-data-server-1.0/libecal/Evolution-DataServer-Calendar.h:2655: error: expected ')' before '_obj'
/usr/include/evolution-data-server-1.0/libecal/Evolution-DataServer-Calendar.h:2656: error: expected ')' before '_obj'
/usr/include/evolution-data-server-1.0/libecal/Evolution-DataServer-Calendar.h:2657: error: expected ')' before '_obj'
/usr/include/evolution-data-server-1.0/libecal/Evolution-DataServer-Calendar.h:2658: error: expected ')' before '_obj'
/usr/include/evolution-data-server-1.0/libecal/Evolution-DataServer-Calendar.h:2659: error: expected ')' before '_obj'
/usr/include/evolution-data-server-1.0/libecal/Evolution-DataServer-Calendar.h:2660: error: expected ')' before '_obj'
/usr/include/evolution-data-server-1.0/libecal/Evolution-DataServer-Calendar.h:2661: error: expected ')' before '_obj'
/usr/include/evolution-data-server-1.0/libecal/Evolution-DataServer-Calendar.h:2662: error: expected ')' before '_obj'
/usr/include/evolution-data-server-1.0/libecal/Evolution-DataServer-Calendar.h:2666: error: expected ')' before '_obj'
/usr/include/evolution-data-server-1.0/libecal/Evolution-DataServer-Calendar.h:2667: error: expected ')' before '_obj'
/usr/include/evolution-data-server-1.0/libecal/Evolution-DataServer-Calendar.h:2668: error: expected ')' before '_obj'
/usr/include/evolution-data-server-1.0/libecal/Evolution-DataServer-Calendar.h:2669: error: expected ')' before '_obj'
/usr/include/evolution-data-server-1.0/libecal/Evolution-DataServer-Calendar.h:2670: error: expected ')' before '_obj'
/usr/include/evolution-data-server-1.0/libecal/Evolution-DataServer-Calendar.h:2671: error: expected ')' before '_obj'
/usr/include/evolution-data-server-1.0/libecal/Evolution-DataServer-Calendar.h:2672: error: expected ')' before '_obj'
/usr/include/evolution-data-server-1.0/libecal/Evolution-DataServer-Calendar.h:2673: error: expected ')' before '_obj'
/usr/include/evolution-data-server-1.0/libecal/Evolution-DataServer-Calendar.h:2674: error: expected ')' before '_obj'
/usr/include/evolution-data-server-1.0/libecal/Evolution-DataServer-Calendar.h:2675: error: expected ')' before '_obj'
/usr/include/evolution-data-server-1.0/libecal/Evolution-DataServer-Calendar.h:2676: error: expected ')' before '_obj'
/usr/include/evolution-data-server-1.0/libecal/Evolution-DataServer-Calendar.h:2677: error: expected ')' before '_obj'
/usr/include/evolution-data-server-1.0/libecal/Evolution-DataServer-Calendar.h:2678: error: expected ')' before '_obj'
/usr/include/evolution-data-server-1.0/libecal/Evolution-DataServer-Calendar.h:2679: error: expected ')' before '_obj'
/usr/include/evolution-data-server-1.0/libecal/Evolution-DataServer-Calendar.h:2680: error: expected ')' before '_obj'
/usr/include/evolution-data-server-1.0/libecal/Evolution-DataServer-Calendar.h:2681: error: expected ')' before '_obj'
/usr/include/evolution-data-server-1.0/libecal/Evolution-DataServer-Calendar.h:2682: error: expected ')' before '_obj'
/usr/include/evolution-data-server-1.0/libecal/Evolution-DataServer-Calendar.h:2683: error: expected ')' before '_obj'
/usr/include/evolution-data-server-1.0/libecal/Evolution-DataServer-Calendar.h:2684: error: expected ')' before '_obj'
/usr/include/evolution-data-server-1.0/libecal/Evolution-DataServer-Calendar.h:2685: error: expected ')' before '_obj'
/usr/include/evolution-data-server-1.0/libecal/Evolution-DataServer-Calendar.h:2686: error: expected ')' before '_obj'
/usr/include/evolution-data-server-1.0/libecal/Evolution-DataServer-Calendar.h:2687: error: expected ')' before '_obj'
/usr/include/evolution-data-server-1.0/libecal/Evolution-DataServer-Calendar.h:2688: error: expected ')' before '_obj'
/usr/include/evolution-data-server-1.0/libecal/Evolution-DataServer-Calendar.h:2689: error: expected ')' before '_obj'
/usr/include/evolution-data-server-1.0/libecal/Evolution-DataServer-Calendar.h:2690: error: expected ')' before '_obj'
/usr/include/evolution-data-server-1.0/libecal/Evolution-DataServer-Calendar.h:2694: error: expected '=', ',', ';', 'asm' or '__attribute__' before 'GNOME_Evolution_Calendar_CalFactory_getCal'
/usr/include/evolution-data-server-1.0/libecal/Evolution-DataServer-Calendar.h:2695:44: error: orbit/orb-core/orbit-interface.h: No such file or directory
/usr/include/evolution-data-server-1.0/libecal/Evolution-DataServer-Calendar.h:2702: error: expected '=', ',', ';', 'asm' or '__attribute__' before 'GNOME_Evolution_Calendar_CalView__iinterface'
/usr/include/evolution-data-server-1.0/libecal/Evolution-DataServer-Calendar.h:2709: error: expected '=', ',', ';', 'asm' or '__attribute__' before 'GNOME_Evolution_Calendar_CalView__imethods'
/usr/include/evolution-data-server-1.0/libecal/Evolution-DataServer-Calendar.h:2715: error: expected '=', ',', ';', 'asm' or '__attribute__' before 'GNOME_Evolution_Calendar_CalViewListener__iinterface'
/usr/include/evolution-data-server-1.0/libecal/Evolution-DataServer-Calendar.h:2722: error: expected '=', ',', ';', 'asm' or '__attribute__' before 'GNOME_Evolution_Calendar_CalViewListener__imethods'
/usr/include/evolution-data-server-1.0/libecal/Evolution-DataServer-Calendar.h:2728: error: expected '=', ',', ';', 'asm' or '__attribute__' before 'GNOME_Evolution_Calendar_Cal__iinterface'
/usr/include/evolution-data-server-1.0/libecal/Evolution-DataServer-Calendar.h:2735: error: expected '=', ',', ';', 'asm' or '__attribute__' before 'GNOME_Evolution_Calendar_Cal__imethods'
/usr/include/evolution-data-server-1.0/libecal/Evolution-DataServer-Calendar.h:2741: error: expected '=', ',', ';', 'asm' or '__attribute__' before 'GNOME_Evolution_Calendar_CalListener__iinterface'
/usr/include/evolution-data-server-1.0/libecal/Evolution-DataServer-Calendar.h:2748: error: expected '=', ',', ';', 'asm' or '__attribute__' before 'GNOME_Evolution_Calendar_CalListener__imethods'
/usr/include/evolution-data-server-1.0/libecal/Evolution-DataServer-Calendar.h:2754: error: expected '=', ',', ';', 'asm' or '__attribute__' before 'GNOME_Evolution_Calendar_CalFactory__iinterface'
/usr/include/evolution-data-server-1.0/libecal/Evolution-DataServer-Calendar.h:2761: error: expected '=', ',', ';', 'asm' or '__attribute__' before 'GNOME_Evolution_Calendar_CalFactory__imethods'
/usr/include/evolution-data-server-1.0/libecal/Evolution-DataServer-Calendar.h:2767:25: error: orbit/orbit.h: No such file or directory
In file included from /usr/include/evolution-data-server-1.0/libecal/e-cal-view.h:27,
from /usr/include/evolution-data-server-1.0/libecal/e-cal.h:31,
from evolution2_sync.h:7,
from evolution2_sync.c:21:
/usr/include/evolution-data-server-1.0/libecal/e-cal-view-listener.h:24:34: error: bonobo/bonobo-object.h: No such file or directory
In file included from /usr/include/evolution-data-server-1.0/libecal/e-cal-view.h:27,
from /usr/include/evolution-data-server-1.0/libecal/e-cal.h:31,
from evolution2_sync.h:7,
from evolution2_sync.c:21:
/usr/include/evolution-data-server-1.0/libecal/e-cal-view-listener.h:42: error: expected specifier-qualifier-list before 'BonoboObject'
/usr/include/evolution-data-server-1.0/libecal/e-cal-view-listener.h:49: error: expected specifier-qualifier-list before 'BonoboObjectClass'
In file included from /usr/include/evolution-data-server-1.0/libecal/e-cal.h:31,
from evolution2_sync.h:7,
from evolution2_sync.c:21:
/usr/include/evolution-data-server-1.0/libecal/e-cal-view.h:62: error: expected ')' before 'corba_view'
In file included from /usr/include/evolution-data-server-1.0/libebook/e-book.h:17,
from evolution2_sync.h:8,
from evolution2_sync.c:21:
/usr/include/evolution-data-server-1.0/libebook/Evolution-DataServer-Addressbook.h:20: error: expected '=', ',', ';', 'asm' or '__attribute__' before 'GNOME_Evolution_Addressbook_ContactId'
/usr/include/evolution-data-server-1.0/libebook/Evolution-DataServer-Addressbook.h:69: error: expected '=', ',', ';', 'asm' or '__attribute__' before 'GNOME_Evolution_Addressbook_VCard'
/usr/include/evolution-data-server-1.0/libebook/Evolution-DataServer-Addressbook.h:742: error: expected specifier-qualifier-list before 'GNOME_Evolution_Addressbook_VCard'
/usr/include/evolution-data-server-1.0/libebook/Evolution-DataServer-Addressbook.h:825: error: expected specifier-qualifier-list before 'CORBA_unsigned_long'
/usr/include/evolution-data-server-1.0/libebook/Evolution-DataServer-Addressbook.h:991: error: expected '=', ',', ';', 'asm' or '__attribute__' before 'GNOME_Evolution_Addressbook_BookViewListener'
/usr/include/evolution-data-server-1.0/libebook/Evolution-DataServer-Addressbook.h:992: error: expected '=', ',', ';', 'asm' or '__attribute__' before 'GNOME_Evolution_Addressbook_BookViewListener__classid'
/usr/include/evolution-data-server-1.0/libebook/Evolution-DataServer-Addressbook.h:1039: error: expected '=', ',', ';', 'asm' or '__attribute__' before 'GNOME_Evolution_Addressbook_BookView'
/usr/include/evolution-data-server-1.0/libebook/Evolution-DataServer-Addressbook.h:1040: error: expected '=', ',', ';', 'asm' or '__attribute__' before 'GNOME_Evolution_Addressbook_BookView__classid'
/usr/include/evolution-data-server-1.0/libebook/Evolution-DataServer-Addressbook.h:1087: error: expected '=', ',', ';', 'asm' or '__attribute__' before 'GNOME_Evolution_Addressbook_Book'
/usr/include/evolution-data-server-1.0/libebook/Evolution-DataServer-Addressbook.h:1088: error: expected '=', ',', ';', 'asm' or '__attribute__' before 'GNOME_Evolution_Addressbook_Book__classid'
/usr/include/evolution-data-server-1.0/libebook/Evolution-DataServer-Addressbook.h:1135: error: expected '=', ',', ';', 'asm' or '__attribute__' before 'GNOME_Evolution_Addressbook_BookListener'
/usr/include/evolution-data-server-1.0/libebook/Evolution-DataServer-Addressbook.h:1136: error: expected '=', ',', ';', 'asm' or '__attribute__' before 'GNOME_Evolution_Addressbook_BookListener__classid'
/usr/include/evolution-data-server-1.0/libebook/Evolution-DataServer-Addressbook.h:1183: error: expected '=', ',', ';', 'asm' or '__attribute__' before 'GNOME_Evolution_Addressbook_BookFactory'
/usr/include/evolution-data-server-1.0/libebook/Evolution-DataServer-Addressbook.h:1184: error: expected '=', ',', ';', 'asm' or '__attribute__' before 'GNOME_Evolution_Addressbook_BookFactory__classid'
/usr/include/evolution-data-server-1.0/libebook/Evolution-DataServer-Addressbook.h:1286: error: expected ')' before '_servant'
/usr/include/evolution-data-server-1.0/libebook/Evolution-DataServer-Addressbook.h:1287: error: expected ';' before 'void'
/usr/include/evolution-data-server-1.0/libebook/Evolution-DataServer-Addressbook.h:1293: error: expected specifier-qualifier-list before 'PortableServer_ServantBase__epv'
/usr/include/evolution-data-server-1.0/libebook/Evolution-DataServer-Addressbook.h:1301: error: expected ')' before 'servant'
/usr/include/evolution-data-server-1.0/libebook/Evolution-DataServer-Addressbook.h:1302: error: expected ')' before 'servant'
/usr/include/evolution-data-server-1.0/libebook/Evolution-DataServer-Addressbook.h:1308: error: expected ')' before '_servant'
/usr/include/evolution-data-server-1.0/libebook/Evolution-DataServer-Addressbook.h:1309: error: expected ';' before 'void'
/usr/include/evolution-data-server-1.0/libebook/Evolution-DataServer-Addressbook.h:1313: error: expected specifier-qualifier-list before 'PortableServer_ServantBase__epv'
/usr/include/evolution-data-server-1.0/libebook/Evolution-DataServer-Addressbook.h:1321: error: expected ')' before 'servant'
/usr/include/evolution-data-server-1.0/libebook/Evolution-DataServer-Addressbook.h:1322: error: expected ')' before 'servant'
/usr/include/evolution-data-server-1.0/libebook/Evolution-DataServer-Addressbook.h:1328: error: expected ')' before '_servant'
/usr/include/evolution-data-server-1.0/libebook/Evolution-DataServer-Addressbook.h:1329: error: expected ';' before 'void'
/usr/include/evolution-data-server-1.0/libebook/Evolution-DataServer-Addressbook.h:1345: error: expected specifier-qualifier-list before 'PortableServer_ServantBase__epv'
/usr/include/evolution-data-server-1.0/libebook/Evolution-DataServer-Addressbook.h:1353: error: expected ')' before 'servant'
/usr/include/evolution-data-server-1.0/libebook/Evolution-DataServer-Addressbook.h:1354: error: expected ')' before 'servant'
/usr/include/evolution-data-server-1.0/libebook/Evolution-DataServer-Addressbook.h:1360: error: expected ')' before '_servant'
/usr/include/evolution-data-server-1.0/libebook/Evolution-DataServer-Addressbook.h:1361: error: expected ';' before 'void'
/usr/include/evolution-data-server-1.0/libebook/Evolution-DataServer-Addressbook.h:1376: error: expected specifier-qualifier-list before 'PortableServer_ServantBase__epv'
/usr/include/evolution-data-server-1.0/libebook/Evolution-DataServer-Addressbook.h:1384: error: expected ')' before 'servant'
/usr/include/evolution-data-server-1.0/libebook/Evolution-DataServer-Addressbook.h:1385: error: expected ')' before 'servant'
/usr/include/evolution-data-server-1.0/libebook/Evolution-DataServer-Addressbook.h:1391: error: expected specifier-qualifier-list before 'GNOME_Evolution_Addressbook_Book'
/usr/include/evolution-data-server-1.0/libebook/Evolution-DataServer-Addressbook.h:1394: error: expected specifier-qualifier-list before 'PortableServer_ServantBase__epv'
/usr/include/evolution-data-server-1.0/libebook/Evolution-DataServer-Addressbook.h:1402: error: expected ')' before 'servant'
/usr/include/evolution-data-server-1.0/libebook/Evolution-DataServer-Addressbook.h:1403: error: expected ')' before 'servant'
/usr/include/evolution-data-server-1.0/libebook/Evolution-DataServer-Addressbook.h:1407: error: expected declaration specifiers or '...' before 'CORBA_Context'
/usr/include/evolution-data-server-1.0/libebook/Evolution-DataServer-Addressbook.h:1407: error: expected declaration specifiers or '...' before 'CORBA_Environment'
/usr/include/evolution-data-server-1.0/libebook/Evolution-DataServer-Addressbook.h:1407: error: expected ')' before '_servant'
/usr/include/evolution-data-server-1.0/libebook/Evolution-DataServer-Addressbook.h:1408: error: expected declaration specifiers or '...' before 'CORBA_Context'
/usr/include/evolution-data-server-1.0/libebook/Evolution-DataServer-Addressbook.h:1408: error: expected declaration specifiers or '...' before 'CORBA_Environment'
/usr/include/evolution-data-server-1.0/libebook/Evolution-DataServer-Addressbook.h:1408: error: expected ')' before '_servant'
/usr/include/evolution-data-server-1.0/libebook/Evolution-DataServer-Addressbook.h:1409: error: expected declaration specifiers or '...' before 'CORBA_Context'
/usr/include/evolution-data-server-1.0/libebook/Evolution-DataServer-Addressbook.h:1409: error: expected declaration specifiers or '...' before 'CORBA_Environment'
/usr/include/evolution-data-server-1.0/libebook/Evolution-DataServer-Addressbook.h:1409: error: expected ')' before '_servant'
/usr/include/evolution-data-server-1.0/libebook/Evolution-DataServer-Addressbook.h:1410: error: expected declaration specifiers or '...' before 'CORBA_Context'
/usr/include/evolution-data-server-1.0/libebook/Evolution-DataServer-Addressbook.h:1410: error: expected declaration specifiers or '...' before 'CORBA_Environment'
/usr/include/evolution-data-server-1.0/libebook/Evolution-DataServer-Addressbook.h:1410: error: expected ')' before '_servant'
/usr/include/evolution-data-server-1.0/libebook/Evolution-DataServer-Addressbook.h:1411: error: expected declaration specifiers or '...' before 'CORBA_Context'
/usr/include/evolution-data-server-1.0/libebook/Evolution-DataServer-Addressbook.h:1411: error: expected declaration specifiers or '...' before 'CORBA_Environment'
/usr/include/evolution-data-server-1.0/libebook/Evolution-DataServer-Addressbook.h:1411: error: expected ')' before '_servant'
/usr/include/evolution-data-server-1.0/libebook/Evolution-DataServer-Addressbook.h:1412: error: expected declaration specifiers or '...' before 'CORBA_Context'
/usr/include/evolution-data-server-1.0/libebook/Evolution-DataServer-Addressbook.h:1412: error: expected declaration specifiers or '...' before 'CORBA_Environment'
/usr/include/evolution-data-server-1.0/libebook/Evolution-DataServer-Addressbook.h:1412: error: expected ')' before '_servant'
/usr/include/evolution-data-server-1.0/libebook/Evolution-DataServer-Addressbook.h:1413: error: expected declaration specifiers or '...' before 'CORBA_Context'
/usr/include/evolution-data-server-1.0/libebook/Evolution-DataServer-Addressbook.h:1413: error: expected declaration specifiers or '...' before 'CORBA_Environment'
/usr/include/evolution-data-server-1.0/libebook/Evolution-DataServer-Addressbook.h:1413: error: expected ')' before '_servant'
/usr/include/evolution-data-server-1.0/libebook/Evolution-DataServer-Addressbook.h:1414: error: expected declaration specifiers or '...' before 'CORBA_Context'
/usr/include/evolution-data-server-1.0/libebook/Evolution-DataServer-Addressbook.h:1414: error: expected declaration specifiers or '...' before 'CORBA_Environment'
/usr/include/evolution-data-server-1.0/libebook/Evolution-DataServer-Addressbook.h:1414: error: expected ')' before '_servant'
/usr/include/evolution-data-server-1.0/libebook/Evolution-DataServer-Addressbook.h:1415: error: expected declaration specifiers or '...' before 'CORBA_Context'
/usr/include/evolution-data-server-1.0/libebook/Evolution-DataServer-Addressbook.h:1415: error: expected declaration specifiers or '...' before 'CORBA_Environment'
/usr/include/evolution-data-server-1.0/libebook/Evolution-DataServer-Addressbook.h:1415: error: expected ')' before '_servant'
/usr/include/evolution-data-server-1.0/libebook/Evolution-DataServer-Addressbook.h:1416: error: expected declaration specifiers or '...' before 'CORBA_Context'
/usr/include/evolution-data-server-1.0/libebook/Evolution-DataServer-Addressbook.h:1416: error: expected declaration specifiers or '...' before 'CORBA_Environment'
/usr/include/evolution-data-server-1.0/libebook/Evolution-DataServer-Addressbook.h:1416: error: expected ')' before '_servant'
/usr/include/evolution-data-server-1.0/libebook/Evolution-DataServer-Addressbook.h:1417: error: expected declaration specifiers or '...' before 'CORBA_Context'
/usr/include/evolution-data-server-1.0/libebook/Evolution-DataServer-Addressbook.h:1417: error: expected declaration specifiers or '...' before 'CORBA_Environment'
/usr/include/evolution-data-server-1.0/libebook/Evolution-DataServer-Addressbook.h:1417: error: expected ')' before '_servant'
/usr/include/evolution-data-server-1.0/libebook/Evolution-DataServer-Addressbook.h:1418: error: expected declaration specifiers or '...' before 'CORBA_Context'
/usr/include/evolution-data-server-1.0/libebook/Evolution-DataServer-Addressbook.h:1418: error: expected declaration specifiers or '...' before 'CORBA_Environment'
/usr/include/evolution-data-server-1.0/libebook/Evolution-DataServer-Addressbook.h:1418: error: expected ')' before '_servant'
/usr/include/evolution-data-server-1.0/libebook/Evolution-DataServer-Addressbook.h:1419: error: expected declaration specifiers or '...' before 'CORBA_Context'
/usr/include/evolution-data-server-1.0/libebook/Evolution-DataServer-Addressbook.h:1419: error: expected declaration specifiers or '...' before 'CORBA_Environment'
/usr/include/evolution-data-server-1.0/libebook/Evolution-DataServer-Addressbook.h:1419: error: expected ')' before '_servant'
/usr/include/evolution-data-server-1.0/libebook/Evolution-DataServer-Addressbook.h:1420: error: expected declaration specifiers or '...' before 'CORBA_Context'
/usr/include/evolution-data-server-1.0/libebook/Evolution-DataServer-Addressbook.h:1420: error: expected declaration specifiers or '...' before 'CORBA_Environment'
/usr/include/evolution-data-server-1.0/libebook/Evolution-DataServer-Addressbook.h:1420: error: expected ')' before '_servant'
/usr/include/evolution-data-server-1.0/libebook/Evolution-DataServer-Addressbook.h:1421: error: expected declaration specifiers or '...' before 'CORBA_Context'
/usr/include/evolution-data-server-1.0/libebook/Evolution-DataServer-Addressbook.h:1421: error: expected declaration specifiers or '...' before 'CORBA_Environment'
/usr/include/evolution-data-server-1.0/libebook/Evolution-DataServer-Addressbook.h:1421: error: expected ')' before '_servant'
/usr/include/evolution-data-server-1.0/libebook/Evolution-DataServer-Addressbook.h:1422: error: expected declaration specifiers or '...' before 'CORBA_Context'
/usr/include/evolution-data-server-1.0/libebook/Evolution-DataServer-Addressbook.h:1422: error: expected declaration specifiers or '...' before 'CORBA_Environment'
/usr/include/evolution-data-server-1.0/libebook/Evolution-DataServer-Addressbook.h:1422: error: expected ')' before '_servant'
/usr/include/evolution-data-server-1.0/libebook/Evolution-DataServer-Addressbook.h:1423: error: expected declaration specifiers or '...' before 'CORBA_Context'
/usr/include/evolution-data-server-1.0/libebook/Evolution-DataServer-Addressbook.h:1423: error: expected declaration specifiers or '...' before 'CORBA_Environment'
/usr/include/evolution-data-server-1.0/libebook/Evolution-DataServer-Addressbook.h:1423: error: expected ')' before '_servant'
/usr/include/evolution-data-server-1.0/libebook/Evolution-DataServer-Addressbook.h:1424: error: expected declaration specifiers or '...' before 'CORBA_Context'
/usr/include/evolution-data-server-1.0/libebook/Evolution-DataServer-Addressbook.h:1424: error: expected declaration specifiers or '...' before 'CORBA_Environment'
/usr/include/evolution-data-server-1.0/libebook/Evolution-DataServer-Addressbook.h:1424: error: expected ')' before '_servant'
/usr/include/evolution-data-server-1.0/libebook/Evolution-DataServer-Addressbook.h:1425: error: expected declaration specifiers or '...' before 'CORBA_Context'
/usr/include/evolution-data-server-1.0/libebook/Evolution-DataServer-Addressbook.h:1425: error: expected declaration specifiers or '...' before 'CORBA_Environment'
/usr/include/evolution-data-server-1.0/libebook/Evolution-DataServer-Addressbook.h:1425: error: expected ')' before '_servant'
/usr/include/evolution-data-server-1.0/libebook/Evolution-DataServer-Addressbook.h:1426: error: expected declaration specifiers or '...' before 'CORBA_Context'
/usr/include/evolution-data-server-1.0/libebook/Evolution-DataServer-Addressbook.h:1426: error: expected declaration specifiers or '...' before 'CORBA_Environment'
/usr/include/evolution-data-server-1.0/libebook/Evolution-DataServer-Addressbook.h:1426: error: expected ')' before '_servant'
/usr/include/evolution-data-server-1.0/libebook/Evolution-DataServer-Addressbook.h:1427: error: expected declaration specifiers or '...' before 'CORBA_Context'
/usr/include/evolution-data-server-1.0/libebook/Evolution-DataServer-Addressbook.h:1427: error: expected declaration specifiers or '...' before 'CORBA_Environment'
/usr/include/evolution-data-server-1.0/libebook/Evolution-DataServer-Addressbook.h:1427: error: expected declaration specifiers or '...' before 'CORBA_string'
/usr/include/evolution-data-server-1.0/libebook/Evolution-DataServer-Addressbook.h:1428: error: expected declaration specifiers or '...' before 'CORBA_Context'
/usr/include/evolution-data-server-1.0/libebook/Evolution-DataServer-Addressbook.h:1428: error: expected declaration specifiers or '...' before 'CORBA_Environment'
/usr/include/evolution-data-server-1.0/libebook/Evolution-DataServer-Addressbook.h:1428: error: expected declaration specifiers or '...' before 'CORBA_string'
/usr/include/evolution-data-server-1.0/libebook/Evolution-DataServer-Addressbook.h:1429: error: expected declaration specifiers or '...' before 'CORBA_Context'
/usr/include/evolution-data-server-1.0/libebook/Evolution-DataServer-Addressbook.h:1429: error: expected declaration specifiers or '...' before 'CORBA_Environment'
/usr/include/evolution-data-server-1.0/libebook/Evolution-DataServer-Addressbook.h:1429: error: expected ')' before '_servant'
/usr/include/evolution-data-server-1.0/libebook/Evolution-DataServer-Addressbook.h:1430: error: expected declaration specifiers or '...' before 'CORBA_Context'
/usr/include/evolution-data-server-1.0/libebook/Evolution-DataServer-Addressbook.h:1430: error: expected declaration specifiers or '...' before 'CORBA_Environment'
/usr/include/evolution-data-server-1.0/libebook/Evolution-DataServer-Addressbook.h:1430: error: expected ')' before '_servant'
/usr/include/evolution-data-server-1.0/libebook/Evolution-DataServer-Addressbook.h:1431: error: expected declaration specifiers or '...' before 'CORBA_Context'
/usr/include/evolution-data-server-1.0/libebook/Evolution-DataServer-Addressbook.h:1431: error: expected declaration specifiers or '...' before 'CORBA_Environment'
/usr/include/evolution-data-server-1.0/libebook/Evolution-DataServer-Addressbook.h:1431: error: expected ')' before '_servant'
/usr/include/evolution-data-server-1.0/libebook/Evolution-DataServer-Addressbook.h:1432: error: expected declaration specifiers or '...' before 'CORBA_Context'
/usr/include/evolution-data-server-1.0/libebook/Evolution-DataServer-Addressbook.h:1432: error: expected declaration specifiers or '...' before 'CORBA_Environment'
/usr/include/evolution-data-server-1.0/libebook/Evolution-DataServer-Addressbook.h:1432: error: expected ')' before '_servant'
/usr/include/evolution-data-server-1.0/libebook/Evolution-DataServer-Addressbook.h:1433: error: expected declaration specifiers or '...' before 'CORBA_Context'
/usr/include/evolution-data-server-1.0/libebook/Evolution-DataServer-Addressbook.h:1433: error: expected declaration specifiers or '...' before 'CORBA_Environment'
/usr/include/evolution-data-server-1.0/libebook/Evolution-DataServer-Addressbook.h:1433: error: expected ')' before '_servant'
/usr/include/evolution-data-server-1.0/libebook/Evolution-DataServer-Addressbook.h:1434: error: expected declaration specifiers or '...' before 'CORBA_Context'
/usr/include/evolution-data-server-1.0/libebook/Evolution-DataServer-Addressbook.h:1434: error: expected declaration specifiers or '...' before 'CORBA_Environment'
/usr/include/evolution-data-server-1.0/libebook/Evolution-DataServer-Addressbook.h:1434: error: expected ')' before '_servant'
/usr/include/evolution-data-server-1.0/libebook/Evolution-DataServer-Addressbook.h:1435: error: expected declaration specifiers or '...' before 'CORBA_Context'
/usr/include/evolution-data-server-1.0/libebook/Evolution-DataServer-Addressbook.h:1435: error: expected declaration specifiers or '...' before 'CORBA_Environment'
/usr/include/evolution-data-server-1.0/libebook/Evolution-DataServer-Addressbook.h:1435: error: expected ')' before '_servant'
/usr/include/evolution-data-server-1.0/libebook/Evolution-DataServer-Addressbook.h:1436: error: expected declaration specifiers or '...' before 'CORBA_Context'
/usr/include/evolution-data-server-1.0/libebook/Evolution-DataServer-Addressbook.h:1436: error: expected declaration specifiers or '...' before 'CORBA_Environment'
/usr/include/evolution-data-server-1.0/libebook/Evolution-DataServer-Addressbook.h:1436: error: expected ')' before '_servant'
/usr/include/evolution-data-server-1.0/libebook/Evolution-DataServer-Addressbook.h:1437: error: expected declaration specifiers or '...' before 'CORBA_Context'
/usr/include/evolution-data-server-1.0/libebook/Evolution-DataServer-Addressbook.h:1437: error: expected declaration specifiers or '...' before 'CORBA_Environment'
/usr/include/evolution-data-server-1.0/libebook/Evolution-DataServer-Addressbook.h:1437: error: expected ')' before '_servant'
/usr/include/evolution-data-server-1.0/libebook/Evolution-DataServer-Addressbook.h:1438: error: expected declaration specifiers or '...' before 'CORBA_Context'
/usr/include/evolution-data-server-1.0/libebook/Evolution-DataServer-Addressbook.h:1438: error: expected declaration specifiers or '...' before 'CORBA_Environment'
/usr/include/evolution-data-server-1.0/libebook/Evolution-DataServer-Addressbook.h:1438: error: expected ')' before '_servant'
/usr/include/evolution-data-server-1.0/libebook/Evolution-DataServer-Addressbook.h:1439: error: expected declaration specifiers or '...' before 'CORBA_Context'
/usr/include/evolution-data-server-1.0/libebook/Evolution-DataServer-Addressbook.h:1439: error: expected declaration specifiers or '...' before 'CORBA_Environment'
/usr/include/evolution-data-server-1.0/libebook/Evolution-DataServer-Addressbook.h:1439: error: expected ')' before '_servant'
/usr/include/evolution-data-server-1.0/libebook/Evolution-DataServer-Addressbook.h:1440: error: expected declaration specifiers or '...' before 'CORBA_Context'
/usr/include/evolution-data-server-1.0/libebook/Evolution-DataServer-Addressbook.h:1440: error: expected declaration specifiers or '...' before 'CORBA_Environment'
/usr/include/evolution-data-server-1.0/libebook/Evolution-DataServer-Addressbook.h:1440: error: expected ')' before '_servant'
/usr/include/evolution-data-server-1.0/libebook/Evolution-DataServer-Addressbook.h:1441: error: expected declaration specifiers or '...' before 'CORBA_Context'
/usr/include/evolution-data-server-1.0/libebook/Evolution-DataServer-Addressbook.h:1441: error: expected declaration specifiers or '...' before 'CORBA_Environment'
/usr/include/evolution-data-server-1.0/libebook/Evolution-DataServer-Addressbook.h:1441: error: expected ')' before '_servant'
/usr/include/evolution-data-server-1.0/libebook/Evolution-DataServer-Addressbook.h:1442: error: expected declaration specifiers or '...' before 'CORBA_Context'
/usr/include/evolution-data-server-1.0/libebook/Evolution-DataServer-Addressbook.h:1442: error: expected declaration specifiers or '...' before 'CORBA_Environment'
/usr/include/evolution-data-server-1.0/libebook/Evolution-DataServer-Addressbook.h:1442: error: expected ')' before '_servant'
/usr/include/evolution-data-server-1.0/libebook/Evolution-DataServer-Addressbook.h:1443: error: expected declaration specifiers or '...' before 'CORBA_Context'
/usr/include/evolution-data-server-1.0/libebook/Evolution-DataServer-Addressbook.h:1443: error: expected declaration specifiers or '...' before 'CORBA_Environment'
/usr/include/evolution-data-server-1.0/libebook/Evolution-DataServer-Addressbook.h:1443: error: expected ')' before '_servant'
/usr/include/evolution-data-server-1.0/libebook/Evolution-DataServer-Addressbook.h:1444: error: expected declaration specifiers or '...' before 'CORBA_Context'
/usr/include/evolution-data-server-1.0/libebook/Evolution-DataServer-Addressbook.h:1444: error: expected declaration specifiers or '...' before 'CORBA_Environment'
/usr/include/evolution-data-server-1.0/libebook/Evolution-DataServer-Addressbook.h:1444: error: expected declaration specifiers or '...' before 'GNOME_Evolution_Addressbook_Book'
/usr/include/evolution-data-server-1.0/libebook/Evolution-DataServer-Addressbook.h:1450: error: expected ')' before '_obj'
/usr/include/evolution-data-server-1.0/libebook/Evolution-DataServer-Addressbook.h:1451: error: expected ')' before '_obj'
/usr/include/evolution-data-server-1.0/libebook/Evolution-DataServer-Addressbook.h:1452: error: expected ')' before '_obj'
/usr/include/evolution-data-server-1.0/libebook/Evolution-DataServer-Addressbook.h:1453: error: expected ')' before '_obj'
/usr/include/evolution-data-server-1.0/libebook/Evolution-DataServer-Addressbook.h:1454: error: expected ')' before '_obj'
/usr/include/evolution-data-server-1.0/libebook/Evolution-DataServer-Addressbook.h:1458: error: expected ')' before '_obj'
/usr/include/evolution-data-server-1.0/libebook/Evolution-DataServer-Addressbook.h:1459: error: expected ')' before '_obj'
/usr/include/evolution-data-server-1.0/libebook/Evolution-DataServer-Addressbook.h:1460: error: expected ')' before '_obj'
/usr/include/evolution-data-server-1.0/libebook/Evolution-DataServer-Addressbook.h:1464: error: expected ')' before '_obj'
/usr/include/evolution-data-server-1.0/libebook/Evolution-DataServer-Addressbook.h:1465: error: expected ')' before '_obj'
/usr/include/evolution-data-server-1.0/libebook/Evolution-DataServer-Addressbook.h:1466: error: expected ')' before '_obj'
/usr/include/evolution-data-server-1.0/libebook/Evolution-DataServer-Addressbook.h:1467: error: expected ')' before '_obj'
/usr/include/evolution-data-server-1.0/libebook/Evolution-DataServer-Addressbook.h:1468: error: expected ')' before '_obj'
/usr/include/evolution-data-server-1.0/libebook/Evolution-DataServer-Addressbook.h:1469: error: expected ')' before '_obj'
/usr/include/evolution-data-server-1.0/libebook/Evolution-DataServer-Addressbook.h:1470: error: expected ')' before '_obj'
/usr/include/evolution-data-server-1.0/libebook/Evolution-DataServer-Addressbook.h:1471: error: expected ')' before '_obj'
/usr/include/evolution-data-server-1.0/libebook/Evolution-DataServer-Addressbook.h:1472: error: expected ')' before '_obj'
/usr/include/evolution-data-server-1.0/libebook/Evolution-DataServer-Addressbook.h:1473: error: expected ')' before '_obj'
/usr/include/evolution-data-server-1.0/libebook/Evolution-DataServer-Addressbook.h:1474: error: expected ')' before '_obj'
/usr/include/evolution-data-server-1.0/libebook/Evolution-DataServer-Addressbook.h:1475: error: expected ')' before '_obj'
/usr/include/evolution-data-server-1.0/libebook/Evolution-DataServer-Addressbook.h:1476: error: expected '=', ',', ';', 'asm' or '__attribute__' before 'GNOME_Evolution_Addressbook_Book_getStaticCapabilities'
/usr/include/evolution-data-server-1.0/libebook/Evolution-DataServer-Addressbook.h:1477: error: expected '=', ',', ';', 'asm' or '__attribute__' before 'GNOME_Evolution_Addressbook_Book_getName'
/usr/include/evolution-data-server-1.0/libebook/Evolution-DataServer-Addressbook.h:1478: error: expected ')' before '_obj'
/usr/include/evolution-data-server-1.0/libebook/Evolution-DataServer-Addressbook.h:1482: error: expected ')' before '_obj'
/usr/include/evolution-data-server-1.0/libebook/Evolution-DataServer-Addressbook.h:1483: error: expected ')' before '_obj'
/usr/include/evolution-data-server-1.0/libebook/Evolution-DataServer-Addressbook.h:1484: error: expected ')' before '_obj'
/usr/include/evolution-data-server-1.0/libebook/Evolution-DataServer-Addressbook.h:1485: error: expected ')' before '_obj'
/usr/include/evolution-data-server-1.0/libebook/Evolution-DataServer-Addressbook.h:1486: error: expected ')' before '_obj'
/usr/include/evolution-data-server-1.0/libebook/Evolution-DataServer-Addressbook.h:1487: error: expected ')' before '_obj'
/usr/include/evolution-data-server-1.0/libebook/Evolution-DataServer-Addressbook.h:1488: error: expected ')' before '_obj'
/usr/include/evolution-data-server-1.0/libebook/Evolution-DataServer-Addressbook.h:1489: error: expected ')' before '_obj'
/usr/include/evolution-data-server-1.0/libebook/Evolution-DataServer-Addressbook.h:1490: error: expected ')' before '_obj'
/usr/include/evolution-data-server-1.0/libebook/Evolution-DataServer-Addressbook.h:1491: error: expected ')' before '_obj'
/usr/include/evolution-data-server-1.0/libebook/Evolution-DataServer-Addressbook.h:1492: error: expected ')' before '_obj'
/usr/include/evolution-data-server-1.0/libebook/Evolution-DataServer-Addressbook.h:1493: error: expected ')' before '_obj'
/usr/include/evolution-data-server-1.0/libebook/Evolution-DataServer-Addressbook.h:1494: error: expected ')' before '_obj'
/usr/include/evolution-data-server-1.0/libebook/Evolution-DataServer-Addressbook.h:1495: error: expected ')' before '_obj'
/usr/include/evolution-data-server-1.0/libebook/Evolution-DataServer-Addressbook.h:1499: error: expected '=', ',', ';', 'asm' or '__attribute__' before 'GNOME_Evolution_Addressbook_BookFactory_getBook'
/usr/include/evolution-data-server-1.0/libebook/Evolution-DataServer-Addressbook.h:1507: error: expected '=', ',', ';', 'asm' or '__attribute__' before 'GNOME_Evolution_Addressbook_BookViewListener__iinterface'
/usr/include/evolution-data-server-1.0/libebook/Evolution-DataServer-Addressbook.h:1514: error: expected '=', ',', ';', 'asm' or '__attribute__' before 'GNOME_Evolution_Addressbook_BookViewListener__imethods'
/usr/include/evolution-data-server-1.0/libebook/Evolution-DataServer-Addressbook.h:1520: error: expected '=', ',', ';', 'asm' or '__attribute__' before 'GNOME_Evolution_Addressbook_BookView__iinterface'
/usr/include/evolution-data-server-1.0/libebook/Evolution-DataServer-Addressbook.h:1527: error: expected '=', ',', ';', 'asm' or '__attribute__' before 'GNOME_Evolution_Addressbook_BookView__imethods'
/usr/include/evolution-data-server-1.0/libebook/Evolution-DataServer-Addressbook.h:1533: error: expected '=', ',', ';', 'asm' or '__attribute__' before 'GNOME_Evolution_Addressbook_Book__iinterface'
/usr/include/evolution-data-server-1.0/libebook/Evolution-DataServer-Addressbook.h:1540: error: expected '=', ',', ';', 'asm' or '__attribute__' before 'GNOME_Evolution_Addressbook_Book__imethods'
/usr/include/evolution-data-server-1.0/libebook/Evolution-DataServer-Addressbook.h:1546: error: expected '=', ',', ';', 'asm' or '__attribute__' before 'GNOME_Evolution_Addressbook_BookListener__iinterface'
/usr/include/evolution-data-server-1.0/libebook/Evolution-DataServer-Addressbook.h:1553: error: expected '=', ',', ';', 'asm' or '__attribute__' before 'GNOME_Evolution_Addressbook_BookListener__imethods'
/usr/include/evolution-data-server-1.0/libebook/Evolution-DataServer-Addressbook.h:1559: error: expected '=', ',', ';', 'asm' or '__attribute__' before 'GNOME_Evolution_Addressbook_BookFactory__iinterface'
/usr/include/evolution-data-server-1.0/libebook/Evolution-DataServer-Addressbook.h:1566: error: expected '=', ',', ';', 'asm' or '__attribute__' before 'GNOME_Evolution_Addressbook_BookFactory__imethods'
In file included from /usr/include/evolution-data-server-1.0/libebook/e-book-view.h:17,
from /usr/include/evolution-data-server-1.0/libebook/e-book.h:22,
from evolution2_sync.h:8,
from evolution2_sync.c:21:
/usr/include/evolution-data-server-1.0/libebook/e-book-view-listener.h:35: error: expected specifier-qualifier-list before 'BonoboObject'
/usr/include/evolution-data-server-1.0/libebook/e-book-view-listener.h:41: error: expected specifier-qualifier-list before 'BonoboObjectClass'
In file included from /usr/include/evolution-data-server-1.0/libebook/e-book.h:22,
from evolution2_sync.h:8,
from evolution2_sync.c:21:
/usr/include/evolution-data-server-1.0/libebook/e-book-view.h:61: error: expected ')' before 'corba_book_view'
In file included from evolution2_sync.c:21:
evolution2_sync.h:11:30: error: libxml/xmlmemory.h: No such file or directory
evolution2_sync.h:12:27: error: libxml/parser.h: No such file or directory
evolution2_sync.c: In function 'evo2_connect':
evolution2_sync.c:201: warning: implicit declaration of function 'srand'
make[2]: *** [evolution2_sync.lo] Error 1
make[2]: Leaving directory `/usr/src/HMM/OPENSYNC/opensync-svn/evolution2/src'
make[1]: *** [all-recursive] Error 1
make[1]: Leaving directory `/usr/src/HMM/OPENSYNC/opensync-svn/evolution2'
make: *** [all] Error 2
[root@be]/usr/src/HMM/OPENSYNC/opensync-svn/evolution2#
[root@be]/usr/src/HMM/OPENSYNC/opensync-svn/evolution2# ~~~