All pastes #268447 Raw Edit

beryl errors

public text v1 · immutable
·published 2006-12-05 19:08 UTC
rendered paste body
Building beryl-xgl with mesa located at /root/beryl/beryl-mesa 

configure: creating ./config.status
config.status: creating beryl.pc
config.status: creating berylsettings.pc
config.status: creating Makefile
config.status: creating src/Makefile
config.status: creating include/Makefile
config.status: creating images/Makefile
config.status: creating doc/Makefile
config.status: creating libberylsettings/Makefile
config.status: creating settings-backends/Makefile
config.status: creating po/Makefile.in
config.status: creating config.h
config.status: config.h is unchanged
config.status: executing depfiles commands
config.status: executing intltool commands
config.status: executing default-1 commands
config.status: executing po/stamp-it commands
make  all-recursive
make[1]: se ingresa al directorio `/root/beryl/beryl-core'
Making all in include
make[2]: se ingresa al directorio `/root/beryl/beryl-core/include'
make[2]: No se hace nada para `all'.
make[2]: se sale del directorio `/root/beryl/beryl-core/include'
Making all in src
make[2]: se ingresa al directorio `/root/beryl/beryl-core/src'
gcc -DHAVE_CONFIG_H -I. -I.. -I/usr/include/libpng12 -I/usr/include/startup-notification-1.0 -I/usr/include/glib-2.0 -I/usr/lib/glib-2.0/include -I../include -DPLUGINDIR=\"/usr/lib/beryl\" -DIMAGEDIR=\"/usr/share/beryl\"    -O0 -ggdb3 -gstabs+ -Wall -Wpointer-arith -Wstrict-prototypes -Wmissing-prototypes -Wmissing-declarations -Wnested-externs -fno-strict-aliasing -MT main.o -MD -MP -MF .deps/main.Tpo -c -o main.o main.c
In file included from main.c:40:
../include/beryl.h:55:19: error: GL/gl.h: No existe el fichero o el directorio
../include/beryl.h:56:20: error: GL/glx.h: No existe el fichero o el directorio
../include/beryl.h:57:26: error: GL/glxtokens.h: No existe el fichero o el directorio
In file included from main.c:40:
../include/beryl.h:206: error: expected ‘=’, ‘,’, ‘;’, ‘asm’ or ‘__attribute__’ before ‘defaultColor’
../include/beryl.h:784: error: expected specifier-qualifier-list before ‘GLenum’
../include/beryl.h:991: error: expected specifier-qualifier-list before ‘GLfloat’
../include/beryl.h:1001: error: expected specifier-qualifier-list before ‘GLushort’
../include/beryl.h:1200: error: expected specifier-qualifier-list before ‘GLuint’
../include/beryl.h:1325: warning: type defaults to ‘int’ in declaration of ‘GLubyte’
../include/beryl.h:1325: error: expected ‘;’, ‘,’ or ‘)’ before ‘*’ token
../include/beryl.h:1328: error: expected declaration specifiers or ‘...’ before ‘GLXDrawable’
../include/beryl.h:1332: error: expected declaration specifiers or ‘...’ before ‘GLXDrawable’
../include/beryl.h:1335: error: expected declaration specifiers or ‘...’ before ‘GLXDrawable’
../include/beryl.h:1340: error: expected declaration specifiers or ‘...’ before ‘GLXDrawable’
../include/beryl.h:1362: error: expected declaration specifiers or ‘...’ before ‘*’ token
../include/beryl.h:1365: warning: type defaults to ‘int’ in declaration of ‘GLXPixmap’
../include/beryl.h:1365: error: ‘GLXPixmap’ declared as function returning a function
../include/beryl.h:1365: warning: function declaration isn’t a prototype
../include/beryl.h:1367: error: expected ‘)’ before ‘texture’
../include/beryl.h:1368: error: expected ‘)’ before ‘texture’
../include/beryl.h:1370: error: expected ‘)’ before ‘n’
../include/beryl.h:1372: error: expected ‘)’ before ‘n’
../include/beryl.h:1374: error: expected ‘)’ before ‘target’
../include/beryl.h:1376: error: expected ‘)’ before ‘target’
../include/beryl.h:1380: error: expected ‘)’ before ‘target’
../include/beryl.h:1387: error: expected ‘)’ before ‘n’
../include/beryl.h:1389: error: expected ‘)’ before ‘n’
../include/beryl.h:1391: error: expected ‘)’ before ‘target’
../include/beryl.h:1393: error: expected declaration specifiers or ‘...’ before ‘*’ token
../include/beryl.h:1393: error: expected ‘)’ before ‘target’
../include/beryl.h:1394: error: expected ‘)’ before ‘target’
../include/beryl.h:1399: error: expected ‘)’ before ‘target’
../include/beryl.h:1401: error: expected ‘)’ before ‘target’
../include/beryl.h:1402: error: expected ‘)’ before ‘n’
../include/beryl.h:1403: error: expected ‘)’ before ‘n’
../include/beryl.h:1404: error: expected ‘)’ before ‘target’
../include/beryl.h:1405: error: expected ‘)’ before ‘target’
../include/beryl.h:1568: error: expected specifier-qualifier-list before ‘GLint’
../include/beryl.h:1924: error: expected declaration specifiers or ‘...’ before ‘GLenum’
../include/beryl.h:2025: error: expected specifier-qualifier-list before ‘GLint’
make[2]: *** [main.o] Error 1
make[2]: se sale del directorio `/root/beryl/beryl-core/src'
make[1]: *** [all-recursive] Error 1
make[1]: se sale del directorio `/root/beryl/beryl-core'
make: *** [all] Error 2
BUILD FAILED for beryl-core