rendered paste bodyThis file contains any messages produced by compilers while
running configure, to aid debugging if configure makes a mistake.
It was created by configure, which was
generated by GNU Autoconf 2.59. Invocation command line was
$ ./configure
## --------- ##
## Platform. ##
## --------- ##
hostname = qqq
uname -m = i686
uname -r = 2.6.15-27-386
uname -s = Linux
uname -v = #1 PREEMPT Sat Sep 16 01:51:59 UTC 2006
/usr/bin/uname -p = unknown
/bin/uname -X = unknown
/bin/arch = i686
/usr/bin/arch -k = unknown
/usr/convex/getsysinfo = unknown
hostinfo = unknown
/bin/machine = unknown
/usr/bin/oslevel = unknown
/bin/universe = unknown
PATH: /usr/local/sbin
PATH: /usr/local/bin
PATH: /usr/sbin
PATH: /usr/bin
PATH: /sbin
PATH: /bin
PATH: /usr/bin/X11
PATH: /usr/games
## ----------- ##
## Core tests. ##
## ----------- ##
configure:1571: checking build system type
configure:1589: result: i686-pc-linux-gnu
configure:1597: checking host system type
configure:1611: result: i686-pc-linux-gnu
configure:1619: checking target system type
configure:1633: result: i686-pc-linux-gnu
configure:1680: checking for a BSD-compatible install
configure:1735: result: /usr/bin/install -c
configure:1750: checking for -p flag to install
configure:1763: result: yes
configure:1774: checking whether build environment is sane
configure:1817: result: yes
configure:1861: checking for gawk
configure:1890: result: no
configure:1861: checking for mawk
configure:1877: found /usr/bin/mawk
configure:1887: result: mawk
configure:1897: checking whether make sets $(MAKE)
configure:1917: result: yes
configure:2108: checking for kde-config
configure:2170: result: /usr/bin/kde-config
configure:2265: checking where to install
configure:2269: result: /usr (as returned by kde-config)
configure:2622: checking for style of include used by make
configure:2650: result: GNU
configure:2805: checking for gcc
configure:2821: found /usr/bin/gcc
configure:2831: result: gcc
configure:3075: checking for C compiler version
configure:3078: gcc --version </dev/null >&5
gcc (GCC) 3.3.6 (Ubuntu 1:3.3.6-10)
Copyright (C) 2003 Free Software Foundation, Inc.
This is free software; see the source for copying conditions. There is NO
warranty; not even for MERCHANTABILITY or FITNESS FOR A PARTICULAR PURPOSE.
configure:3081: $? = 0
configure:3083: gcc -v </dev/null >&5
Reading specs from /usr/lib/gcc-lib/i486-linux-gnu/3.3.6/specs
Configured with: ../src/configure -v --enable-languages=c,c++,ada --prefix=/usr --mandir=/usr/share/man --infodir=/usr/share/info --with-gxx-include-dir=/usr/include/c++/3.3 --enable-shared --enable-__cxa_atexit --with-system-zlib --enable-nls --without-included-gettext --enable-clocale=gnu --enable-debug i486-linux-gnu
Thread model: posix
gcc version 3.3.6 (Ubuntu 1:3.3.6-10)
configure:3086: $? = 0
configure:3088: gcc -V </dev/null >&5
gcc: `-V' option must have argument
configure:3091: $? = 1
configure:3114: checking for C compiler default output file name
configure:3117: gcc conftest.c >&5
configure:3120: $? = 0
configure:3166: result: a.out
configure:3171: checking whether the C compiler works
configure:3177: ./a.out
configure:3180: $? = 0
configure:3197: result: yes
configure:3204: checking whether we are cross compiling
configure:3206: result: no
configure:3209: checking for suffix of executables
configure:3211: gcc -o conftest conftest.c >&5
configure:3214: $? = 0
configure:3239: result:
configure:3245: checking for suffix of object files
configure:3266: gcc -c conftest.c >&5
configure:3269: $? = 0
configure:3291: result: o
configure:3295: checking whether we are using the GNU C compiler
configure:3319: gcc -c conftest.c >&5
configure:3325: $? = 0
configure:3329: test -z
|| test ! -s conftest.err
configure:3332: $? = 0
configure:3335: test -s conftest.o
configure:3338: $? = 0
configure:3351: result: yes
configure:3357: checking whether gcc accepts -g
configure:3378: gcc -c -g conftest.c >&5
configure:3384: $? = 0
configure:3388: test -z
|| test ! -s conftest.err
configure:3391: $? = 0
configure:3394: test -s conftest.o
configure:3397: $? = 0
configure:3408: result: yes
configure:3425: checking for gcc option to accept ANSI C
configure:3495: gcc -c conftest.c >&5
configure:3501: $? = 0
configure:3505: test -z
|| test ! -s conftest.err
configure:3508: $? = 0
configure:3511: test -s conftest.o
configure:3514: $? = 0
configure:3532: result: none needed
configure:3550: gcc -c conftest.c >&5
conftest.c:2: error: syntax error before "me"
configure:3556: $? = 1
configure: failed program was:
| #ifndef __cplusplus
| choke me
| #endif
configure:3691: checking dependency style of gcc
configure:3781: result: gcc3
configure:3804: checking how to run the C preprocessor
configure:3839: gcc -E conftest.c
configure:3845: $? = 0
configure:3877: gcc -E conftest.c
conftest.c:11:28: ac_nonexistent.h: No such file or directory
configure:3883: $? = 1
configure: failed program was:
| /* confdefs.h. */
|
| #define PACKAGE_NAME ""
| #define PACKAGE_TARNAME ""
| #define PACKAGE_VERSION ""
| #define PACKAGE_STRING ""
| #define PACKAGE_BUGREPORT ""
| #define PACKAGE "sim"
| #define VERSION "0.9.4"
| /* end confdefs.h. */
| #include <ac_nonexistent.h>
configure:3922: result: gcc -E
configure:3946: gcc -E conftest.c
configure:3952: $? = 0
configure:3984: gcc -E conftest.c
conftest.c:11:28: ac_nonexistent.h: No such file or directory
configure:3990: $? = 1
configure: failed program was:
| /* confdefs.h. */
|
| #define PACKAGE_NAME ""
| #define PACKAGE_TARNAME ""
| #define PACKAGE_VERSION ""
| #define PACKAGE_STRING ""
| #define PACKAGE_BUGREPORT ""
| #define PACKAGE "sim"
| #define VERSION "0.9.4"
| /* end confdefs.h. */
| #include <ac_nonexistent.h>
configure:4114: checking for g++
configure:4130: found /usr/bin/g++
configure:4140: result: g++
configure:4156: checking for C++ compiler version
configure:4159: g++ --version </dev/null >&5
g++ (GCC) 3.3.6 (Ubuntu 1:3.3.6-10)
Copyright (C) 2003 Free Software Foundation, Inc.
This is free software; see the source for copying conditions. There is NO
warranty; not even for MERCHANTABILITY or FITNESS FOR A PARTICULAR PURPOSE.
configure:4162: $? = 0
configure:4164: g++ -v </dev/null >&5
Reading specs from /usr/lib/gcc-lib/i486-linux-gnu/3.3.6/specs
Configured with: ../src/configure -v --enable-languages=c,c++,ada --prefix=/usr --mandir=/usr/share/man --infodir=/usr/share/info --with-gxx-include-dir=/usr/include/c++/3.3 --enable-shared --enable-__cxa_atexit --with-system-zlib --enable-nls --without-included-gettext --enable-clocale=gnu --enable-debug i486-linux-gnu
Thread model: posix
gcc version 3.3.6 (Ubuntu 1:3.3.6-10)
configure:4167: $? = 0
configure:4169: g++ -V </dev/null >&5
g++: `-V' option must have argument
configure:4172: $? = 1
configure:4175: checking whether we are using the GNU C++ compiler
configure:4199: g++ -c conftest.cc >&5
configure:4205: $? = 0
configure:4209: test -z
|| test ! -s conftest.err
configure:4212: $? = 0
configure:4215: test -s conftest.o
configure:4218: $? = 0
configure:4231: result: yes
configure:4237: checking whether g++ accepts -g
configure:4258: g++ -c -g conftest.cc >&5
configure:4264: $? = 0
configure:4268: test -z
|| test ! -s conftest.err
configure:4271: $? = 0
configure:4274: test -s conftest.o
configure:4277: $? = 0
configure:4288: result: yes
configure:4330: g++ -c conftest.cc >&5
configure:4336: $? = 0
configure:4340: test -z
|| test ! -s conftest.err
configure:4343: $? = 0
configure:4346: test -s conftest.o
configure:4349: $? = 0
configure:4375: g++ -c conftest.cc >&5
conftest.cc: In function `int main()':
conftest.cc:15: error: `exit' undeclared (first use this function)
conftest.cc:15: error: (Each undeclared identifier is reported only once for
each function it appears in.)
configure:4381: $? = 1
configure: failed program was:
| /* confdefs.h. */
|
| #define PACKAGE_NAME ""
| #define PACKAGE_TARNAME ""
| #define PACKAGE_VERSION ""
| #define PACKAGE_STRING ""
| #define PACKAGE_BUGREPORT ""
| #define PACKAGE "sim"
| #define VERSION "0.9.4"
| /* end confdefs.h. */
|
| int
| main ()
| {
| exit (42);
| ;
| return 0;
| }
configure:4330: g++ -c conftest.cc >&5
configure:4336: $? = 0
configure:4340: test -z
|| test ! -s conftest.err
configure:4343: $? = 0
configure:4346: test -s conftest.o
configure:4349: $? = 0
configure:4375: g++ -c conftest.cc >&5
configure:4381: $? = 0
configure:4385: test -z
|| test ! -s conftest.err
configure:4388: $? = 0
configure:4391: test -s conftest.o
configure:4394: $? = 0
configure:4419: checking dependency style of g++
configure:4509: result: gcc3
configure:4831: checking whether g++ supports -Wmissing-format-attribute
configure:4867: rm -rf SunWS_cache; g++ -o conftest -ansi -D_XOPEN_SOURCE=500 -D_BSD_SOURCE -Wcast-align -Wconversion -Wchar-subscripts -Wall -W -Wpointer-arith -Wwrite-strings -O2 -Wmissing-format-attribute conftest.cc 1>&5
configure:4873: $? = 0
configure:4877: test -z
|| test ! -s conftest.err
configure:4880: $? = 0
configure:4883: test -s conftest
configure:4886: $? = 0
configure:4907: result: yes
configure:4919: checking whether gcc supports -Wmissing-format-attribute
configure:4952: gcc -o conftest -ansi -W -Wall -Wchar-subscripts -Wshadow -Wpointer-arith -Wmissing-prototypes -Wwrite-strings -D_XOPEN_SOURCE=500 -D_BSD_SOURCE -O2 -Wmissing-format-attribute conftest.c >&5
configure:4958: $? = 0
configure:4962: test -z
|| test ! -s conftest.err
configure:4965: $? = 0
configure:4968: test -s conftest
configure:4971: $? = 0
configure:4992: result: yes
configure:5006: checking whether g++ supports -Wundef
configure:5042: rm -rf SunWS_cache; g++ -o conftest -ansi -D_XOPEN_SOURCE=500 -D_BSD_SOURCE -Wcast-align -Wconversion -Wchar-subscripts -Wall -W -Wpointer-arith -Wwrite-strings -O2 -Wformat-security -Wmissing-format-attribute -Wundef conftest.cc 1>&5
configure:5048: $? = 0
configure:5052: test -z
|| test ! -s conftest.err
configure:5055: $? = 0
configure:5058: test -s conftest
configure:5061: $? = 0
configure:5082: result: yes
configure:5094: checking whether g++ supports -Wno-long-long
configure:5130: rm -rf SunWS_cache; g++ -o conftest -Wundef -ansi -D_XOPEN_SOURCE=500 -D_BSD_SOURCE -Wcast-align -Wconversion -Wchar-subscripts -Wall -W -Wpointer-arith -Wwrite-strings -O2 -Wformat-security -Wmissing-format-attribute -Wno-long-long conftest.cc 1>&5
configure:5136: $? = 0
configure:5140: test -z
|| test ! -s conftest.err
configure:5143: $? = 0
configure:5146: test -s conftest
configure:5149: $? = 0
configure:5170: result: yes
configure:5182: checking whether g++ supports -Wnon-virtual-dtor
configure:5218: rm -rf SunWS_cache; g++ -o conftest -Wno-long-long -Wundef -ansi -D_XOPEN_SOURCE=500 -D_BSD_SOURCE -Wcast-align -Wconversion -Wchar-subscripts -Wall -W -Wpointer-arith -Wwrite-strings -O2 -Wformat-security -Wmissing-format-attribute -Wnon-virtual-dtor conftest.cc 1>&5
configure:5224: $? = 0
configure:5228: test -z
|| test ! -s conftest.err
configure:5231: $? = 0
configure:5234: test -s conftest
configure:5237: $? = 0
configure:5258: result: yes
configure:5278: checking whether g++ supports -fno-exceptions
configure:5314: rm -rf SunWS_cache; g++ -o conftest -Wnon-virtual-dtor -Wno-long-long -Wundef -ansi -D_XOPEN_SOURCE=500 -D_BSD_SOURCE -Wcast-align -Wconversion -Wchar-subscripts -Wall -W -Wpointer-arith -Wwrite-strings -O2 -Wformat-security -Wmissing-format-attribute -fno-exceptions conftest.cc 1>&5
configure:5320: $? = 0
configure:5324: test -z
|| test ! -s conftest.err
configure:5327: $? = 0
configure:5330: test -s conftest
configure:5333: $? = 0
configure:5354: result: yes
configure:5366: checking whether g++ supports -fno-check-new
configure:5402: rm -rf SunWS_cache; g++ -o conftest -Wnon-virtual-dtor -Wno-long-long -Wundef -ansi -D_XOPEN_SOURCE=500 -D_BSD_SOURCE -Wcast-align -Wconversion -Wchar-subscripts -Wall -W -Wpointer-arith -Wwrite-strings -O2 -Wformat-security -Wmissing-format-attribute -fno-exceptions -fno-check-new conftest.cc 1>&5
configure:5408: $? = 0
configure:5412: test -z
|| test ! -s conftest.err
configure:5415: $? = 0
configure:5418: test -s conftest
configure:5421: $? = 0
configure:5442: result: yes
configure:5454: checking whether g++ supports -fno-common
configure:5490: rm -rf SunWS_cache; g++ -o conftest -Wnon-virtual-dtor -Wno-long-long -Wundef -ansi -D_XOPEN_SOURCE=500 -D_BSD_SOURCE -Wcast-align -Wconversion -Wchar-subscripts -Wall -W -Wpointer-arith -Wwrite-strings -O2 -Wformat-security -Wmissing-format-attribute -fno-exceptions -fno-check-new -fno-common conftest.cc 1>&5
configure:5496: $? = 0
configure:5500: test -z
|| test ! -s conftest.err
configure:5503: $? = 0
configure:5506: test -s conftest
configure:5509: $? = 0
configure:5530: result: yes
configure:5542: checking whether g++ supports -fexceptions
configure:5578: rm -rf SunWS_cache; g++ -o conftest -Wnon-virtual-dtor -Wno-long-long -Wundef -ansi -D_XOPEN_SOURCE=500 -D_BSD_SOURCE -Wcast-align -Wconversion -Wchar-subscripts -Wall -W -Wpointer-arith -Wwrite-strings -O2 -Wformat-security -Wmissing-format-attribute -fno-exceptions -fno-check-new -fno-common -fexceptions conftest.cc 1>&5
configure:5584: $? = 0
configure:5588: test -z
|| test ! -s conftest.err
configure:5591: $? = 0
configure:5594: test -s conftest
configure:5597: $? = 0
configure:5618: result: yes
configure:6280: checking how to run the C++ preprocessor
configure:6311: g++ -E conftest.cc
configure:6317: $? = 0
configure:6349: g++ -E conftest.cc
conftest.cc:14:28: ac_nonexistent.h: No such file or directory
configure:6355: $? = 1
configure: failed program was:
| /* confdefs.h. */
|
| #define PACKAGE_NAME ""
| #define PACKAGE_TARNAME ""
| #define PACKAGE_VERSION ""
| #define PACKAGE_STRING ""
| #define PACKAGE_BUGREPORT ""
| #define PACKAGE "sim"
| #define VERSION "0.9.4"
| #ifdef __cplusplus
| extern "C" void std::exit (int) throw (); using std::exit;
| #endif
| /* end confdefs.h. */
| #include <ac_nonexistent.h>
configure:6394: result: g++ -E
configure:6418: g++ -E conftest.cc
configure:6424: $? = 0
configure:6456: g++ -E conftest.cc
conftest.cc:14:28: ac_nonexistent.h: No such file or directory
configure:6462: $? = 1
configure: failed program was:
| /* confdefs.h. */
|
| #define PACKAGE_NAME ""
| #define PACKAGE_TARNAME ""
| #define PACKAGE_VERSION ""
| #define PACKAGE_STRING ""
| #define PACKAGE_BUGREPORT ""
| #define PACKAGE "sim"
| #define VERSION "0.9.4"
| #ifdef __cplusplus
| extern "C" void std::exit (int) throw (); using std::exit;
| #endif
| /* end confdefs.h. */
| #include <ac_nonexistent.h>
configure:6510: checking whether g++ supports -O0
configure:6546: rm -rf SunWS_cache; g++ -o conftest -Wnon-virtual-dtor -Wno-long-long -Wundef -ansi -D_XOPEN_SOURCE=500 -D_BSD_SOURCE -Wcast-align -Wconversion -Wchar-subscripts -Wall -W -Wpointer-arith -Wwrite-strings -O2 -Wformat-security -Wmissing-format-attribute -fno-exceptions -fno-check-new -fno-common -O0 conftest.cc 1>&5
configure:6552: $? = 0
configure:6556: test -z
|| test ! -s conftest.err
configure:6559: $? = 0
configure:6562: test -s conftest
configure:6565: $? = 0
configure:6586: result: yes
configure:6642: checking whether g++ supports -Wl,--no-undefined
configure:6678: rm -rf SunWS_cache; g++ -o conftest -Wnon-virtual-dtor -Wno-long-long -Wundef -ansi -D_XOPEN_SOURCE=500 -D_BSD_SOURCE -Wcast-align -Wconversion -Wchar-subscripts -Wall -W -Wpointer-arith -Wwrite-strings -O2 -Wformat-security -Wmissing-format-attribute -fno-exceptions -fno-check-new -fno-common -Wl,--no-undefined conftest.cc 1>&5
configure:6684: $? = 0
configure:6688: test -z
|| test ! -s conftest.err
configure:6691: $? = 0
configure:6694: test -s conftest
configure:6697: $? = 0
configure:6718: result: yes
configure:6722: checking whether g++ supports -Wl,--allow-shlib-undefined
configure:6758: rm -rf SunWS_cache; g++ -o conftest -Wnon-virtual-dtor -Wno-long-long -Wundef -ansi -D_XOPEN_SOURCE=500 -D_BSD_SOURCE -Wcast-align -Wconversion -Wchar-subscripts -Wall -W -Wpointer-arith -Wwrite-strings -O2 -Wformat-security -Wmissing-format-attribute -fno-exceptions -fno-check-new -fno-common -Wl,--allow-shlib-undefined conftest.cc 1>&5
configure:6764: $? = 0
configure:6768: test -z
|| test ! -s conftest.err
configure:6771: $? = 0
configure:6774: test -s conftest
configure:6777: $? = 0
configure:6798: result: yes
configure:6908: result: not using lib directory suffix
configure:6953: checking for a sed that does not truncate output
configure:7007: result: /bin/sed
configure:7010: checking for egrep
configure:7020: result: grep -E
configure:7036: checking for ld used by gcc
configure:7103: result: /usr/bin/ld
configure:7112: checking if the linker (/usr/bin/ld) is GNU ld
configure:7127: result: yes
configure:7132: checking for /usr/bin/ld option to reload object files
configure:7139: result: -r
configure:7148: checking for BSD-compatible nm
configure:7190: result: /usr/bin/nm -B
configure:7194: checking whether ln -s works
configure:7198: result: yes
configure:7205: checking how to recognise dependent libraries
configure:7388: result: pass_all
configure:7595: checking for ANSI C header files
configure:7620: gcc -c -ansi -W -Wall -Wchar-subscripts -Wshadow -Wpointer-arith -Wmissing-prototypes -Wwrite-strings -D_XOPEN_SOURCE=500 -D_BSD_SOURCE -O2 -Wformat-security -Wmissing-format-attribute conftest.c >&5
configure:7626: $? = 0
configure:7630: test -z
|| test ! -s conftest.err
configure:7633: $? = 0
configure:7636: test -s conftest.o
configure:7639: $? = 0
configure:7728: gcc -o conftest -ansi -W -Wall -Wchar-subscripts -Wshadow -Wpointer-arith -Wmissing-prototypes -Wwrite-strings -D_XOPEN_SOURCE=500 -D_BSD_SOURCE -O2 -Wformat-security -Wmissing-format-attribute conftest.c >&5
conftest.c: In function `main':
conftest.c:32: warning: implicit declaration of function `exit'
configure:7731: $? = 0
configure:7733: ./conftest
configure:7736: $? = 0
configure:7751: result: yes
configure:7775: checking for sys/types.h
configure:7791: gcc -c -ansi -W -Wall -Wchar-subscripts -Wshadow -Wpointer-arith -Wmissing-prototypes -Wwrite-strings -D_XOPEN_SOURCE=500 -D_BSD_SOURCE -O2 -Wformat-security -Wmissing-format-attribute conftest.c >&5
configure:7797: $? = 0
configure:7801: test -z
|| test ! -s conftest.err
configure:7804: $? = 0
configure:7807: test -s conftest.o
configure:7810: $? = 0
configure:7821: result: yes
configure:7775: checking for sys/stat.h
configure:7791: gcc -c -ansi -W -Wall -Wchar-subscripts -Wshadow -Wpointer-arith -Wmissing-prototypes -Wwrite-strings -D_XOPEN_SOURCE=500 -D_BSD_SOURCE -O2 -Wformat-security -Wmissing-format-attribute conftest.c >&5
configure:7797: $? = 0
configure:7801: test -z
|| test ! -s conftest.err
configure:7804: $? = 0
configure:7807: test -s conftest.o
configure:7810: $? = 0
configure:7821: result: yes
configure:7775: checking for stdlib.h
configure:7791: gcc -c -ansi -W -Wall -Wchar-subscripts -Wshadow -Wpointer-arith -Wmissing-prototypes -Wwrite-strings -D_XOPEN_SOURCE=500 -D_BSD_SOURCE -O2 -Wformat-security -Wmissing-format-attribute conftest.c >&5
configure:7797: $? = 0
configure:7801: test -z
|| test ! -s conftest.err
configure:7804: $? = 0
configure:7807: test -s conftest.o
configure:7810: $? = 0
configure:7821: result: yes
configure:7775: checking for string.h
configure:7791: gcc -c -ansi -W -Wall -Wchar-subscripts -Wshadow -Wpointer-arith -Wmissing-prototypes -Wwrite-strings -D_XOPEN_SOURCE=500 -D_BSD_SOURCE -O2 -Wformat-security -Wmissing-format-attribute conftest.c >&5
configure:7797: $? = 0
configure:7801: test -z
|| test ! -s conftest.err
configure:7804: $? = 0
configure:7807: test -s conftest.o
configure:7810: $? = 0
configure:7821: result: yes
configure:7775: checking for memory.h
configure:7791: gcc -c -ansi -W -Wall -Wchar-subscripts -Wshadow -Wpointer-arith -Wmissing-prototypes -Wwrite-strings -D_XOPEN_SOURCE=500 -D_BSD_SOURCE -O2 -Wformat-security -Wmissing-format-attribute conftest.c >&5
configure:7797: $? = 0
configure:7801: test -z
|| test ! -s conftest.err
configure:7804: $? = 0
configure:7807: test -s conftest.o
configure:7810: $? = 0
configure:7821: result: yes
configure:7775: checking for strings.h
configure:7791: gcc -c -ansi -W -Wall -Wchar-subscripts -Wshadow -Wpointer-arith -Wmissing-prototypes -Wwrite-strings -D_XOPEN_SOURCE=500 -D_BSD_SOURCE -O2 -Wformat-security -Wmissing-format-attribute conftest.c >&5
configure:7797: $? = 0
configure:7801: test -z
|| test ! -s conftest.err
configure:7804: $? = 0
configure:7807: test -s conftest.o
configure:7810: $? = 0
configure:7821: result: yes
configure:7775: checking for inttypes.h
configure:7791: gcc -c -ansi -W -Wall -Wchar-subscripts -Wshadow -Wpointer-arith -Wmissing-prototypes -Wwrite-strings -D_XOPEN_SOURCE=500 -D_BSD_SOURCE -O2 -Wformat-security -Wmissing-format-attribute conftest.c >&5
configure:7797: $? = 0
configure:7801: test -z
|| test ! -s conftest.err
configure:7804: $? = 0
configure:7807: test -s conftest.o
configure:7810: $? = 0
configure:7821: result: yes
configure:7775: checking for stdint.h
configure:7791: gcc -c -ansi -W -Wall -Wchar-subscripts -Wshadow -Wpointer-arith -Wmissing-prototypes -Wwrite-strings -D_XOPEN_SOURCE=500 -D_BSD_SOURCE -O2 -Wformat-security -Wmissing-format-attribute conftest.c >&5
configure:7797: $? = 0
configure:7801: test -z
|| test ! -s conftest.err
configure:7804: $? = 0
configure:7807: test -s conftest.o
configure:7810: $? = 0
configure:7821: result: yes
configure:7775: checking for unistd.h
configure:7791: gcc -c -ansi -W -Wall -Wchar-subscripts -Wshadow -Wpointer-arith -Wmissing-prototypes -Wwrite-strings -D_XOPEN_SOURCE=500 -D_BSD_SOURCE -O2 -Wformat-security -Wmissing-format-attribute conftest.c >&5
configure:7797: $? = 0
configure:7801: test -z
|| test ! -s conftest.err
configure:7804: $? = 0
configure:7807: test -s conftest.o
configure:7810: $? = 0
configure:7821: result: yes
configure:7847: checking dlfcn.h usability
configure:7859: gcc -c -ansi -W -Wall -Wchar-subscripts -Wshadow -Wpointer-arith -Wmissing-prototypes -Wwrite-strings -D_XOPEN_SOURCE=500 -D_BSD_SOURCE -O2 -Wformat-security -Wmissing-format-attribute conftest.c >&5
configure:7865: $? = 0
configure:7869: test -z
|| test ! -s conftest.err
configure:7872: $? = 0
configure:7875: test -s conftest.o
configure:7878: $? = 0
configure:7888: result: yes
configure:7892: checking dlfcn.h presence
configure:7902: gcc -E conftest.c
configure:7908: $? = 0
configure:7928: result: yes
configure:7963: checking for dlfcn.h
configure:7970: result: yes
configure:8034: checking for g77
configure:8063: result: no
configure:8034: checking for f77
configure:8063: result: no
configure:8034: checking for xlf
configure:8063: result: no
configure:8034: checking for frt
configure:8063: result: no
configure:8034: checking for pgf77
configure:8063: result: no
configure:8034: checking for fort77
configure:8063: result: no
configure:8034: checking for fl32
configure:8063: result: no
configure:8034: checking for af77
configure:8063: result: no
configure:8034: checking for f90
configure:8063: result: no
configure:8034: checking for xlf90
configure:8063: result: no
configure:8034: checking for pgf90
configure:8063: result: no
configure:8034: checking for epcf90
configure:8063: result: no
configure:8034: checking for f95
configure:8063: result: no
configure:8034: checking for fort
configure:8063: result: no
configure:8034: checking for xlf95
configure:8063: result: no
configure:8034: checking for ifc
configure:8063: result: no
configure:8034: checking for efc
configure:8063: result: no
configure:8034: checking for pgf95
configure:8063: result: no
configure:8034: checking for lf95
configure:8063: result: no
configure:8034: checking for gfortran
configure:8063: result: no
configure:8075: checking for Fortran 77 compiler version
configure:8078: --version </dev/null >&5
./configure: line 8079: --version: command not found
configure:8081: $? = 127
configure:8083: -v </dev/null >&5
./configure: line 8084: -v: command not found
configure:8086: $? = 127
configure:8088: -V </dev/null >&5
./configure: line 8089: -V: command not found
configure:8091: $? = 127
configure:8099: checking whether we are using the GNU Fortran 77 compiler
configure:8113: -c conftest.F >&5
./configure: line 8114: -c: command not found
configure:8119: $? = 127
configure: failed program was:
| program main
| #ifndef __GNUC__
| choke me
| #endif
|
| end
configure:8145: result: no
configure:8151: checking whether accepts -g
configure:8163: -c -g conftest.f >&5
./configure: line 8164: -c: command not found
configure:8169: $? = 127
configure: failed program was:
| program main
|
| end
configure:8194: result: no
configure:8224: checking the maximum length of command line arguments
configure:8289: result: 32768
configure:8300: checking command to parse /usr/bin/nm -B output from gcc object
configure:8389: gcc -c -ansi -W -Wall -Wchar-subscripts -Wshadow -Wpointer-arith -Wmissing-prototypes -Wwrite-strings -D_XOPEN_SOURCE=500 -D_BSD_SOURCE -O2 -Wformat-security -Wmissing-format-attribute conftest.c >&5
conftest.c:5: warning: no previous prototype for `nm_test_func'
configure:8392: $? = 0
configure:8396: /usr/bin/nm -B conftest.o \| sed -n -e 's/^.*[ ]\([ABCDGIRSTW][ABCDGIRSTW]*\)[ ][ ]*\(\)\([_A-Za-z][_A-Za-z0-9]*\)$/\1 \2\3 \3/p' \> conftest.nm
configure:8399: $? = 0
configure:8451: gcc -o conftest -ansi -W -Wall -Wchar-subscripts -Wshadow -Wpointer-arith -Wmissing-prototypes -Wwrite-strings -D_XOPEN_SOURCE=500 -D_BSD_SOURCE -O2 -Wformat-security -Wmissing-format-attribute conftest.c conftstm.o >&5
configure:8454: $? = 0
configure:8492: result: ok
configure:8496: checking for objdir
configure:8511: result: .libs
configure:8601: checking for ar
configure:8617: found /usr/bin/ar
configure:8628: result: ar
configure:8681: checking for ranlib
configure:8697: found /usr/bin/ranlib
configure:8708: result: ranlib
configure:8761: checking for strip
configure:8777: found /usr/bin/strip
configure:8788: result: strip
configure:9050: checking if gcc static flag works
configure:9073: result: yes
configure:9095: checking if gcc supports -fno-rtti -fno-exceptions
configure:9113: gcc -c -ansi -W -Wall -Wchar-subscripts -Wshadow -Wpointer-arith -Wmissing-prototypes -Wwrite-strings -D_XOPEN_SOURCE=500 -D_BSD_SOURCE -O2 -Wformat-security -Wmissing-format-attribute -fno-rtti -fno-exceptions conftest.c >&5
cc1: warning: "-fno-rtti" is valid for C++ but not for C/ObjC
configure:9117: $? = 0
configure:9128: result: no
configure:9143: checking for gcc option to produce PIC
configure:9320: result: -fPIC
configure:9328: checking if gcc PIC flag -fPIC works
configure:9346: gcc -c -ansi -W -Wall -Wchar-subscripts -Wshadow -Wpointer-arith -Wmissing-prototypes -Wwrite-strings -D_XOPEN_SOURCE=500 -D_BSD_SOURCE -O2 -Wformat-security -Wmissing-format-attribute -fPIC -DPIC conftest.c >&5
configure:9350: $? = 0
configure:9361: result: yes
configure:9385: checking if gcc supports -c -o file.o
configure:9406: gcc -c -ansi -W -Wall -Wchar-subscripts -Wshadow -Wpointer-arith -Wmissing-prototypes -Wwrite-strings -D_XOPEN_SOURCE=500 -D_BSD_SOURCE -O2 -Wformat-security -Wmissing-format-attribute -o out/conftest2.o conftest.c >&5
configure:9410: $? = 0
configure:9430: result: yes
configure:9456: checking whether the gcc linker (/usr/bin/ld) supports shared libraries
configure:10304: result: yes
configure:10330: checking whether -lc should be explicitly linked in
configure:10335: gcc -c -ansi -W -Wall -Wchar-subscripts -Wshadow -Wpointer-arith -Wmissing-prototypes -Wwrite-strings -D_XOPEN_SOURCE=500 -D_BSD_SOURCE -O2 -Wformat-security -Wmissing-format-attribute conftest.c >&5
configure:10338: $? = 0
configure:10352: gcc -shared conftest.o -v -Wl,-soname -Wl,conftest -o conftest 2\>\&1 \| grep -lc \>/dev/null 2\>\&1
configure:10355: $? = 0
configure:10367: result: no
configure:10375: checking dynamic linker characteristics
configure:10915: result: GNU/Linux ld.so
configure:10919: checking how to hardcode library paths into programs
configure:10944: result: immediate
configure:10958: checking whether stripping libraries is possible
configure:10963: result: yes
configure:11089: checking for shl_load
configure:11146: gcc -o conftest -ansi -W -Wall -Wchar-subscripts -Wshadow -Wpointer-arith -Wmissing-prototypes -Wwrite-strings -D_XOPEN_SOURCE=500 -D_BSD_SOURCE -O2 -Wformat-security -Wmissing-format-attribute conftest.c >&5
/tmp/cccIWlIw.o: In function `main':conftest.c:(.text+0x11): undefined reference to `shl_load'
/tmp/cccIWlIw.o:(.data+0x0): undefined reference to `shl_load'
collect2: ld returned 1 exit status
configure:11152: $? = 1
configure: failed program was:
| /* confdefs.h. */
|
| #define PACKAGE_NAME ""
| #define PACKAGE_TARNAME ""
| #define PACKAGE_VERSION ""
| #define PACKAGE_STRING ""
| #define PACKAGE_BUGREPORT ""
| #define PACKAGE "sim"
| #define VERSION "0.9.4"
| #ifdef __cplusplus
| extern "C" void std::exit (int) throw (); using std::exit;
| #endif
| #define KDELIBSUFF ""
| #define STDC_HEADERS 1
| #define HAVE_SYS_TYPES_H 1
| #define HAVE_SYS_STAT_H 1
| #define HAVE_STDLIB_H 1
| #define HAVE_STRING_H 1
| #define HAVE_MEMORY_H 1
| #define HAVE_STRINGS_H 1
| #define HAVE_INTTYPES_H 1
| #define HAVE_STDINT_H 1
| #define HAVE_UNISTD_H 1
| #define HAVE_DLFCN_H 1
| /* end confdefs.h. */
| /* Define shl_load to an innocuous variant, in case <limits.h> declares shl_load.
| For example, HP-UX 11i <limits.h> declares gettimeofday. */
| #define shl_load innocuous_shl_load
|
| /* System header to define __stub macros and hopefully few prototypes,
| which can conflict with char shl_load (); below.
| Prefer <limits.h> to <assert.h> if __STDC__ is defined, since
| <limits.h> exists even on freestanding compilers. */
|
| #ifdef __STDC__
| # include <limits.h>
| #else
| # include <assert.h>
| #endif
|
| #undef shl_load
|
| /* Override any gcc2 internal prototype to avoid an error. */
| #ifdef __cplusplus
| extern "C"
| {
| #endif
| /* We use char because int might match the return type of a gcc2
| builtin and then its argument prototype would still apply. */
| char shl_load ();
| /* The GNU C library defines this for functions which it implements
| to always fail with ENOSYS. Some functions are actually named
| something starting with __ and the normal name is an alias. */
| #if defined (__stub_shl_load) || defined (__stub___shl_load)
| choke me
| #else
| char (*f) () = shl_load;
| #endif
| #ifdef __cplusplus
| }
| #endif
|
| int
| main ()
| {
| return f != shl_load;
| ;
| return 0;
| }
configure:11177: result: no
configure:11182: checking for shl_load in -ldld
configure:11212: gcc -o conftest -ansi -W -Wall -Wchar-subscripts -Wshadow -Wpointer-arith -Wmissing-prototypes -Wwrite-strings -D_XOPEN_SOURCE=500 -D_BSD_SOURCE -O2 -Wformat-security -Wmissing-format-attribute conftest.c -ldld >&5
/usr/bin/ld: cannot find -ldld
collect2: ld returned 1 exit status
configure:11218: $? = 1
configure: failed program was:
| /* confdefs.h. */
|
| #define PACKAGE_NAME ""
| #define PACKAGE_TARNAME ""
| #define PACKAGE_VERSION ""
| #define PACKAGE_STRING ""
| #define PACKAGE_BUGREPORT ""
| #define PACKAGE "sim"
| #define VERSION "0.9.4"
| #ifdef __cplusplus
| extern "C" void std::exit (int) throw (); using std::exit;
| #endif
| #define KDELIBSUFF ""
| #define STDC_HEADERS 1
| #define HAVE_SYS_TYPES_H 1
| #define HAVE_SYS_STAT_H 1
| #define HAVE_STDLIB_H 1
| #define HAVE_STRING_H 1
| #define HAVE_MEMORY_H 1
| #define HAVE_STRINGS_H 1
| #define HAVE_INTTYPES_H 1
| #define HAVE_STDINT_H 1
| #define HAVE_UNISTD_H 1
| #define HAVE_DLFCN_H 1
| /* end confdefs.h. */
|
| /* Override any gcc2 internal prototype to avoid an error. */
| #ifdef __cplusplus
| extern "C"
| #endif
| /* We use char because int might match the return type of a gcc2
| builtin and then its argument prototype would still apply. */
| char shl_load ();
| int
| main ()
| {
| shl_load ();
| ;
| return 0;
| }
configure:11244: result: no
configure:11249: checking for dlopen
configure:11306: gcc -o conftest -ansi -W -Wall -Wchar-subscripts -Wshadow -Wpointer-arith -Wmissing-prototypes -Wwrite-strings -D_XOPEN_SOURCE=500 -D_BSD_SOURCE -O2 -Wformat-security -Wmissing-format-attribute conftest.c >&5
/tmp/ccWfpxw8.o: In function `main':conftest.c:(.text+0x11): undefined reference to `dlopen'
/tmp/ccWfpxw8.o:(.data+0x0): undefined reference to `dlopen'
collect2: ld returned 1 exit status
configure:11312: $? = 1
configure: failed program was:
| /* confdefs.h. */
|
| #define PACKAGE_NAME ""
| #define PACKAGE_TARNAME ""
| #define PACKAGE_VERSION ""
| #define PACKAGE_STRING ""
| #define PACKAGE_BUGREPORT ""
| #define PACKAGE "sim"
| #define VERSION "0.9.4"
| #ifdef __cplusplus
| extern "C" void std::exit (int) throw (); using std::exit;
| #endif
| #define KDELIBSUFF ""
| #define STDC_HEADERS 1
| #define HAVE_SYS_TYPES_H 1
| #define HAVE_SYS_STAT_H 1
| #define HAVE_STDLIB_H 1
| #define HAVE_STRING_H 1
| #define HAVE_MEMORY_H 1
| #define HAVE_STRINGS_H 1
| #define HAVE_INTTYPES_H 1
| #define HAVE_STDINT_H 1
| #define HAVE_UNISTD_H 1
| #define HAVE_DLFCN_H 1
| /* end confdefs.h. */
| /* Define dlopen to an innocuous variant, in case <limits.h> declares dlopen.
| For example, HP-UX 11i <limits.h> declares gettimeofday. */
| #define dlopen innocuous_dlopen
|
| /* System header to define __stub macros and hopefully few prototypes,
| which can conflict with char dlopen (); below.
| Prefer <limits.h> to <assert.h> if __STDC__ is defined, since
| <limits.h> exists even on freestanding compilers. */
|
| #ifdef __STDC__
| # include <limits.h>
| #else
| # include <assert.h>
| #endif
|
| #undef dlopen
|
| /* Override any gcc2 internal prototype to avoid an error. */
| #ifdef __cplusplus
| extern "C"
| {
| #endif
| /* We use char because int might match the return type of a gcc2
| builtin and then its argument prototype would still apply. */
| char dlopen ();
| /* The GNU C library defines this for functions which it implements
| to always fail with ENOSYS. Some functions are actually named
| something starting with __ and the normal name is an alias. */
| #if defined (__stub_dlopen) || defined (__stub___dlopen)
| choke me
| #else
| char (*f) () = dlopen;
| #endif
| #ifdef __cplusplus
| }
| #endif
|
| int
| main ()
| {
| return f != dlopen;
| ;
| return 0;
| }
configure:11337: result: no
configure:11342: checking for dlopen in -ldl
configure:11372: gcc -o conftest -ansi -W -Wall -Wchar-subscripts -Wshadow -Wpointer-arith -Wmissing-prototypes -Wwrite-strings -D_XOPEN_SOURCE=500 -D_BSD_SOURCE -O2 -Wformat-security -Wmissing-format-attribute conftest.c -ldl >&5
configure:11378: $? = 0
configure:11382: test -z
|| test ! -s conftest.err
configure:11385: $? = 0
configure:11388: test -s conftest
configure:11391: $? = 0
configure:11404: result: yes
configure:11579: checking whether a program can dlopen itself
configure:11651: gcc -o conftest -ansi -W -Wall -Wchar-subscripts -Wshadow -Wpointer-arith -Wmissing-prototypes -Wwrite-strings -D_XOPEN_SOURCE=500 -D_BSD_SOURCE -O2 -Wformat-security -Wmissing-format-attribute -DHAVE_DLFCN_H -Wl,--export-dynamic conftest.c -ldl >&5
configure:11634: warning: no previous prototype for `fnord'
configure: In function `fnord':
configure:11634: warning: unused variable `i'
configure: In function `main':
configure:11647: warning: implicit declaration of function `exit'
configure:11654: $? = 0
configure:11672: result: yes
configure:11677: checking whether a statically linked program can dlopen itself
configure:11749: gcc -o conftest -ansi -W -Wall -Wchar-subscripts -Wshadow -Wpointer-arith -Wmissing-prototypes -Wwrite-strings -D_XOPEN_SOURCE=500 -D_BSD_SOURCE -O2 -Wformat-security -Wmissing-format-attribute -DHAVE_DLFCN_H -Wl,--export-dynamic conftest.c -ldl >&5
configure:11732: warning: no previous prototype for `fnord'
configure: In function `fnord':
configure:11732: warning: unused variable `i'
configure: In function `main':
configure:11745: warning: implicit declaration of function `exit'
configure:11752: $? = 0
configure:11770: result: yes
configure:11793: checking if libtool supports shared libraries
configure:11795: result: yes
configure:11798: checking whether to build shared libraries
configure:11856: result: yes
configure:11859: checking whether to build static libraries
configure:11863: result: no
configure:11955: creating libtool
configure:12502: checking for ld used by g++
configure:12569: result: /usr/bin/ld
configure:12578: checking if the linker (/usr/bin/ld) is GNU ld
configure:12593: result: yes
configure:12644: checking whether the g++ linker (/usr/bin/ld) supports shared libraries
configure:13472: result: yes
configure:13494: g++ -c -Wnon-virtual-dtor -Wno-long-long -Wundef -ansi -D_XOPEN_SOURCE=500 -D_BSD_SOURCE -Wcast-align -Wconversion -Wchar-subscripts -Wall -W -Wpointer-arith -Wwrite-strings -O2 -Wformat-security -Wmissing-format-attribute -fno-exceptions -fno-check-new -fno-common conftest.cc >&5
configure:13497: $? = 0
configure:13593: checking for g++ option to produce PIC
configure:13845: result: -fPIC
configure:13853: checking if g++ PIC flag -fPIC works
configure:13871: g++ -c -Wnon-virtual-dtor -Wno-long-long -Wundef -ansi -D_XOPEN_SOURCE=500 -D_BSD_SOURCE -Wcast-align -Wconversion -Wchar-subscripts -Wall -W -Wpointer-arith -Wwrite-strings -O2 -Wformat-security -Wmissing-format-attribute -fno-exceptions -fno-check-new -fno-common -fPIC -DPIC conftest.cc >&5
configure:13875: $? = 0
configure:13886: result: yes
configure:13910: checking if g++ supports -c -o file.o
configure:13931: g++ -c -Wnon-virtual-dtor -Wno-long-long -Wundef -ansi -D_XOPEN_SOURCE=500 -D_BSD_SOURCE -Wcast-align -Wconversion -Wchar-subscripts -Wall -W -Wpointer-arith -Wwrite-strings -O2 -Wformat-security -Wmissing-format-attribute -fno-exceptions -fno-check-new -fno-common -o out/conftest2.o conftest.cc >&5
configure:13935: $? = 0
configure:13955: result: yes
configure:13981: checking whether the g++ linker (/usr/bin/ld) supports shared libraries
configure:14006: result: yes
configure:14077: checking dynamic linker characteristics
configure:14617: result: GNU/Linux ld.so
configure:14621: checking how to hardcode library paths into programs
configure:14646: result: immediate
configure:14660: checking whether stripping libraries is possible
configure:14665: result: yes
configure:14791: checking for shl_load
configure:14879: result: no
configure:14884: checking for shl_load in -ldld
configure:14946: result: no
configure:14951: checking for dlopen
configure:15039: result: no
configure:15044: checking for dlopen in -ldl
configure:15106: result: yes
configure:15281: checking whether a program can dlopen itself
configure:15374: result: yes
configure:15379: checking whether a statically linked program can dlopen itself
configure:15472: result: yes
configure:21932: checking for msgfmt
configure:21959: result: /usr/bin/msgfmt
configure:21968: checking for gmsgfmt
configure:21999: result: /usr/bin/msgfmt
configure:22018: checking for xgettext
configure:22045: result: /usr/bin/xgettext
configure:22176: checking for strlcat
configure:22224: g++ -c -Wnon-virtual-dtor -Wno-long-long -Wundef -ansi -D_XOPEN_SOURCE=500 -D_BSD_SOURCE -Wcast-align -Wconversion -Wchar-subscripts -Wall -W -Wpointer-arith -Wwrite-strings -O2 -Wformat-security -Wmissing-format-attribute -fno-exceptions -fno-check-new -fno-common -pedantic-errors conftest.cc >&5
conftest.cc: In function `int main()':
conftest.cc:37: error: `strlcat' undeclared (first use this function)
conftest.cc:37: error: (Each undeclared identifier is reported only once for
each function it appears in.)
configure:22230: $? = 1
configure: failed program was:
| /* confdefs.h. */
|
| #define PACKAGE_NAME ""
| #define PACKAGE_TARNAME ""
| #define PACKAGE_VERSION ""
| #define PACKAGE_STRING ""
| #define PACKAGE_BUGREPORT ""
| #define PACKAGE "sim"
| #define VERSION "0.9.4"
| #ifdef __cplusplus
| extern "C" void std::exit (int) throw (); using std::exit;
| #endif
| #define KDELIBSUFF ""
| #define STDC_HEADERS 1
| #define HAVE_SYS_TYPES_H 1
| #define HAVE_SYS_STAT_H 1
| #define HAVE_STDLIB_H 1
| #define HAVE_STRING_H 1
| #define HAVE_MEMORY_H 1
| #define HAVE_STRINGS_H 1
| #define HAVE_INTTYPES_H 1
| #define HAVE_STDINT_H 1
| #define HAVE_UNISTD_H 1
| #define HAVE_DLFCN_H 1
| /* end confdefs.h. */
|
|
| #include <string.h>
|
|
| int
| main ()
| {
|
| char buf[20];
| buf[0]='\0';
| strlcat(buf, "KDE function test", sizeof(buf));
|
|
| ;
| return 0;
| }
configure:22265: result: no
configure:22268: checking if strlcat needs custom prototype
configure:22372: result: yes - in libkdefakes
configure:22397: checking for strlcpy
configure:22444: g++ -c -Wnon-virtual-dtor -Wno-long-long -Wundef -ansi -D_XOPEN_SOURCE=500 -D_BSD_SOURCE -Wcast-align -Wconversion -Wchar-subscripts -Wall -W -Wpointer-arith -Wwrite-strings -O2 -Wformat-security -Wmissing-format-attribute -fno-exceptions -fno-check-new -fno-common -pedantic-errors conftest.cc >&5
conftest.cc: In function `int main()':
conftest.cc:36: error: `strlcpy' undeclared (first use this function)
conftest.cc:36: error: (Each undeclared identifier is reported only once for
each function it appears in.)
configure:22450: $? = 1
configure: failed program was:
| /* confdefs.h. */
|
| #define PACKAGE_NAME ""
| #define PACKAGE_TARNAME ""
| #define PACKAGE_VERSION ""
| #define PACKAGE_STRING ""
| #define PACKAGE_BUGREPORT ""
| #define PACKAGE "sim"
| #define VERSION "0.9.4"
| #ifdef __cplusplus
| extern "C" void std::exit (int) throw (); using std::exit;
| #endif
| #define KDELIBSUFF ""
| #define STDC_HEADERS 1
| #define HAVE_SYS_TYPES_H 1
| #define HAVE_SYS_STAT_H 1
| #define HAVE_STDLIB_H 1
| #define HAVE_STRING_H 1
| #define HAVE_MEMORY_H 1
| #define HAVE_STRINGS_H 1
| #define HAVE_INTTYPES_H 1
| #define HAVE_STDINT_H 1
| #define HAVE_UNISTD_H 1
| #define HAVE_DLFCN_H 1
| /* end confdefs.h. */
|
|
| #include <string.h>
|
|
| int
| main ()
| {
|
| char buf[20];
| strlcpy(buf, "KDE function test", sizeof(buf));
|
|
| ;
| return 0;
| }
configure:22485: result: no
configure:22488: checking if strlcpy needs custom prototype
configure:22591: result: yes - in libkdefakes
configure:22615: checking for main in -lutil
configure:22639: gcc -o conftest -ansi -W -Wall -Wchar-subscripts -Wshadow -Wpointer-arith -Wmissing-prototypes -Wwrite-strings -D_XOPEN_SOURCE=500 -D_BSD_SOURCE -O2 -Wformat-security -Wmissing-format-attribute conftest.c -lutil >&5
configure:22645: $? = 0
configure:22649: test -z
|| test ! -s conftest.err
configure:22652: $? = 0
configure:22655: test -s conftest
configure:22658: $? = 0
configure:22671: result: yes
configure:22677: checking for main in -lcompat
configure:22701: gcc -o conftest -ansi -W -Wall -Wchar-subscripts -Wshadow -Wpointer-arith -Wmissing-prototypes -Wwrite-strings -D_XOPEN_SOURCE=500 -D_BSD_SOURCE -O2 -Wformat-security -Wmissing-format-attribute conftest.c -lcompat >&5
/usr/bin/ld: cannot find -lcompat
collect2: ld returned 1 exit status
configure:22707: $? = 1
configure: failed program was:
| /* confdefs.h. */
|
| #define PACKAGE_NAME ""
| #define PACKAGE_TARNAME ""
| #define PACKAGE_VERSION ""
| #define PACKAGE_STRING ""
| #define PACKAGE_BUGREPORT ""
| #define PACKAGE "sim"
| #define VERSION "0.9.4"
| #ifdef __cplusplus
| extern "C" void std::exit (int) throw (); using std::exit;
| #endif
| #define KDELIBSUFF ""
| #define STDC_HEADERS 1
| #define HAVE_SYS_TYPES_H 1
| #define HAVE_SYS_STAT_H 1
| #define HAVE_STDLIB_H 1
| #define HAVE_STRING_H 1
| #define HAVE_MEMORY_H 1
| #define HAVE_STRINGS_H 1
| #define HAVE_INTTYPES_H 1
| #define HAVE_STDINT_H 1
| #define HAVE_UNISTD_H 1
| #define HAVE_DLFCN_H 1
| /* end confdefs.h. */
|
|
| int
| main ()
| {
| main ();
| ;
| return 0;
| }
configure:22733: result: no
configure:22740: checking for crypt in -lcrypt
configure:22770: gcc -o conftest -ansi -W -Wall -Wchar-subscripts -Wshadow -Wpointer-arith -Wmissing-prototypes -Wwrite-strings -D_XOPEN_SOURCE=500 -D_BSD_SOURCE -O2 -Wformat-security -Wmissing-format-attribute conftest.c -lcrypt >&5
configure:22776: $? = 0
configure:22780: test -z
|| test ! -s conftest.err
configure:22783: $? = 0
configure:22786: test -s conftest
configure:22789: $? = 0
configure:22802: result: yes
configure:22896: checking for socklen_t
configure:22935: g++ -c -Wnon-virtual-dtor -Wno-long-long -Wundef -ansi -D_XOPEN_SOURCE=500 -D_BSD_SOURCE -Wcast-align -Wconversion -Wchar-subscripts -Wall -W -Wpointer-arith -Wwrite-strings -O2 -Wformat-security -Wmissing-format-attribute -fno-exceptions -fno-check-new -fno-common conftest.cc >&5
configure:22941: $? = 0
configure:22945: test -z
|| test ! -s conftest.err
configure:22948: $? = 0
configure:22951: test -s conftest.o
configure:22954: $? = 0
configure:23026: result: socklen_t
configure:23042: checking for dnet_ntoa in -ldnet
configure:23072: gcc -o conftest -ansi -W -Wall -Wchar-subscripts -Wshadow -Wpointer-arith -Wmissing-prototypes -Wwrite-strings -D_XOPEN_SOURCE=500 -D_BSD_SOURCE -O2 -Wformat-security -Wmissing-format-attribute conftest.c -ldnet >&5
/usr/bin/ld: cannot find -ldnet
collect2: ld returned 1 exit status
configure:23078: $? = 1
configure: failed program was:
| /* confdefs.h. */
|
| #define PACKAGE_NAME ""
| #define PACKAGE_TARNAME ""
| #define PACKAGE_VERSION ""
| #define PACKAGE_STRING ""
| #define PACKAGE_BUGREPORT ""
| #define PACKAGE "sim"
| #define VERSION "0.9.4"
| #ifdef __cplusplus
| extern "C" void std::exit (int) throw (); using std::exit;
| #endif
| #define KDELIBSUFF ""
| #define STDC_HEADERS 1
| #define HAVE_SYS_TYPES_H 1
| #define HAVE_SYS_STAT_H 1
| #define HAVE_STDLIB_H 1
| #define HAVE_STRING_H 1
| #define HAVE_MEMORY_H 1
| #define HAVE_STRINGS_H 1
| #define HAVE_INTTYPES_H 1
| #define HAVE_STDINT_H 1
| #define HAVE_UNISTD_H 1
| #define HAVE_DLFCN_H 1
| #define HAVE_CRYPT 1
| #define ksize_t socklen_t
| /* end confdefs.h. */
|
| /* Override any gcc2 internal prototype to avoid an error. */
| #ifdef __cplusplus
| extern "C"
| #endif
| /* We use char because int might match the return type of a gcc2
| builtin and then its argument prototype would still apply. */
| char dnet_ntoa ();
| int
| main ()
| {
| dnet_ntoa ();
| ;
| return 0;
| }
configure:23104: result: no
configure:23111: checking for dnet_ntoa in -ldnet_stub
configure:23141: gcc -o conftest -ansi -W -Wall -Wchar-subscripts -Wshadow -Wpointer-arith -Wmissing-prototypes -Wwrite-strings -D_XOPEN_SOURCE=500 -D_BSD_SOURCE -O2 -Wformat-security -Wmissing-format-attribute conftest.c -ldnet_stub >&5
/usr/bin/ld: cannot find -ldnet_stub
collect2: ld returned 1 exit status
configure:23147: $? = 1
configure: failed program was:
| /* confdefs.h. */
|
| #define PACKAGE_NAME ""
| #define PACKAGE_TARNAME ""
| #define PACKAGE_VERSION ""
| #define PACKAGE_STRING ""
| #define PACKAGE_BUGREPORT ""
| #define PACKAGE "sim"
| #define VERSION "0.9.4"
| #ifdef __cplusplus
| extern "C" void std::exit (int) throw (); using std::exit;
| #endif
| #define KDELIBSUFF ""
| #define STDC_HEADERS 1
| #define HAVE_SYS_TYPES_H 1
| #define HAVE_SYS_STAT_H 1
| #define HAVE_STDLIB_H 1
| #define HAVE_STRING_H 1
| #define HAVE_MEMORY_H 1
| #define HAVE_STRINGS_H 1
| #define HAVE_INTTYPES_H 1
| #define HAVE_STDINT_H 1
| #define HAVE_UNISTD_H 1
| #define HAVE_DLFCN_H 1
| #define HAVE_CRYPT 1
| #define ksize_t socklen_t
| /* end confdefs.h. */
|
| /* Override any gcc2 internal prototype to avoid an error. */
| #ifdef __cplusplus
| extern "C"
| #endif
| /* We use char because int might match the return type of a gcc2
| builtin and then its argument prototype would still apply. */
| char dnet_ntoa ();
| int
| main ()
| {
| dnet_ntoa ();
| ;
| return 0;
| }
configure:23173: result: no
configure:23180: checking for inet_ntoa
configure:23237: gcc -o conftest -ansi -W -Wall -Wchar-subscripts -Wshadow -Wpointer-arith -Wmissing-prototypes -Wwrite-strings -D_XOPEN_SOURCE=500 -D_BSD_SOURCE -O2 -Wformat-security -Wmissing-format-attribute conftest.c >&5
configure:23243: $? = 0
configure:23247: test -z
|| test ! -s conftest.err
configure:23250: $? = 0
configure:23253: test -s conftest
configure:23256: $? = 0
configure:23268: result: yes
configure:23341: checking for connect
configure:23398: gcc -o conftest -ansi -W -Wall -Wchar-subscripts -Wshadow -Wpointer-arith -Wmissing-prototypes -Wwrite-strings -D_XOPEN_SOURCE=500 -D_BSD_SOURCE -O2 -Wformat-security -Wmissing-format-attribute conftest.c >&5
configure:23404: $? = 0
configure:23408: test -z
|| test ! -s conftest.err
configure:23411: $? = 0
configure:23414: test -s conftest
configure:23417: $? = 0
configure:23429: result: yes
configure:23503: checking for remove
configure:23560: gcc -o conftest -ansi -W -Wall -Wchar-subscripts -Wshadow -Wpointer-arith -Wmissing-prototypes -Wwrite-strings -D_XOPEN_SOURCE=500 -D_BSD_SOURCE -O2 -Wformat-security -Wmissing-format-attribute conftest.c >&5
configure:23566: $? = 0
configure:23570: test -z
|| test ! -s conftest.err
configure:23573: $? = 0
configure:23576: test -s conftest
configure:23579: $? = 0
configure:23591: result: yes
configure:23666: checking for shmat
configure:23723: gcc -o conftest -ansi -W -Wall -Wchar-subscripts -Wshadow -Wpointer-arith -Wmissing-prototypes -Wwrite-strings -D_XOPEN_SOURCE=500 -D_BSD_SOURCE -O2 -Wformat-security -Wmissing-format-attribute conftest.c >&5
configure:23729: $? = 0
configure:23733: test -z
|| test ! -s conftest.err
configure:23736: $? = 0
configure:23739: test -s conftest
configure:23742: $? = 0
configure:23754: result: yes
configure:23837: checking for sys/types.h
configure:23842: result: yes
configure:23837: checking for stdint.h
configure:23842: result: yes
configure:23998: checking sys/bitypes.h usability
configure:24010: gcc -c -ansi -W -Wall -Wchar-subscripts -Wshadow -Wpointer-arith -Wmissing-prototypes -Wwrite-strings -D_XOPEN_SOURCE=500 -D_BSD_SOURCE -O2 -Wformat-security -Wmissing-format-attribute conftest.c >&5
configure:24016: $? = 0
configure:24020: test -z
|| test ! -s conftest.err
configure:24023: $? = 0
configure:24026: test -s conftest.o
configure:24029: $? = 0
configure:24039: result: yes
configure:24043: checking sys/bitypes.h presence
configure:24053: gcc -E conftest.c
configure:24059: $? = 0
configure:24079: result: yes
configure:24114: checking for sys/bitypes.h
configure:24121: result: yes
configure:24136: checking for poll in -lpoll
configure:24166: gcc -o conftest -ansi -W -Wall -Wchar-subscripts -Wshadow -Wpointer-arith -Wmissing-prototypes -Wwrite-strings -D_XOPEN_SOURCE=500 -D_BSD_SOURCE -O2 -Wformat-security -Wmissing-format-attribute conftest.c -lpoll >&5
/usr/bin/ld: cannot find -lpoll
collect2: ld returned 1 exit status
configure:24172: $? = 1
configure: failed program was:
| /* confdefs.h. */
|
| #define PACKAGE_NAME ""
| #define PACKAGE_TARNAME ""
| #define PACKAGE_VERSION ""
| #define PACKAGE_STRING ""
| #define PACKAGE_BUGREPORT ""
| #define PACKAGE "sim"
| #define VERSION "0.9.4"
| #ifdef __cplusplus
| extern "C" void std::exit (int) throw (); using std::exit;
| #endif
| #define KDELIBSUFF ""
| #define STDC_HEADERS 1
| #define HAVE_SYS_TYPES_H 1
| #define HAVE_SYS_STAT_H 1
| #define HAVE_STDLIB_H 1
| #define HAVE_STRING_H 1
| #define HAVE_MEMORY_H 1
| #define HAVE_STRINGS_H 1
| #define HAVE_INTTYPES_H 1
| #define HAVE_STDINT_H 1
| #define HAVE_UNISTD_H 1
| #define HAVE_DLFCN_H 1
| #define HAVE_CRYPT 1
| #define ksize_t socklen_t
| #define HAVE_SYS_TYPES_H 1
| #define HAVE_STDINT_H 1
| #define HAVE_SYS_BITYPES_H 1
| /* end confdefs.h. */
|
| /* Override any gcc2 internal prototype to avoid an error. */
| #ifdef __cplusplus
| extern "C"
| #endif
| /* We use char because int might match the return type of a gcc2
| builtin and then its argument prototype would still apply. */
| char poll ();
| int
| main ()
| {
| poll ();
| ;
| return 0;
| }
configure:24198: result: no
configure:24206: checking if res_init needs -lresolv
configure:24233: gcc -o conftest -ansi -W -Wall -Wchar-subscripts -Wshadow -Wpointer-arith -Wmissing-prototypes -Wwrite-strings -D_XOPEN_SOURCE=500 -D_BSD_SOURCE -O2 -Wformat-security -Wmissing-format-attribute conftest.c -lresolv >&5
configure:24239: $? = 0
configure:24243: test -z
|| test ! -s conftest.err
configure:24246: $? = 0
configure:24249: test -s conftest
configure:24252: $? = 0
configure:24256: result: yes
configure:24277: checking if res_init is available
configure:24302: gcc -c -ansi -W -Wall -Wchar-subscripts -Wshadow -Wpointer-arith -Wmissing-prototypes -Wwrite-strings -D_XOPEN_SOURCE=500 -D_BSD_SOURCE -O2 -Wformat-security -Wmissing-format-attribute conftest.c >&5
configure:24308: $? = 0
configure:24312: test -z
|| test ! -s conftest.err
configure:24315: $? = 0
configure:24318: test -s conftest.o
configure:24321: $? = 0
configure:24324: result: yes
configure:24346: checking for killpg in -lucb
configure:24376: gcc -o conftest -ansi -W -Wall -Wchar-subscripts -Wshadow -Wpointer-arith -Wmissing-prototypes -Wwrite-strings -D_XOPEN_SOURCE=500 -D_BSD_SOURCE -O2 -Wformat-security -Wmissing-format-attribute conftest.c -lucb >&5
/usr/bin/ld: cannot find -lucb
collect2: ld returned 1 exit status
configure:24382: $? = 1
configure: failed program was:
| /* confdefs.h. */
|
| #define PACKAGE_NAME ""
| #define PACKAGE_TARNAME ""
| #define PACKAGE_VERSION ""
| #define PACKAGE_STRING ""
| #define PACKAGE_BUGREPORT ""
| #define PACKAGE "sim"
| #define VERSION "0.9.4"
| #ifdef __cplusplus
| extern "C" void std::exit (int) throw (); using std::exit;
| #endif
| #define KDELIBSUFF ""
| #define STDC_HEADERS 1
| #define HAVE_SYS_TYPES_H 1
| #define HAVE_SYS_STAT_H 1
| #define HAVE_STDLIB_H 1
| #define HAVE_STRING_H 1
| #define HAVE_MEMORY_H 1
| #define HAVE_STRINGS_H 1
| #define HAVE_INTTYPES_H 1
| #define HAVE_STDINT_H 1
| #define HAVE_UNISTD_H 1
| #define HAVE_DLFCN_H 1
| #define HAVE_CRYPT 1
| #define ksize_t socklen_t
| #define HAVE_SYS_TYPES_H 1
| #define HAVE_STDINT_H 1
| #define HAVE_SYS_BITYPES_H 1
| #define HAVE_RES_INIT 1
| #define HAVE_RES_INIT 1
| /* end confdefs.h. */
|
| /* Override any gcc2 internal prototype to avoid an error. */
| #ifdef __cplusplus
| extern "C"
| #endif
| /* We use char because int might match the return type of a gcc2
| builtin and then its argument prototype would still apply. */
| char killpg ();
| int
| main ()
| {
| killpg ();
| ;
| return 0;
| }
configure:24408: result: no
configure:24491: checking for int
configure:24515: gcc -c -ansi -W -Wall -Wchar-subscripts -Wshadow -Wpointer-arith -Wmissing-prototypes -Wwrite-strings -D_XOPEN_SOURCE=500 -D_BSD_SOURCE -O2 -Wformat-security -Wmissing-format-attribute conftest.c >&5
configure:24521: $? = 0
configure:24525: test -z
|| test ! -s conftest.err
configure:24528: $? = 0
configure:24531: test -s conftest.o
configure:24534: $? = 0
configure:24545: result: yes
configure:24548: checking size of int
configure:24867: gcc -o conftest -ansi -W -Wall -Wchar-subscripts -Wshadow -Wpointer-arith -Wmissing-prototypes -Wwrite-strings -D_XOPEN_SOURCE=500 -D_BSD_SOURCE -O2 -Wformat-security -Wmissing-format-attribute conftest.c >&5
conftest.c:67: warning: no previous prototype for `longval'
conftest.c:68: warning: no previous prototype for `ulongval'
configure:24870: $? = 0
configure:24872: ./conftest
configure:24875: $? = 0
configure:24898: result: 4
configure:24904: checking for short
configure:24928: gcc -c -ansi -W -Wall -Wchar-subscripts -Wshadow -Wpointer-arith -Wmissing-prototypes -Wwrite-strings -D_XOPEN_SOURCE=500 -D_BSD_SOURCE -O2 -Wformat-security -Wmissing-format-attribute conftest.c >&5
configure:24934: $? = 0
configure:24938: test -z
|| test ! -s conftest.err
configure:24941: $? = 0
configure:24944: test -s conftest.o
configure:24947: $? = 0
configure:24958: result: yes
configure:24961: checking size of short
configure:25280: gcc -o conftest -ansi -W -Wall -Wchar-subscripts -Wshadow -Wpointer-arith -Wmissing-prototypes -Wwrite-strings -D_XOPEN_SOURCE=500 -D_BSD_SOURCE -O2 -Wformat-security -Wmissing-format-attribute conftest.c >&5
conftest.c:68: warning: no previous prototype for `longval'
conftest.c:69: warning: no previous prototype for `ulongval'
configure:25283: $? = 0
configure:25285: ./conftest
configure:25288: $? = 0
configure:25311: result: 2
configure:25317: checking for long
configure:25341: gcc -c -ansi -W -Wall -Wchar-subscripts -Wshadow -Wpointer-arith -Wmissing-prototypes -Wwrite-strings -D_XOPEN_SOURCE=500 -D_BSD_SOURCE -O2 -Wformat-security -Wmissing-format-attribute conftest.c >&5
configure:25347: $? = 0
configure:25351: test -z
|| test ! -s conftest.err
configure:25354: $? = 0
configure:25357: test -s conftest.o
configure:25360: $? = 0
configure:25371: result: yes
configure:25374: checking size of long
configure:25693: gcc -o conftest -ansi -W -Wall -Wchar-subscripts -Wshadow -Wpointer-arith -Wmissing-prototypes -Wwrite-strings -D_XOPEN_SOURCE=500 -D_BSD_SOURCE -O2 -Wformat-security -Wmissing-format-attribute conftest.c >&5
conftest.c:69: warning: no previous prototype for `longval'
conftest.c:70: warning: no previous prototype for `ulongval'
configure:25696: $? = 0
configure:25698: ./conftest
configure:25701: $? = 0
configure:25724: result: 4
configure:25730: checking for char *
configure:25754: gcc -c -ansi -W -Wall -Wchar-subscripts -Wshadow -Wpointer-arith -Wmissing-prototypes -Wwrite-strings -D_XOPEN_SOURCE=500 -D_BSD_SOURCE -O2 -Wformat-security -Wmissing-format-attribute conftest.c >&5
configure:25760: $? = 0
configure:25764: test -z
|| test ! -s conftest.err
configure:25767: $? = 0
configure:25770: test -s conftest.o
configure:25773: $? = 0
configure:25784: result: yes
configure:25787: checking size of char *
configure:26106: gcc -o conftest -ansi -W -Wall -Wchar-subscripts -Wshadow -Wpointer-arith -Wmissing-prototypes -Wwrite-strings -D_XOPEN_SOURCE=500 -D_BSD_SOURCE -O2 -Wformat-security -Wmissing-format-attribute conftest.c >&5
conftest.c:70: warning: no previous prototype for `longval'
conftest.c:71: warning: no previous prototype for `ulongval'
configure:26109: $? = 0
configure:26111: ./conftest
configure:26114: $? = 0
configure:26137: result: 4
configure:26145: checking for dlopen in -ldl
configure:26207: result: yes
configure:26217: checking for shl_unload in -ldld
configure:26247: gcc -o conftest -ansi -W -Wall -Wchar-subscripts -Wshadow -Wpointer-arith -Wmissing-prototypes -Wwrite-strings -D_XOPEN_SOURCE=500 -D_BSD_SOURCE -O2 -Wformat-security -Wmissing-format-attribute conftest.c -ldld >&5
/usr/bin/ld: cannot find -ldld
collect2: ld returned 1 exit status
configure:26253: $? = 1
configure: failed program was:
| /* confdefs.h. */
|
| #define PACKAGE_NAME ""
| #define PACKAGE_TARNAME ""
| #define PACKAGE_VERSION ""
| #define PACKAGE_STRING ""
| #define PACKAGE_BUGREPORT ""
| #define PACKAGE "sim"
| #define VERSION "0.9.4"
| #ifdef __cplusplus
| extern "C" void std::exit (int) throw (); using std::exit;
| #endif
| #define KDELIBSUFF ""
| #define STDC_HEADERS 1
| #define HAVE_SYS_TYPES_H 1
| #define HAVE_SYS_STAT_H 1
| #define HAVE_STDLIB_H 1
| #define HAVE_STRING_H 1
| #define HAVE_MEMORY_H 1
| #define HAVE_STRINGS_H 1
| #define HAVE_INTTYPES_H 1
| #define HAVE_STDINT_H 1
| #define HAVE_UNISTD_H 1
| #define HAVE_DLFCN_H 1
| #define HAVE_CRYPT 1
| #define ksize_t socklen_t
| #define HAVE_SYS_TYPES_H 1
| #define HAVE_STDINT_H 1
| #define HAVE_SYS_BITYPES_H 1
| #define HAVE_RES_INIT 1
| #define HAVE_RES_INIT 1
| #define SIZEOF_INT 4
| #define SIZEOF_SHORT 2
| #define SIZEOF_LONG 4
| #define SIZEOF_CHAR_P 4
| /* end confdefs.h. */
|
| /* Override any gcc2 internal prototype to avoid an error. */
| #ifdef __cplusplus
| extern "C"
| #endif
| /* We use char because int might match the return type of a gcc2
| builtin and then its argument prototype would still apply. */
| char shl_unload ();
| int
| main ()
| {
| shl_unload ();
| ;
| return 0;
| }
configure:26279: result: no
configure:26294: checking for size_t
configure:26318: gcc -c -ansi -W -Wall -Wchar-subscripts -Wshadow -Wpointer-arith -Wmissing-prototypes -Wwrite-strings -D_XOPEN_SOURCE=500 -D_BSD_SOURCE -O2 -Wformat-security -Wmissing-format-attribute conftest.c >&5
configure:26324: $? = 0
configure:26328: test -z
|| test ! -s conftest.err
configure:26331: $? = 0
configure:26334: test -s conftest.o
configure:26337: $? = 0
configure:26348: result: yes
configure:26351: checking size of size_t
configure:26670: gcc -o conftest -ansi -W -Wall -Wchar-subscripts -Wshadow -Wpointer-arith -Wmissing-prototypes -Wwrite-strings -D_XOPEN_SOURCE=500 -D_BSD_SOURCE -O2 -Wformat-security -Wmissing-format-attribute conftest.c >&5
conftest.c:71: warning: no previous prototype for `longval'
conftest.c:72: warning: no previous prototype for `ulongval'
configure:26673: $? = 0
configure:26675: ./conftest
configure:26678: $? = 0
configure:26701: result: 4
configure:26708: checking for unsigned long
configure:26732: gcc -c -ansi -W -Wall -Wchar-subscripts -Wshadow -Wpointer-arith -Wmissing-prototypes -Wwrite-strings -D_XOPEN_SOURCE=500 -D_BSD_SOURCE -O2 -Wformat-security -Wmissing-format-attribute conftest.c >&5
configure:26738: $? = 0
configure:26742: test -z
|| test ! -s conftest.err
configure:26745: $? = 0
configure:26748: test -s conftest.o
configure:26751: $? = 0
configure:26762: result: yes
configure:26765: checking size of unsigned long
configure:27084: gcc -o conftest -ansi -W -Wall -Wchar-subscripts -Wshadow -Wpointer-arith -Wmissing-prototypes -Wwrite-strings -D_XOPEN_SOURCE=500 -D_BSD_SOURCE -O2 -Wformat-security -Wmissing-format-attribute conftest.c >&5
conftest.c:72: warning: no previous prototype for `longval'
conftest.c:73: warning: no previous prototype for `ulongval'
configure:27087: $? = 0
configure:27089: ./conftest
configure:27092: $? = 0
configure:27115: result: 4
configure:27123: checking sizeof size_t == sizeof unsigned long
configure:27145: gcc -c -ansi -W -Wall -Wchar-subscripts -Wshadow -Wpointer-arith -Wmissing-prototypes -Wwrite-strings -D_XOPEN_SOURCE=500 -D_BSD_SOURCE -O2 -Wformat-security -Wmissing-format-attribute conftest.c >&5
configure:27151: $? = 0
configure:27155: test -z
|| test ! -s conftest.err
configure:27158: $? = 0
configure:27161: test -s conftest.o
configure:27164: $? = 0
configure:27166: result: yes
configure:27204: checking crt_externs.h usability
configure:27216: gcc -c -ansi -W -Wall -Wchar-subscripts -Wshadow -Wpointer-arith -Wmissing-prototypes -Wwrite-strings -D_XOPEN_SOURCE=500 -D_BSD_SOURCE -O2 -Wformat-security -Wmissing-format-attribute conftest.c >&5
conftest.c:73:25: crt_externs.h: No such file or directory
configure:27222: $? = 1
configure: failed program was:
| /* confdefs.h. */
|
| #define PACKAGE_NAME ""
| #define PACKAGE_TARNAME ""
| #define PACKAGE_VERSION ""
| #define PACKAGE_STRING ""
| #define PACKAGE_BUGREPORT ""
| #define PACKAGE "sim"
| #define VERSION "0.9.4"
| #ifdef __cplusplus
| extern "C" void std::exit (int) throw (); using std::exit;
| #endif
| #define KDELIBSUFF ""
| #define STDC_HEADERS 1
| #define HAVE_SYS_TYPES_H 1
| #define HAVE_SYS_STAT_H 1
| #define HAVE_STDLIB_H 1
| #define HAVE_STRING_H 1
| #define HAVE_MEMORY_H 1
| #define HAVE_STRINGS_H 1
| #define HAVE_INTTYPES_H 1
| #define HAVE_STDINT_H 1
| #define HAVE_UNISTD_H 1
| #define HAVE_DLFCN_H 1
| #define HAVE_CRYPT 1
| #define ksize_t socklen_t
| #define HAVE_SYS_TYPES_H 1
| #define HAVE_STDINT_H 1
| #define HAVE_SYS_BITYPES_H 1
| #define HAVE_RES_INIT 1
| #define HAVE_RES_INIT 1
| #define SIZEOF_INT 4
| #define SIZEOF_SHORT 2
| #define SIZEOF_LONG 4
| #define SIZEOF_CHAR_P 4
| #define SIZEOF_SIZE_T 4
| #define SIZEOF_UNSIGNED_LONG 4
| /* end confdefs.h. */
| #include <stdio.h>
| #if HAVE_SYS_TYPES_H
| # include <sys/types.h>
| #endif
| #if HAVE_SYS_STAT_H
| # include <sys/stat.h>
| #endif
| #if STDC_HEADERS
| # include <stdlib.h>
| # include <stddef.h>
| #else
| # if HAVE_STDLIB_H
| # include <stdlib.h>
| # endif
| #endif
| #if HAVE_STRING_H
| # if !STDC_HEADERS && HAVE_MEMORY_H
| # include <memory.h>
| # endif
| # include <string.h>
| #endif
| #if HAVE_STRINGS_H
| # include <strings.h>
| #endif
| #if HAVE_INTTYPES_H
| # include <inttypes.h>
| #else
| # if HAVE_STDINT_H
| # include <stdint.h>
| # endif
| #endif
| #if HAVE_UNISTD_H
| # include <unistd.h>
| #endif
| #include <crt_externs.h>
configure:27245: result: no
configure:27249: checking crt_externs.h presence
configure:27259: gcc -E conftest.c
conftest.c:39:25: crt_externs.h: No such file or directory
configure:27265: $? = 1
configure: failed program was:
| /* confdefs.h. */
|
| #define PACKAGE_NAME ""
| #define PACKAGE_TARNAME ""
| #define PACKAGE_VERSION ""
| #define PACKAGE_STRING ""
| #define PACKAGE_BUGREPORT ""
| #define PACKAGE "sim"
| #define VERSION "0.9.4"
| #ifdef __cplusplus
| extern "C" void std::exit (int) throw (); using std::exit;
| #endif
| #define KDELIBSUFF ""
| #define STDC_HEADERS 1
| #define HAVE_SYS_TYPES_H 1
| #define HAVE_SYS_STAT_H 1
| #define HAVE_STDLIB_H 1
| #define HAVE_STRING_H 1
| #define HAVE_MEMORY_H 1
| #define HAVE_STRINGS_H 1
| #define HAVE_INTTYPES_H 1
| #define HAVE_STDINT_H 1
| #define HAVE_UNISTD_H 1
| #define HAVE_DLFCN_H 1
| #define HAVE_CRYPT 1
| #define ksize_t socklen_t
| #define HAVE_SYS_TYPES_H 1
| #define HAVE_STDINT_H 1
| #define HAVE_SYS_BITYPES_H 1
| #define HAVE_RES_INIT 1
| #define HAVE_RES_INIT 1
| #define SIZEOF_INT 4
| #define SIZEOF_SHORT 2
| #define SIZEOF_LONG 4
| #define SIZEOF_CHAR_P 4
| #define SIZEOF_SIZE_T 4
| #define SIZEOF_UNSIGNED_LONG 4
| /* end confdefs.h. */
| #include <crt_externs.h>
configure:27285: result: no
configure:27320: checking for crt_externs.h
configure:27327: result: no
configure:27340: checking for _NSGetEnviron
configure:27397: gcc -o conftest -ansi -W -Wall -Wchar-subscripts -Wshadow -Wpointer-arith -Wmissing-prototypes -Wwrite-strings -D_XOPEN_SOURCE=500 -D_BSD_SOURCE -O2 -Wformat-security -Wmissing-format-attribute conftest.c >&5
/tmp/cc2s1d7V.o: In function `main':conftest.c:(.text+0x11): undefined reference to `_NSGetEnviron'
/tmp/cc2s1d7V.o:(.data+0x0): undefined reference to `_NSGetEnviron'
collect2: ld returned 1 exit status
configure:27403: $? = 1
configure: failed program was:
| /* confdefs.h. */
|
| #define PACKAGE_NAME ""
| #define PACKAGE_TARNAME ""
| #define PACKAGE_VERSION ""
| #define PACKAGE_STRING ""
| #define PACKAGE_BUGREPORT ""
| #define PACKAGE "sim"
| #define VERSION "0.9.4"
| #ifdef __cplusplus
| extern "C" void std::exit (int) throw (); using std::exit;
| #endif
| #define KDELIBSUFF ""
| #define STDC_HEADERS 1
| #define HAVE_SYS_TYPES_H 1
| #define HAVE_SYS_STAT_H 1
| #define HAVE_STDLIB_H 1
| #define HAVE_STRING_H 1
| #define HAVE_MEMORY_H 1
| #define HAVE_STRINGS_H 1
| #define HAVE_INTTYPES_H 1
| #define HAVE_STDINT_H 1
| #define HAVE_UNISTD_H 1
| #define HAVE_DLFCN_H 1
| #define HAVE_CRYPT 1
| #define ksize_t socklen_t
| #define HAVE_SYS_TYPES_H 1
| #define HAVE_STDINT_H 1
| #define HAVE_SYS_BITYPES_H 1
| #define HAVE_RES_INIT 1
| #define HAVE_RES_INIT 1
| #define SIZEOF_INT 4
| #define SIZEOF_SHORT 2
| #define SIZEOF_LONG 4
| #define SIZEOF_CHAR_P 4
| #define SIZEOF_SIZE_T 4
| #define SIZEOF_UNSIGNED_LONG 4
| /* end confdefs.h. */
| /* Define _NSGetEnviron to an innocuous variant, in case <limits.h> declares _NSGetEnviron.
| For example, HP-UX 11i <limits.h> declares gettimeofday. */
| #define _NSGetEnviron innocuous__NSGetEnviron
|
| /* System header to define __stub macros and hopefully few prototypes,
| which can conflict with char _NSGetEnviron (); below.
| Prefer <limits.h> to <assert.h> if __STDC__ is defined, since
| <limits.h> exists even on freestanding compilers. */
|
| #ifdef __STDC__
| # include <limits.h>
| #else
| # include <assert.h>
| #endif
|
| #undef _NSGetEnviron
|
| /* Override any gcc2 internal prototype to avoid an error. */
| #ifdef __cplusplus
| extern "C"
| {
| #endif
| /* We use char because int might match the return type of a gcc2
| builtin and then its argument prototype would still apply. */
| char _NSGetEnviron ();
| /* The GNU C library defines this for functions which it implements
| to always fail with ENOSYS. Some functions are actually named
| something starting with __ and the normal name is an alias. */
| #if defined (__stub__NSGetEnviron) || defined (__stub____NSGetEnviron)
| choke me
| #else
| char (*f) () = _NSGetEnviron;
| #endif
| #ifdef __cplusplus
| }
| #endif
|
| int
| main ()
| {
| return f != _NSGetEnviron;
| ;
| return 0;
| }
configure:27428: result: no
configure:27450: checking for vsnprintf
configure:27507: gcc -o conftest -ansi -W -Wall -Wchar-subscripts -Wshadow -Wpointer-arith -Wmissing-prototypes -Wwrite-strings -D_XOPEN_SOURCE=500 -D_BSD_SOURCE -O2 -Wformat-security -Wmissing-format-attribute conftest.c >&5
configure:27513: $? = 0
configure:27517: test -z
|| test ! -s conftest.err
configure:27520: $? = 0
configure:27523: test -s conftest
configure:27526: $? = 0
configure:27538: result: yes
configure:27450: checking for snprintf
configure:27507: gcc -o conftest -ansi -W -Wall -Wchar-subscripts -Wshadow -Wpointer-arith -Wmissing-prototypes -Wwrite-strings -D_XOPEN_SOURCE=500 -D_BSD_SOURCE -O2 -Wformat-security -Wmissing-format-attribute conftest.c >&5
configure:27513: $? = 0
configure:27517: test -z
|| test ! -s conftest.err
configure:27520: $? = 0
configure:27523: test -s conftest
configure:27526: $? = 0
configure:27538: result: yes
configure:27585: checking for X
configure:27623: gcc -E conftest.c
configure:27629: $? = 0
configure:27720: gcc -o conftest -ansi -W -Wall -Wchar-subscripts -Wshadow -Wpointer-arith -Wmissing-prototypes -Wwrite-strings -D_XOPEN_SOURCE=500 -D_BSD_SOURCE -O2 -Wformat-security -Wmissing-format-attribute conftest.c -lXt >&5
conftest.c: In function `main':
conftest.c:45: warning: implicit declaration of function `XtMalloc'
configure:27726: $? = 0
configure:27730: test -z
|| test ! -s conftest.err
configure:27733: $? = 0
configure:27736: test -s conftest
configure:27739: $? = 0
configure:27885: result: libraries /usr/X11R6/lib, headers .
configure:27914: checking for IceConnectionNumber in -lICE
configure:27944: gcc -o conftest -ansi -W -Wall -Wchar-subscripts -Wshadow -Wpointer-arith -Wmissing-prototypes -Wwrite-strings -D_XOPEN_SOURCE=500 -D_BSD_SOURCE -O2 -Wformat-security -Wmissing-format-attribute -L/usr/X11R6/lib conftest.c -lICE >&5
configure:27950: $? = 0
configure:27954: test -z
|| test ! -s conftest.err
configure:27957: $? = 0
configure:27960: test -s conftest
configure:27963: $? = 0
configure:27976: result: yes
configure:27986: checking for libXext
configure:28021: gcc -o conftest -ansi -W -Wall -Wchar-subscripts -Wshadow -Wpointer-arith -Wmissing-prototypes -Wwrite-strings -D_XOPEN_SOURCE=500 -D_BSD_SOURCE -O2 -Wformat-security -Wmissing-format-attribute -L/usr/X11R6/lib conftest.c -lXext -lX11 >&5
configure:28027: $? = 0
configure:28031: test -z
|| test ! -s conftest.err
configure:28034: $? = 0
configure:28037: test -s conftest
configure:28040: $? = 0
configure:28059: result: yes
configure:28117: checking for kde-config
configure:28171: result: /usr/bin/kde-config
configure:28183: checking for KDE-Version
configure:28208: result: 3.5
configure:28354: checking for pthread_create in -lpthread
configure:28384: gcc -o conftest -ansi -W -Wall -Wchar-subscripts -Wshadow -Wpointer-arith -Wmissing-prototypes -Wwrite-strings -D_XOPEN_SOURCE=500 -D_BSD_SOURCE -O2 -Wformat-security -Wmissing-format-attribute conftest.c -lpthread >&5
configure:28390: $? = 0
configure:28394: test -z
|| test ! -s conftest.err
configure:28397: $? = 0
configure:28400: test -s conftest
configure:28403: $? = 0
configure:28416: result: yes
configure:28633: checking for extra includes
configure:28661: result: no
configure:28665: checking for extra libs
configure:28694: result: no
configure:28700: checking for libz
configure:28735: gcc -o conftest -ansi -W -Wall -Wchar-subscripts -Wshadow -Wpointer-arith -Wmissing-prototypes -Wwrite-strings -D_XOPEN_SOURCE=500 -D_BSD_SOURCE -O2 -Wformat-security -Wmissing-format-attribute -I. -D_REENTRANT conftest.c -L/usr/X11R6/lib -lz >&5
configure:28741: $? = 0
configure:28745: test -z
|| test ! -s conftest.err
configure:28748: $? = 0
configure:28751: test -s conftest
configure:28754: $? = 0
configure:28776: result: -lz
configure:28797: checking for libpng
configure:28834: gcc -o conftest -ansi -W -Wall -Wchar-subscripts -Wshadow -Wpointer-arith -Wmissing-prototypes -Wwrite-strings -D_XOPEN_SOURCE=500 -D_BSD_SOURCE -O2 -Wformat-security -Wmissing-format-attribute -I. -D_REENTRANT conftest.c -L/usr/X11R6/lib -lpng -lz -lm -lX11 >&5
configure:28840: $? = 0
configure:28844: test -z
|| test ! -s conftest.err
configure:28847: $? = 0
configure:28850: test -s conftest
configure:28853: $? = 0
configure:28877: result: -lpng -lz -lm
configure:28888: checking for libjpeg6b
configure:28928: gcc -o conftest -ansi -W -Wall -Wchar-subscripts -Wshadow -Wpointer-arith -Wmissing-prototypes -Wwrite-strings -D_XOPEN_SOURCE=500 -D_BSD_SOURCE -O2 -Wformat-security -Wmissing-format-attribute -I. -D_REENTRANT conftest.c -L/usr/X11R6/lib -ljpeg6b -lm >&5
/usr/bin/ld: cannot find -ljpeg6b
collect2: ld returned 1 exit status
configure:28934: $? = 1
configure: failed program was:
| /* confdefs.h. */
|
| #define PACKAGE_NAME ""
| #define PACKAGE_TARNAME ""
| #define PACKAGE_VERSION ""
| #define PACKAGE_STRING ""
| #define PACKAGE_BUGREPORT ""
| #define PACKAGE "sim"
| #define VERSION "0.9.4"
| #ifdef __cplusplus
| extern "C" void std::exit (int) throw (); using std::exit;
| #endif
| #define KDELIBSUFF ""
| #define STDC_HEADERS 1
| #define HAVE_SYS_TYPES_H 1
| #define HAVE_SYS_STAT_H 1
| #define HAVE_STDLIB_H 1
| #define HAVE_STRING_H 1
| #define HAVE_MEMORY_H 1
| #define HAVE_STRINGS_H 1
| #define HAVE_INTTYPES_H 1
| #define HAVE_STDINT_H 1
| #define HAVE_UNISTD_H 1
| #define HAVE_DLFCN_H 1
| #define HAVE_CRYPT 1
| #define ksize_t socklen_t
| #define HAVE_SYS_TYPES_H 1
| #define HAVE_STDINT_H 1
| #define HAVE_SYS_BITYPES_H 1
| #define HAVE_RES_INIT 1
| #define HAVE_RES_INIT 1
| #define SIZEOF_INT 4
| #define SIZEOF_SHORT 2
| #define SIZEOF_LONG 4
| #define SIZEOF_CHAR_P 4
| #define SIZEOF_SIZE_T 4
| #define SIZEOF_UNSIGNED_LONG 4
| #define HAVE_VSNPRINTF 1
| #define HAVE_SNPRINTF 1
| #define HAVE_LIBZ 1
| #define HAVE_LIBPNG 1
| /* end confdefs.h. */
| /* Override any gcc2 internal prototype to avoid an error. */
| struct jpeg_decompress_struct;
| typedef struct jpeg_decompress_struct * j_decompress_ptr;
| typedef int size_t;
| #ifdef __cplusplus
| extern "C" {
| #endif
| void jpeg_CreateDecompress(j_decompress_ptr cinfo,
| int version, size_t structsize);
| #ifdef __cplusplus
| }
| #endif
| /* We use char because int might match the return type of a gcc2
| builtin and then its argument prototype would still apply. */
|
| int
| main ()
| {
| jpeg_CreateDecompress(0L, 0, 0);
| ;
| return 0;
| }
configure:28969: result: no
configure:28972: checking for libjpeg
configure:29012: gcc -o conftest -ansi -W -Wall -Wchar-subscripts -Wshadow -Wpointer-arith -Wmissing-prototypes -Wwrite-strings -D_XOPEN_SOURCE=500 -D_BSD_SOURCE -O2 -Wformat-security -Wmissing-format-attribute -I. -D_REENTRANT conftest.c -L/usr/X11R6/lib -ljpeg -lm >&5
configure:29018: $? = 0
configure:29022: test -z
|| test ! -s conftest.err
configure:29025: $? = 0
configure:29028: test -s conftest
configure:29031: $? = 0
configure:29050: result: -ljpeg
configure: 29074: ${prefix}/include/jpeglib.h
configure: 29074: /usr/include/jpeglib.h
taking that
configure:29121: checking for perl
configure:29181: result: /usr/bin/perl
configure:29316: checking for Qt
configure: 29381: /usr/lib/qt3/include/qstyle.h
configure: 29381: /usr/lib/qt3/qstyle.h
configure: 29381: /usr/lib/qt/include/qstyle.h
configure: 29381: /usr/lib/qt/qstyle.h
configure: 29381: /usr/share/qt3/include/qstyle.h
taking that
tried NO
tried /usr/lib/qt3/lib
tried /usr/lib/qt3
tried /usr/lib/qt/lib
tried /usr/lib/qt
configure:29499: rm -rf SunWS_cache; g++ -o conftest -Wnon-virtual-dtor -Wno-long-long -Wundef -ansi -D_XOPEN_SOURCE=500 -D_BSD_SOURCE -Wcast-align -Wconversion -Wchar-subscripts -Wall -W -Wpointer-arith -Wwrite-strings -O2 -Wformat-security -Wmissing-format-attribute -fno-exceptions -fno-check-new -fno-common -I/usr/share/qt3/include -I. -DQT_THREAD_SUPPORT -D_REENTRANT -L/usr/share/qt3/lib -L/usr/X11R6/lib conftest.cc -lqt-mt -lpng -lz -lm -ljpeg -ldl -lXext -lX11 -lSM -lICE -lpthread 1>&5
conftest.cc:8:2: #error 1
configure:29502: $? = 1
configure: failed program was:
#include "confdefs.h"
#include <qglobal.h>
#include <qapplication.h>
#include <qcursor.h>
#include <qstylefactory.h>
#include <private/qucomextra_p.h>
#if ! (QT_VERSION >= 0x030500)
#error 1
#endif
int main() {
(void)QStyleFactory::create(QString::null);
QCursor c(Qt::WhatsThisCursor);
return 0;
}
configure:29542: error: Qt (>= Qt 3.2) (library qt-mt) not found. Please check your installation!
For more details about this problem, look at the end of config.log.
Make sure that you have compiled Qt with thread support!
## ---------------- ##
## Cache variables. ##
## ---------------- ##
ac_cv_build=i686-pc-linux-gnu
ac_cv_build_alias=i686-pc-linux-gnu
ac_cv_c_compiler_gnu=yes
ac_cv_cxx_compiler_gnu=yes
ac_cv_env_CC_set=
ac_cv_env_CC_value=
ac_cv_env_CFLAGS_set=
ac_cv_env_CFLAGS_value=
ac_cv_env_CPPFLAGS_set=
ac_cv_env_CPPFLAGS_value=
ac_cv_env_CPP_set=
ac_cv_env_CPP_value=
ac_cv_env_CXXCPP_set=
ac_cv_env_CXXCPP_value=
ac_cv_env_CXXFLAGS_set=
ac_cv_env_CXXFLAGS_value=
ac_cv_env_CXX_set=
ac_cv_env_CXX_value=
ac_cv_env_F77_set=
ac_cv_env_F77_value=
ac_cv_env_FFLAGS_set=
ac_cv_env_FFLAGS_value=
ac_cv_env_LDFLAGS_set=
ac_cv_env_LDFLAGS_value=
ac_cv_env_build_alias_set=
ac_cv_env_build_alias_value=
ac_cv_env_host_alias_set=
ac_cv_env_host_alias_value=
ac_cv_env_target_alias_set=
ac_cv_env_target_alias_value=
ac_cv_exeext=
ac_cv_f77_compiler_gnu=no
ac_cv_func__NSGetEnviron=no
ac_cv_func_connect=yes
ac_cv_func_dlopen=no
ac_cv_func_inet_ntoa=yes
ac_cv_func_remove=yes
ac_cv_func_shl_load=no
ac_cv_func_shmat=yes
ac_cv_func_snprintf=yes
ac_cv_func_vsnprintf=yes
ac_cv_have_dlfcn=yes
ac_cv_have_qt=have_qt=no
ac_cv_header_crt_externs_h=no
ac_cv_header_dlfcn_h=yes
ac_cv_header_inttypes_h=yes
ac_cv_header_memory_h=yes
ac_cv_header_stdc=yes
ac_cv_header_stdint_h=yes
ac_cv_header_stdlib_h=yes
ac_cv_header_string_h=yes
ac_cv_header_strings_h=yes
ac_cv_header_sys_bitypes_h=yes
ac_cv_header_sys_stat_h=yes
ac_cv_header_sys_types_h=yes
ac_cv_header_unistd_h=yes
ac_cv_host=i686-pc-linux-gnu
ac_cv_host_alias=i686-pc-linux-gnu
ac_cv_lib_ICE_IceConnectionNumber=yes
ac_cv_lib_compat_main=no
ac_cv_lib_crypt_crypt=yes
ac_cv_lib_dl_dlopen=yes
ac_cv_lib_dld_shl_load=no
ac_cv_lib_dld_shl_unload=no
ac_cv_lib_dnet_dnet_ntoa=no
ac_cv_lib_dnet_stub_dnet_ntoa=no
ac_cv_lib_jpeg_6b=no
ac_cv_lib_jpeg_normal=-ljpeg
ac_cv_lib_png='-lpng -lz -lm'
ac_cv_lib_poll_poll=no
ac_cv_lib_pthread_pthread_create=yes
ac_cv_lib_ucb_killpg=no
ac_cv_lib_util_main=yes
ac_cv_lib_z=-lz
ac_cv_objext=o
ac_cv_path_GMSGFMT=/usr/bin/msgfmt
ac_cv_path_MSGFMT=/usr/bin/msgfmt
ac_cv_path_XGETTEXT=/usr/bin/xgettext
ac_cv_path_install='/usr/bin/install -c'
ac_cv_prog_AWK=mawk
ac_cv_prog_CPP='gcc -E'
ac_cv_prog_CXXCPP='g++ -E'
ac_cv_prog_ac_ct_AR=ar
ac_cv_prog_ac_ct_CC=gcc
ac_cv_prog_ac_ct_CXX=g++
ac_cv_prog_ac_ct_RANLIB=ranlib
ac_cv_prog_ac_ct_STRIP=strip
ac_cv_prog_cc_g=yes
ac_cv_prog_cc_stdc=
ac_cv_prog_cxx_g=yes
ac_cv_prog_egrep='grep -E'
ac_cv_prog_f77_g=no
ac_cv_prog_make_make_set=yes
ac_cv_sizeof_char_p=4
ac_cv_sizeof_int=4
ac_cv_sizeof_long=4
ac_cv_sizeof_short=2
ac_cv_sizeof_size_t=4
ac_cv_sizeof_unsigned_long=4
ac_cv_socklen_t=socklen_t
ac_cv_target=i686-pc-linux-gnu
ac_cv_target_alias=i686-pc-linux-gnu
ac_cv_type_char_p=yes
ac_cv_type_int=yes
ac_cv_type_long=yes
ac_cv_type_short=yes
ac_cv_type_size_t=yes
ac_cv_type_unsigned_long=yes
am_cv_CC_dependencies_compiler_type=gcc3
am_cv_CXX_dependencies_compiler_type=gcc3
kde_cv_func_strlcat=no
kde_cv_func_strlcpy=no
kde_cv_have_libXext=yes
kde_cv_have_x='have_x=yes kde_x_includes=. kde_x_libraries=/usr/X11R6/lib'
kde_cv_path=/usr/bin/perl
kde_cv_path_kde_config=/usr/bin/kde-config
kde_cv_path_perl=/usr/bin/perl
kde_cv_prog_cc_Wmissing_format_attribute=yes
kde_cv_prog_cxx_O0=yes
kde_cv_prog_cxx_Wl___allow_shlib_undefined=yes
kde_cv_prog_cxx_Wl___no_undefined=yes
kde_cv_prog_cxx_Wmissing_format_attribute=yes
kde_cv_prog_cxx_Wno_long_long=yes
kde_cv_prog_cxx_Wnon_virtual_dtor=yes
kde_cv_prog_cxx_Wundef=yes
kde_cv_prog_cxx_fexceptions=yes
kde_cv_prog_cxx_fno_check_new=yes
kde_cv_prog_cxx_fno_common=yes
kde_cv_prog_cxx_fno_exceptions=yes
kde_cv_proto_strlcat='yes - in libkdefakes'
kde_cv_proto_strlcpy='yes - in libkdefakes'
lt_cv_deplibs_check_method=pass_all
lt_cv_dlopen=dlopen
lt_cv_dlopen_libs=-ldl
lt_cv_dlopen_self=yes
lt_cv_dlopen_self_static=yes
lt_cv_file_magic_cmd='$MAGIC_CMD'
lt_cv_file_magic_test_file='/lib/libc.so.6 /lib/libc-2.3.6.so'
lt_cv_ld_reload_flag=-r
lt_cv_objdir=.libs
lt_cv_path_LD=/usr/bin/ld
lt_cv_path_LDCXX=/usr/bin/ld
lt_cv_path_NM='/usr/bin/nm -B'
lt_cv_path_SED=/bin/sed
lt_cv_prog_compiler_c_o=yes
lt_cv_prog_compiler_c_o_CXX=yes
lt_cv_prog_compiler_rtti_exceptions=no
lt_cv_prog_gnu_ld=yes
lt_cv_prog_gnu_ldcxx=yes
lt_cv_sys_global_symbol_pipe='sed -n -e '\''s/^.*[ ]\([ABCDGIRSTW][ABCDGIRSTW]*\)[ ][ ]*\(\)\([_A-Za-z][_A-Za-z0-9]*\)$/\1 \2\3 \3/p'\'''
lt_cv_sys_global_symbol_to_c_name_address='sed -n -e '\''s/^: \([^ ]*\) $/ {\"\1\", (lt_ptr) 0},/p'\'' -e '\''s/^[BCDEGRST] \([^ ]*\) \([^ ]*\)$/ {"\2", (lt_ptr) \&\2},/p'\'''
lt_cv_sys_global_symbol_to_cdecl='sed -n -e '\''s/^. .* \(.*\)$/extern int \1;/p'\'''
lt_cv_sys_max_cmd_len=32768
lt_lt_cv_prog_compiler_c_o='"yes"'
lt_lt_cv_prog_compiler_c_o_CXX='"yes"'
lt_lt_cv_sys_global_symbol_pipe='"sed -n -e '\''s/^.*[ ]\\([ABCDGIRSTW][ABCDGIRSTW]*\\)[ ][ ]*\\(\\)\\([_A-Za-z][_A-Za-z0-9]*\\)\$/\\1 \\2\\3 \\3/p'\''"'
lt_lt_cv_sys_global_symbol_to_c_name_address='"sed -n -e '\''s/^: \\([^ ]*\\) \$/ {\\\"\\1\\\", (lt_ptr) 0},/p'\'' -e '\''s/^[BCDEGRST] \\([^ ]*\\) \\([^ ]*\\)\$/ {\"\\2\", (lt_ptr) \\&\\2},/p'\''"'
lt_lt_cv_sys_global_symbol_to_cdecl='"sed -n -e '\''s/^. .* \\(.*\\)\$/extern int \\1;/p'\''"'
## ----------------- ##
## Output variables. ##
## ----------------- ##
ACLOCAL='${SHELL} /home/alexxey/Desktop/sim/admin/missing --run aclocal-1.8'
AMDEPBACKSLASH='\'
AMDEP_FALSE='#'
AMDEP_TRUE=''
AMTAR='${SHELL} /home/alexxey/Desktop/sim/admin/missing --run tar'
AR='ar'
ARTSCCONFIG=''
AUTOCONF='$(SHELL) $(top_srcdir)/admin/cvs.sh configure || touch configure'
AUTODIRS=''
AUTOHEADER='${SHELL} /home/alexxey/Desktop/sim/admin/missing --run autoheader'
AUTOMAKE='${SHELL} /home/alexxey/Desktop/sim/admin/missing --run automake-1.8'
AWK='mawk'
CC='gcc'
CCDEPMODE='depmode=gcc3'
CFLAGS='-ansi -W -Wall -Wchar-subscripts -Wshadow -Wpointer-arith -Wmissing-prototypes -Wwrite-strings -D_XOPEN_SOURCE=500 -D_BSD_SOURCE -O2 -Wformat-security -Wmissing-format-attribute'
CONF_FILES=' $(top_srcdir)/./admin/configure.in.min $(top_srcdir)/configure.in.in $(top_srcdir)/./plugins/autoaway/configure.in.in $(top_srcdir)/./plugins/msn/configure.in.in $(top_srcdir)/./plugins/ontop/configure.in.in $(top_srcdir)/./plugins/shortcuts/configure.in.in $(top_srcdir)/./plugins/spell/configure.in.in $(top_srcdir)/./plugins/transparent/configure.in.in $(top_srcdir)/./plugins/yahoo/configure.in.in'
CONVENIENCE_LTDL_FALSE=''
CONVENIENCE_LTDL_TRUE=''
CPP='gcc -E'
CPPFLAGS=' -DQT_THREAD_SUPPORT -D_REENTRANT'
CXX='g++'
CXXCPP='g++ -E'
CXXDEPMODE='depmode=gcc3'
CXXFLAGS='-Wnon-virtual-dtor -Wno-long-long -Wundef -ansi -D_XOPEN_SOURCE=500 -D_BSD_SOURCE -Wcast-align -Wconversion -Wchar-subscripts -Wall -W -Wpointer-arith -Wwrite-strings -O2 -Wformat-security -Wmissing-format-attribute -fno-exceptions -fno-check-new -fno-common'
CYGPATH_W='echo'
DCOPIDL2CPP=''
DCOPIDL=''
DCOPIDLNG=''
DCOP_DEPENDENCIES=''
DEFS=''
DEPDIR='.deps'
ECHO='echo'
ECHO_C=''
ECHO_N='-n'
ECHO_T=''
EGREP='grep -E'
ENABLE_PERMISSIVE_FLAG='-fpermissive'
EXEEXT=''
EXTRA_LIBS=''
F77=''
FFLAGS=''
GMSGFMT='/usr/bin/msgfmt'
INSTALL_DATA='${INSTALL} -m 644'
INSTALL_LTDL_FALSE=''
INSTALL_LTDL_TRUE=''
INSTALL_PROGRAM='${INSTALL} $(INSTALL_STRIP_FLAG)'
INSTALL_SCRIPT='${INSTALL}'
INSTALL_STRIP_PROGRAM='${SHELL} $(install_sh) -c -s'
KCFG_DEPENDENCIES=''
KCONFIG_COMPILER=''
KDECONFIG='/usr/bin/kde-config'
KDE_EXTRA_RPATH=''
KDE_INCLUDES=''
KDE_LDFLAGS=''
KDE_MT_LDFLAGS=''
KDE_MT_LIBS='-lpthread'
KDE_NO_UNDEFINED='-Wl,--no-undefined -Wl,--allow-shlib-undefined'
KDE_PLUGIN='-avoid-version -module -no-undefined $(KDE_NO_UNDEFINED) $(KDE_RPATH) $(KDE_MT_LDFLAGS)'
KDE_RPATH=''
KDE_USE_CLOSURE_FALSE=''
KDE_USE_CLOSURE_TRUE='#'
KDE_USE_FINAL_FALSE=''
KDE_USE_FINAL_TRUE='#'
KDE_USE_NMCHECK_FALSE=''
KDE_USE_NMCHECK_TRUE='#'
KDE_XSL_STYLESHEET=''
LDFLAGS=''
LEX=''
LEXLIB=''
LEX_OUTPUT_ROOT=''
LFLAGS=''
LIBADD_DL=''
LIBCOMPAT=''
LIBCRYPT='-lcrypt'
LIBDL='-ldl'
LIBJPEG='-ljpeg'
LIBOBJS=''
LIBPNG='-lpng -lz -lm'
LIBPTHREAD='-lpthread'
LIBRESOLV='-lresolv'
LIBS=''
LIBSM='-lSM -lICE'
LIBSOCKET=''
LIBSSL=''
LIBTOOL='$(SHELL) $(top_builddir)/libtool'
LIBUCB=''
LIBUI=''
LIBUIQT=''
LIBUTIL='-lutil'
LIBZ='-lz'
LIB_ASPELL=''
LIB_KAB=''
LIB_KABC=''
LIB_KDECORE=''
LIB_KDEFX=''
LIB_KDEPIM=''
LIB_KDEPRINT=''
LIB_KDEUI=''
LIB_KFILE=''
LIB_KFM=''
LIB_KHTML=''
LIB_KIO=''
LIB_KPARTS=''
LIB_KSPELL=''
LIB_KSYCOCA=''
LIB_KUTILS=''
LIB_POLL=''
LIB_QPE=''
LIB_QT=''
LIB_SMB=''
LIB_X11='-lX11 $(LIBSOCKET)'
LIB_XEXT='-lXext'
LIB_XML2=''
LIB_XRENDER=''
LIB_XSLT=''
LN_S='ln -s'
LTLIBOBJS=''
MAKEINFO='${SHELL} /home/alexxey/Desktop/sim/admin/missing --run makeinfo'
MCOPIDL=''
MEINPROC=''
MOC=''
MSGFMT='/usr/bin/msgfmt'
NOOPT_CFLAGS='-O0'
NOOPT_CXXFLAGS='-O0'
OBJEXT='o'
PACKAGE='sim'
PACKAGE_BUGREPORT=''
PACKAGE_NAME=''
PACKAGE_STRING=''
PACKAGE_TARNAME=''
PACKAGE_VERSION=''
PATH_SEPARATOR=':'
PERL='/usr/bin/perl'
QT2_FALSE=''
QT2_TRUE=''
QTE_NORTTI=''
QT_INCLUDES=''
QT_LDFLAGS=''
RANLIB='ranlib'
SET_MAKE=''
SHELL='/bin/sh'
SSL_INCLUDES=''
SSL_LDFLAGS=''
STRIP='strip'
TOPSUBDIRS=''
UIC=''
UIC_TR=''
USER_INCLUDES=''
USER_LDFLAGS=''
USE_EXCEPTIONS='-fexceptions'
USE_RTTI=''
USE_THREADS=''
VERSION='0.9.4'
WOVERLOADED_VIRTUAL=''
XGETTEXT='/usr/bin/xgettext'
XML2_CONFIG=''
XMLLINT=''
XSLT_CONFIG=''
XSS_LIBS=''
X_EXTRA_LIBS=''
X_INCLUDES='-I.'
X_LDFLAGS='-L/usr/X11R6/lib'
X_PRE_LIBS=''
X_RPATH=''
ZIP=''
ZIP_FLAGS=''
ac_ct_AR='ar'
ac_ct_CC='gcc'
ac_ct_CXX='g++'
ac_ct_F77=''
ac_ct_RANLIB='ranlib'
ac_ct_STRIP='strip'
all_includes='-I.'
all_libraries='-L/usr/X11R6/lib'
am__fastdepCC_FALSE='#'
am__fastdepCC_TRUE=''
am__fastdepCXX_FALSE='#'
am__fastdepCXX_TRUE=''
am__include='include'
am__leading_dot='.'
am__quote=''
bindir='${exec_prefix}/bin'
build='i686-pc-linux-gnu'
build_alias=''
build_cpu='i686'
build_os='linux-gnu'
build_vendor='pc'
datadir='${prefix}/share'
exec_prefix='NONE'
host='i686-pc-linux-gnu'
host_alias=''
host_cpu='i686'
host_os='linux-gnu'
host_vendor='pc'
include_ARTS_FALSE=''
include_ARTS_TRUE=''
includedir='${prefix}/include'
infodir='${prefix}/info'
install_sh='/home/alexxey/Desktop/sim/admin/install-sh'
kde_appsdir=''
kde_bindir=''
kde_confdir=''
kde_datadir=''
kde_htmldir=''
kde_icondir=''
kde_includes=''
kde_kcfgdir=''
kde_libraries=''
kde_libs_htmldir='/usr/share/doc/kde/HTML'
kde_libs_prefix='/usr'
kde_locale=''
kde_mimedir=''
kde_moduledir=''
kde_qtver='3'
kde_servicesdir=''
kde_servicetypesdir=''
kde_sounddir=''
kde_styledir=''
kde_templatesdir=''
kde_wallpaperdir=''
kde_widgetdir=''
kdeinitdir=''
libdir='${exec_prefix}/lib'
libexecdir='${exec_prefix}/libexec'
localstatedir='${prefix}/var'
mandir='${prefix}/man'
mkdir_p='mkdir -p -- .'
oldincludedir='/usr/include'
plugins___homedir_SUBDIR_included_FALSE=''
plugins___homedir_SUBDIR_included_TRUE=''
plugins___migrate_SUBDIR_included_FALSE=''
plugins___migrate_SUBDIR_included_TRUE=''
plugins__core_SUBDIR_included_FALSE=''
plugins__core_SUBDIR_included_TRUE=''
plugins_about_SUBDIR_included_FALSE=''
plugins_about_SUBDIR_included_TRUE=''
plugins_action_SUBDIR_included_FALSE=''
plugins_action_SUBDIR_included_TRUE=''
plugins_autoaway_SUBDIR_included_FALSE=''
plugins_autoaway_SUBDIR_included_TRUE=''
plugins_background_SUBDIR_included_FALSE=''
plugins_background_SUBDIR_included_TRUE=''
plugins_dock_SUBDIR_included_FALSE=''
plugins_dock_SUBDIR_included_TRUE=''
plugins_filter_SUBDIR_included_FALSE=''
plugins_filter_SUBDIR_included_TRUE=''
plugins_floaty_SUBDIR_included_FALSE=''
plugins_floaty_SUBDIR_included_TRUE=''
plugins_forward_SUBDIR_included_FALSE=''
plugins_forward_SUBDIR_included_TRUE=''
plugins_gpg_SUBDIR_included_FALSE=''
plugins_gpg_SUBDIR_included_TRUE=''
plugins_icons_SUBDIR_included_FALSE=''
plugins_icons_SUBDIR_included_TRUE=''
plugins_icq_SUBDIR_included_FALSE=''
plugins_icq_SUBDIR_included_TRUE=''
plugins_jabber_SUBDIR_included_FALSE=''
plugins_jabber_SUBDIR_included_TRUE=''
plugins_livejournal_SUBDIR_included_FALSE=''
plugins_livejournal_SUBDIR_included_TRUE=''
plugins_logger_SUBDIR_included_FALSE=''
plugins_logger_SUBDIR_included_TRUE=''
plugins_msn_SUBDIR_included_FALSE=''
plugins_msn_SUBDIR_included_TRUE=''
plugins_navigate_SUBDIR_included_FALSE=''
plugins_navigate_SUBDIR_included_TRUE=''
plugins_netmonitor_SUBDIR_included_FALSE=''
plugins_netmonitor_SUBDIR_included_TRUE=''
plugins_ontop_SUBDIR_included_FALSE=''
plugins_ontop_SUBDIR_included_TRUE=''
plugins_osd_SUBDIR_included_FALSE=''
plugins_osd_SUBDIR_included_TRUE=''
plugins_proxy_SUBDIR_included_FALSE=''
plugins_proxy_SUBDIR_included_TRUE=''
plugins_remote_SUBDIR_included_FALSE=''
plugins_remote_SUBDIR_included_TRUE=''
plugins_replace_SUBDIR_included_FALSE=''
plugins_replace_SUBDIR_included_TRUE=''
plugins_shortcuts_SUBDIR_included_FALSE=''
plugins_shortcuts_SUBDIR_included_TRUE=''
plugins_sms_SUBDIR_included_FALSE=''
plugins_sms_SUBDIR_included_TRUE=''
plugins_sound_SUBDIR_included_FALSE=''
plugins_sound_SUBDIR_included_TRUE=''
plugins_spell_SUBDIR_included_FALSE=''
plugins_spell_SUBDIR_included_TRUE=''
plugins_splash_SUBDIR_included_FALSE=''
plugins_splash_SUBDIR_included_TRUE=''
plugins_styles_SUBDIR_included_FALSE=''
plugins_styles_SUBDIR_included_TRUE=''
plugins_transparent_SUBDIR_included_FALSE=''
plugins_transparent_SUBDIR_included_TRUE=''
plugins_update_SUBDIR_included_FALSE=''
plugins_update_SUBDIR_included_TRUE=''
plugins_weather_SUBDIR_included_FALSE=''
plugins_weather_SUBDIR_included_TRUE=''
plugins_yahoo_SUBDIR_included_FALSE=''
plugins_yahoo_SUBDIR_included_TRUE=''
plugins_zodiak_SUBDIR_included_FALSE=''
plugins_zodiak_SUBDIR_included_TRUE=''
po_SUBDIR_included_FALSE=''
po_SUBDIR_included_TRUE=''
prefix='/usr'
program_transform_name='s,x,x,'
qt_includes=''
qt_libraries=''
sbindir='${exec_prefix}/sbin'
sharedstatedir='${prefix}/com'
sim_SUBDIR_included_FALSE=''
sim_SUBDIR_included_TRUE=''
sim_plugindir=''
sim_stylesdir=''
sysconfdir='${prefix}/etc'
target='i686-pc-linux-gnu'
target_alias=''
target_cpu='i686'
target_os='linux-gnu'
target_vendor='pc'
x_includes='.'
x_libraries='/usr/X11R6/lib'
xdg_appsdir=''
xdg_directorydir=''
xdg_menudir=''
## ----------- ##
## confdefs.h. ##
## ----------- ##
#define HAVE_CRYPT 1
#define HAVE_DLFCN_H 1
#define HAVE_INTTYPES_H 1
#define HAVE_LIBJPEG 1
#define HAVE_LIBPNG 1
#define HAVE_LIBPTHREAD 1
#define HAVE_LIBZ 1
#define HAVE_MEMORY_H 1
#define HAVE_RES_INIT 1
#define HAVE_RES_INIT 1
#define HAVE_SNPRINTF 1
#define HAVE_STDINT_H 1
#define HAVE_STDINT_H 1
#define HAVE_STDLIB_H 1
#define HAVE_STRINGS_H 1
#define HAVE_STRING_H 1
#define HAVE_SYS_BITYPES_H 1
#define HAVE_SYS_STAT_H 1
#define HAVE_SYS_TYPES_H 1
#define HAVE_SYS_TYPES_H 1
#define HAVE_UNISTD_H 1
#define HAVE_VSNPRINTF 1
#define KDELIBSUFF ""
#define PACKAGE "sim"
#define PACKAGE_BUGREPORT ""
#define PACKAGE_NAME ""
#define PACKAGE_STRING ""
#define PACKAGE_TARNAME ""
#define PACKAGE_VERSION ""
#define SIZEOF_CHAR_P 4
#define SIZEOF_INT 4
#define SIZEOF_LONG 4
#define SIZEOF_SHORT 2
#define SIZEOF_SIZE_T 4
#define SIZEOF_UNSIGNED_LONG 4
#define STDC_HEADERS 1
#define VERSION "0.9.4"
#define ksize_t socklen_t
#endif
#ifdef __cplusplus
extern "C" void std::exit (int) throw (); using std::exit;
configure: exit 1