All pastes #264456 Raw Edit

Someone

public text v1 · immutable
·published 2006-12-02 12:56 UTC
rendered paste body
vainio26@haikara harj3 $ make
tutg++ -o prog *.cc
tietorakenne.cc: In constructor 'Tietorakenne::Tietorakenne()':
tietorakenne.cc:30: error: no match for call to '(std::map<int, std::set<std::basic_string<char, std::char_traits<char>, std::allocator<char> >, std::less<std::basic_string<char, std::char_traits<char>, std::allocator<char> > >, std::allocator<std::basic_string<char, std::char_traits<char>, std::allocator<char> > > >, std::less<int>, std::allocator<std::pair<const int, std::set<std::basic_string<char, std::char_traits<char>, std::allocator<char> >, std::less<std::basic_string<char, std::char_traits<char>, std::allocator<char> > >, std::allocator<std::basic_string<char, std::char_traits<char>, std::allocator<char> > > > > > >) ()'
tietorakenne.cc:31: error: expected `;' before '}' token
tietorakenne.cc: In member function 'bool Tietorakenne::kohdeOk(std::string)':
tietorakenne.cc:195: warning: declaration of 'asuntokohde' shadows a member of 'this'
make: *** [prog] Error 1