/home/peroyvind/RPM/BUILD/gcc-4.1.2/obj-sparcv9-mandriva-linux-gnu/./gcc/xgcc -B/home/peroyvind/RPM/BUILD/gcc-4.1.2/obj-sparcv9-mandriva-linux-gnu/./gcc/ -B/usr/sparcv9-mandriva-linux-gnu/bin/ -B/usr/sparcv9-mandriva-linux-gnu/lib/ -isystem /usr/sparcv9-mandriva-linux-gnu/include -isystem /usr/sparcv9-mandriva-linux-gnu/sys-include -O2 -O2 -O2 -g -pipe -Wp,-D_FORTIFY_SOURCE=2 -fexceptions -mcpu=ultrasparc -DIN_GCC -W -Wall -Wwrite-strings -Wstrict-prototypes -Wmissing-prototypes -Wold-style-definition -isystem ./include -I. -I. -I../../gcc -I../../gcc/. -I../../gcc/../include -I../../gcc/../libcpp/include -g0 -finhibit-size-directive -fno-inline-functions -fno-exceptions -fno-zero-initialized-in-bss -fno-unit-at-a-time `if test x$(/home/peroyvind/RPM/BUILD/gcc-4.1.2/obj-sparcv9-mandriva-linux-gnu/./gcc/xgcc -B/home/peroyvind/RPM/BUILD/gcc-4.1.2/obj-sparcv9-mandriva-linux-gnu/./gcc/ -B/usr/sparcv9-mandriva-linux-gnu/bin/ -B/usr/sparcv9-mandriva-linux-gnu/lib/ -isystem /usr/sparcv9-mandriva-linux-gnu/include -isystem /usr/sparcv9-mandriva-linux-gnu/sys-include -print-multi-os-directory) = x../lib64; then echo -mcmodel=medany; fi` \
-c ../../gcc/crtstuff.c -DCRT_BEGIN \
-o crtbegin.o
In file included from /usr/include/stdio.h:36,
from ../../gcc/tsystem.h:90,
from ../../gcc/crtstuff.c:68:
/usr/include/bits/types.h:147: error: size of array ‘__val’ is too large
In file included from /usr/include/_G_config.h:24,
from /usr/include/libio.h:32,
from /usr/include/stdio.h:72,
from ../../gcc/tsystem.h:90,
from ../../gcc/crtstuff.c:68:
/usr/include/wchar.h:82: error: size of array ‘__wchb’ is too large
In file included from /usr/include/stdio.h:72,
from ../../gcc/tsystem.h:90,
from ../../gcc/crtstuff.c:68:
/usr/include/libio.h:302: error: size of array ‘_shortbuf’ is too large
/usr/include/libio.h:332: error: size of array ‘_unused2’ is too large
In file included from ../../gcc/tsystem.h:90,
from ../../gcc/crtstuff.c:68:
/usr/include/stdio.h:363: error: format string has invalid operand number
/usr/include/stdio.h:367: error: format string has invalid operand number
/usr/include/stdio.h:376: error: format string has invalid operand number
/usr/include/stdio.h:379: error: format string has invalid operand number
/usr/include/stdio.h:382: error: format string has invalid operand number
/usr/include/stdio.h:392: error: format string has invalid operand number
/usr/include/stdio.h:394: error: format string has invalid operand number
/usr/include/stdio.h:423: error: format string has invalid operand number
/usr/include/stdio.h:430: error: format string has invalid operand number
/usr/include/stdio.h:435: error: format string has invalid operand number
In file included from ../../gcc/tsystem.h:90,
from ../../gcc/crtstuff.c:68:
/usr/include/stdio.h:806: error: format string has invalid operand number
/usr/include/stdio.h:810: error: format string has invalid operand number
In file included from /usr/include/sys/types.h:270,
from ../../gcc/tsystem.h:93,
from ../../gcc/crtstuff.c:68:
/usr/include/bits/pthreadtypes.h:56: error: size of array ‘__size’ is too large
/usr/include/bits/pthreadtypes.h:103: error: size of array ‘__size’ is too large
/usr/include/bits/pthreadtypes.h:109: error: size of array ‘__size’ is too large
/usr/include/bits/pthreadtypes.h:129: error: size of array ‘__size’ is too large
/usr/include/bits/pthreadtypes.h:135: error: size of array ‘__size’ is too large
/usr/include/bits/pthreadtypes.h:185: error: size of array ‘__size’ is too large
/usr/include/bits/pthreadtypes.h:191: error: size of array ‘__size’ is too large
/usr/include/bits/pthreadtypes.h:206: error: size of array ‘__size’ is too large
/usr/include/bits/pthreadtypes.h:212: error: size of array ‘__size’ is too large
In file included from ../../gcc/tsystem.h:103,
from ../../gcc/crtstuff.c:68:
/usr/include/string.h:40: error: nonnull argument has invalid operand number (argument 1)
/usr/include/string.h:44: error: nonnull argument has invalid operand number (argument 1)
/usr/include/string.h:53: error: nonnull argument has invalid operand number (argument 1)
/usr/include/string.h:59: error: nonnull argument has invalid operand number (argument 1)
/usr/include/string.h:63: error: nonnull argument has invalid operand number (argument 1)
/usr/include/string.h:67: error: nonnull argument has invalid operand number (argument 1)
/usr/include/string.h:74: error: nonnull argument has invalid operand number (argument 1)
/usr/include/string.h:78: error: nonnull argument has invalid operand number (argument 1)
/usr/include/string.h:85: error: nonnull argument has invalid operand number (argument 1)
/usr/include/string.h:89: error: nonnull argument has invalid operand number (argument 1)
/usr/include/string.h:93: error: nonnull argument has invalid operand number (argument 1)
/usr/include/string.h:96: error: nonnull argument has invalid operand number (argument 1)
/usr/include/string.h:100: error: nonnull argument has invalid operand number (argument 1)
/usr/include/string.h:103: error: nonnull argument has invalid operand number (argument 1)
/usr/include/string.h:107: error: nonnull argument has invalid operand number (argument 1)
/usr/include/string.h:111: error: nonnull argument has invalid operand number (argument 1)
In file included from /usr/include/string.h:118,
from ../../gcc/tsystem.h:103,
from ../../gcc/crtstuff.c:68:
/usr/include/xlocale.h:31: error: size of array ‘__locales’ is too large
/usr/include/xlocale.h:39: error: size of array ‘__names’ is too large
In file included from ../../gcc/tsystem.h:103,
from ../../gcc/crtstuff.c:68:
/usr/include/string.h:122: error: nonnull argument has invalid operand number (argument 1)
/usr/include/string.h:125: error: nonnull argument has invalid operand number (argument 1)
/usr/include/string.h:131: error: nonnull argument has invalid operand number (argument 1)
/usr/include/string.h:139: error: nonnull argument has invalid operand number (argument 1)
/usr/include/string.h:168: error: nonnull argument has invalid operand number (argument 1)
/usr/include/string.h:171: error: nonnull argument has invalid operand number (argument 1)
/usr/include/string.h:178: error: nonnull argument has invalid operand number (argument 1)
/usr/include/string.h:185: error: nonnull argument has invalid operand number (argument 1)
/usr/include/string.h:189: error: nonnull argument has invalid operand number (argument 1)
/usr/include/string.h:192: error: nonnull argument has invalid operand number (argument 1)
/usr/include/string.h:195: error: nonnull argument has invalid operand number (argument 1)
/usr/include/string.h:200: error: nonnull argument has invalid operand number (argument 1)
/usr/include/string.h:208: error: nonnull argument has invalid operand number (argument 1)
/usr/include/string.h:212: error: nonnull argument has invalid operand number (argument 1)
/usr/include/string.h:218: error: nonnull argument has invalid operand number (argument 1)
/usr/include/string.h:227: error: nonnull argument has invalid operand number (argument 1)
/usr/include/string.h:233: error: nonnull argument has invalid operand number (argument 1)
/usr/include/string.h:236: error: nonnull argument has invalid operand number (argument 1)
/usr/include/string.h:243: error: nonnull argument has invalid operand number (argument 1)
/usr/include/string.h:250: error: nonnull argument has invalid operand number (argument 1)
/usr/include/string.h:282: error: nonnull argument has invalid operand number (argument 1)
/usr/include/string.h:288: error: nonnull argument has invalid operand number (argument 1)
/usr/include/string.h:293: error: nonnull argument has invalid operand number (argument 1)
/usr/include/string.h:296: error: nonnull argument has invalid operand number (argument 1)
/usr/include/string.h:300: error: nonnull argument has invalid operand number (argument 1)
/usr/include/string.h:304: error: nonnull argument has invalid operand number (argument 1)
/usr/include/string.h:308: error: nonnull argument has invalid operand number (argument 1)
/usr/include/string.h:326: error: nonnull argument has invalid operand number (argument 1)
/usr/include/string.h:330: error: nonnull argument has invalid operand number (argument 1)
/usr/include/string.h:338: error: nonnull argument has invalid operand number (argument 1)
/usr/include/string.h:342: error: nonnull argument has invalid operand number (argument 1)
/usr/include/string.h:350: error: nonnull argument has invalid operand number (argument 1)
/usr/include/string.h:356: error: nonnull argument has invalid operand number (argument 1)
/usr/include/string.h:363: error: nonnull argument has invalid operand number (argument 1)
/usr/include/string.h:365: error: nonnull argument has invalid operand number (argument 1)
/usr/include/string.h:371: error: nonnull argument has invalid operand number (argument 1)
/usr/include/string.h:374: error: nonnull argument has invalid operand number (argument 1)
/usr/include/string.h:377: error: nonnull argument has invalid operand number (argument 1)
/usr/include/string.h:380: error: nonnull argument has invalid operand number (argument 1)
/usr/include/string.h:387: error: nonnull argument has invalid operand number (argument 1)
In file included from /usr/include/string.h:417,
from ../../gcc/tsystem.h:103,
from ../../gcc/crtstuff.c:68:
/usr/include/bits/string2.h:80: error: size of array ‘__arr’ is too large
/usr/include/bits/string2.h:81: error: size of array ‘__arr’ is too large
/usr/include/bits/string2.h:82: error: size of array ‘__arr’ is too large
/usr/include/bits/string2.h:83: error: size of array ‘__arr’ is too large
/usr/include/bits/string2.h:84: error: size of array ‘__arr’ is too large
/usr/include/bits/string2.h:85: error: size of array ‘__arr’ is too large
/usr/include/bits/string2.h:86: error: size of array ‘__arr’ is too large
In file included from /usr/include/stdlib.h:43,
from ../../gcc/tsystem.h:104,
from ../../gcc/crtstuff.c:68:
/usr/include/bits/waitstatus.h:79: error: width of ‘<anonymous>’ exceeds its type
/usr/include/bits/waitstatus.h:80: error: width of ‘__w_retcode’ exceeds its type
/usr/include/bits/waitstatus.h:81: error: width of ‘__w_coredump’ exceeds its type
/usr/include/bits/waitstatus.h:82: error: width of ‘__w_termsig’ exceeds its type
/usr/include/bits/waitstatus.h:93: error: width of ‘<anonymous>’ exceeds its type
/usr/include/bits/waitstatus.h:94: error: width of ‘__w_stopsig’ exceeds its type
/usr/include/bits/waitstatus.h:95: error: width of ‘__w_stopval’ exceeds its type
In file included from ../../gcc/tsystem.h:104,
from ../../gcc/crtstuff.c:68:
/usr/include/stdlib.h:146: error: nonnull argument has invalid operand number (argument 1)
/usr/include/stdlib.h:149: error: nonnull argument has invalid operand number (argument 1)
/usr/include/stdlib.h:152: error: nonnull argument has invalid operand number (argument 1)
/usr/include/stdlib.h:159: error: nonnull argument has invalid operand number (argument 1)
/usr/include/stdlib.h:167: error: nonnull argument has invalid operand number (argument 1)
/usr/include/stdlib.h:174: error: nonnull argument has invalid operand number (argument 1)
/usr/include/stdlib.h:178: error: nonnull argument has invalid operand number (argument 1)
/usr/include/stdlib.h:186: error: nonnull argument has invalid operand number (argument 1)
/usr/include/stdlib.h:190: error: nonnull argument has invalid operand number (argument 1)
/usr/include/stdlib.h:198: error: nonnull argument has invalid operand number (argument 1)
/usr/include/stdlib.h:203: error: nonnull argument has invalid operand number (argument 1)
/usr/include/stdlib.h:212: error: nonnull argument has invalid operand number (argument 1)
/usr/include/stdlib.h:217: error: nonnull argument has invalid operand number (argument 1)
/usr/include/stdlib.h:242: error: nonnull argument has invalid operand number (argument 1)
/usr/include/stdlib.h:247: error: nonnull argument has invalid operand number (argument 1)
/usr/include/stdlib.h:253: error: nonnull argument has invalid operand number (argument 1)
/usr/include/stdlib.h:259: error: nonnull argument has invalid operand number (argument 1)
/usr/include/stdlib.h:263: error: nonnull argument has invalid operand number (argument 1)
/usr/include/stdlib.h:267: error: nonnull argument has invalid operand number (argument 1)
/usr/include/stdlib.h:272: error: nonnull argument has invalid operand number (argument 1)
/usr/include/stdlib.h:281: error: nonnull argument has invalid operand number (argument 1)
/usr/include/stdlib.h:284: error: nonnull argument has invalid operand number (argument 1)
/usr/include/stdlib.h:288: error: nonnull argument has invalid operand number (argument 1)
/usr/include/stdlib.h:293: error: nonnull argument has invalid operand number (argument 1)
/usr/include/stdlib.h:300: error: nonnull argument has invalid operand number (argument 1)
/usr/include/stdlib.h:309: error: nonnull argument has invalid operand number (argument 1)
/usr/include/stdlib.h:318: error: nonnull argument has invalid operand number (argument 1)
/usr/include/stdlib.h:433: error: nonnull argument has invalid operand number (argument 1)
/usr/include/stdlib.h:455: error: nonnull argument has invalid operand number (argument 1)
/usr/include/stdlib.h:459: error: nonnull argument has invalid operand number (argument 1)
/usr/include/stdlib.h:479: error: nonnull argument has invalid operand number (argument 1)
/usr/include/stdlib.h:482: error: nonnull argument has invalid operand number (argument 1)
/usr/include/stdlib.h:487: error: nonnull argument has invalid operand number (argument 1)
/usr/include/stdlib.h:491: error: nonnull argument has invalid operand number (argument 1)
/usr/include/stdlib.h:514: error: size of array ‘__xsubi’ is too large
/usr/include/stdlib.h:514: error: nonnull argument has invalid operand number (argument 1)
/usr/include/stdlib.h:518: error: size of array ‘__xsubi’ is too large
/usr/include/stdlib.h:519: error: nonnull argument has invalid operand number (argument 1)
/usr/include/stdlib.h:523: error: size of array ‘__xsubi’ is too large
/usr/include/stdlib.h:524: error: nonnull argument has invalid operand number (argument 1)
/usr/include/stdlib.h:528: error: size of array ‘__seed16v’ is too large
/usr/include/stdlib.h:529: error: nonnull argument has invalid operand number (argument 1)
/usr/include/stdlib.h:530: error: size of array ‘__param’ is too large
/usr/include/stdlib.h:530: error: nonnull argument has invalid operand number (argument 1)
/usr/include/stdlib.h:538: error: size of array ‘__x’ is too large
/usr/include/stdlib.h:539: error: size of array ‘__old_x’ is too large
/usr/include/stdlib.h:547: error: nonnull argument has invalid operand number (argument 1)
/usr/include/stdlib.h:548: error: size of array ‘__xsubi’ is too large
/usr/include/stdlib.h:550: error: nonnull argument has invalid operand number (argument 1)
/usr/include/stdlib.h:555: error: nonnull argument has invalid operand number (argument 1)
/usr/include/stdlib.h:556: error: size of array ‘__xsubi’ is too large
/usr/include/stdlib.h:559: error: nonnull argument has invalid operand number (argument 1)
/usr/include/stdlib.h:564: error: nonnull argument has invalid operand number (argument 1)
/usr/include/stdlib.h:565: error: size of array ‘__xsubi’ is too large
/usr/include/stdlib.h:568: error: nonnull argument has invalid operand number (argument 1)
/usr/include/stdlib.h:572: error: nonnull argument has invalid operand number (argument 1)
/usr/include/stdlib.h:574: error: size of array ‘__seed16v’ is too large
/usr/include/stdlib.h:575: error: nonnull argument has invalid operand number (argument 1)
/usr/include/stdlib.h:577: error: size of array ‘__param’ is too large
/usr/include/stdlib.h:579: error: nonnull argument has invalid operand number (argument 1)
In file included from ../../gcc/tsystem.h:104,
from ../../gcc/crtstuff.c:68:
/usr/include/stdlib.h:623: error: nonnull argument has invalid operand number (argument 1)
/usr/include/stdlib.h:632: error: nonnull argument has invalid operand number (argument 1)
/usr/include/stdlib.h:639: error: nonnull argument has invalid operand number (argument 1)
/usr/include/stdlib.h:660: error: nonnull argument has invalid operand number (argument 1)
/usr/include/stdlib.h:666: error: nonnull argument has invalid operand number (argument 1)
/usr/include/stdlib.h:672: error: nonnull argument has invalid operand number (argument 1)
/usr/include/stdlib.h:679: error: nonnull argument has invalid operand number (argument 1)
/usr/include/stdlib.h:698: error: nonnull argument has invalid operand number (argument 1)
/usr/include/stdlib.h:709: error: nonnull argument has invalid operand number (argument 1)
/usr/include/stdlib.h:719: error: nonnull argument has invalid operand number (argument 1)
/usr/include/stdlib.h:729: error: nonnull argument has invalid operand number (argument 1)
/usr/include/stdlib.h:747: error: nonnull argument has invalid operand number (argument 1)
/usr/include/stdlib.h:777: error: nonnull argument has invalid operand number (argument 1)
/usr/include/stdlib.h:782: error: nonnull argument has invalid operand number (argument 1)
/usr/include/stdlib.h:823: error: nonnull argument has invalid operand number (argument 1)
/usr/include/stdlib.h:829: error: nonnull argument has invalid operand number (argument 1)
/usr/include/stdlib.h:835: error: nonnull argument has invalid operand number (argument 1)
/usr/include/stdlib.h:842: error: nonnull argument has invalid operand number (argument 1)
/usr/include/stdlib.h:845: error: nonnull argument has invalid operand number (argument 1)
/usr/include/stdlib.h:847: error: nonnull argument has invalid operand number (argument 1)
/usr/include/stdlib.h:854: error: nonnull argument has invalid operand number (argument 1)
/usr/include/stdlib.h:857: error: nonnull argument has invalid operand number (argument 1)
/usr/include/stdlib.h:862: error: nonnull argument has invalid operand number (argument 1)
/usr/include/stdlib.h:866: error: nonnull argument has invalid operand number (argument 1)
/usr/include/stdlib.h:899: error: nonnull argument has invalid operand number (argument 1)
/usr/include/stdlib.h:913: error: nonnull argument has invalid operand number (argument 1)
/usr/include/stdlib.h:919: error: nonnull argument has invalid operand number (argument 1)
/usr/include/stdlib.h:952: error: nonnull argument has invalid operand number (argument 1)
/usr/include/stdlib.h:963: error: nonnull argument has invalid operand number (argument 1)
In file included from /usr/include/stdlib.h:969,
from ../../gcc/tsystem.h:104,
from ../../gcc/crtstuff.c:68:
/usr/include/bits/stdlib.h:42: error: nonnull argument has invalid operand number (argument 1)
/usr/include/bits/stdlib.h:45: error: nonnull argument has invalid operand number (argument 1)
In file included from ../../gcc/tsystem.h:105,
from ../../gcc/crtstuff.c:68:
/usr/include/unistd.h:256: error: nonnull argument has invalid operand number (argument 1)
/usr/include/unistd.h:262: error: nonnull argument has invalid operand number (argument 1)
/usr/include/unistd.h:266: error: nonnull argument has invalid operand number (argument 1)
/usr/include/unistd.h:274: error: nonnull argument has invalid operand number (argument 1)
/usr/include/unistd.h:382: error: size of array ‘__pipedes’ is too large
/usr/include/unistd.h:432: error: nonnull argument has invalid operand number (argument 1)
/usr/include/unistd.h:442: error: nonnull argument has invalid operand number (argument 1)
/usr/include/unistd.h:451: error: nonnull argument has invalid operand number (argument 1)
/usr/include/unistd.h:455: error: nonnull argument has invalid operand number (argument 1)
/usr/include/unistd.h:483: error: nonnull argument has invalid operand number (argument 1)
/usr/include/unistd.h:503: error: nonnull argument has invalid operand number (argument 1)
/usr/include/unistd.h:515: error: nonnull argument has invalid operand number (argument 1)
/usr/include/unistd.h:520: error: nonnull argument has invalid operand number (argument 1)
/usr/include/unistd.h:525: error: nonnull argument has invalid operand number (argument 1)
/usr/include/unistd.h:530: error: nonnull argument has invalid operand number (argument 1)
/usr/include/unistd.h:536: error: nonnull argument has invalid operand number (argument 1)
In file included from ../../gcc/tsystem.h:105,
from ../../gcc/crtstuff.c:68:
/usr/include/unistd.h:556: error: nonnull argument has invalid operand number (argument 1)
/usr/include/unistd.h:739: error: nonnull argument has invalid operand number (argument 1)
/usr/include/unistd.h:755: error: nonnull argument has invalid operand number (argument 1)
/usr/include/unistd.h:762: error: nonnull argument has invalid operand number (argument 1)
/usr/include/unistd.h:768: error: nonnull argument has invalid operand number (argument 1)
/usr/include/unistd.h:775: error: nonnull argument has invalid operand number (argument 1)
/usr/include/unistd.h:781: error: nonnull argument has invalid operand number (argument 1)
/usr/include/unistd.h:786: error: nonnull argument has invalid operand number (argument 1)
/usr/include/unistd.h:790: error: nonnull argument has invalid operand number (argument 1)
/usr/include/unistd.h:795: error: nonnull argument has invalid operand number (argument 1)
/usr/include/unistd.h:799: error: nonnull argument has invalid operand number (argument 1)
/usr/include/unistd.h:821: error: nonnull argument has invalid operand number (argument 1)
/usr/include/unistd.h:826: error: nonnull argument has invalid operand number (argument 1)
In file included from ../../gcc/tsystem.h:105,
from ../../gcc/crtstuff.c:68:
/usr/include/unistd.h:843: error: nonnull argument has invalid operand number (argument 1)
/usr/include/unistd.h:851: error: nonnull argument has invalid operand number (argument 1)
/usr/include/unistd.h:862: error: nonnull argument has invalid operand number (argument 1)
/usr/include/unistd.h:864: error: nonnull argument has invalid operand number (argument 1)
/usr/include/unistd.h:873: error: nonnull argument has invalid operand number (argument 1)
/usr/include/unistd.h:883: error: nonnull argument has invalid operand number (argument 1)
/usr/include/unistd.h:908: error: nonnull argument has invalid operand number (argument 1)
/usr/include/unistd.h:912: error: nonnull argument has invalid operand number (argument 1)
/usr/include/unistd.h:947: error: nonnull argument has invalid operand number (argument 1)
/usr/include/unistd.h:959: error: nonnull argument has invalid operand number (argument 1)
/usr/include/unistd.h:1072: error: nonnull argument has invalid operand number (argument 1)
/usr/include/unistd.h:1076: error: nonnull argument has invalid operand number (argument 1)
/usr/include/unistd.h:1084: error: nonnull argument has invalid operand number (argument 1)
In file included from /usr/include/unistd.h:1098,
from ../../gcc/tsystem.h:105,
from ../../gcc/crtstuff.c:68:
/usr/include/bits/unistd.h:86: error: nonnull argument has invalid operand number (argument 1)
/usr/include/bits/unistd.h:90: error: nonnull argument has invalid operand number (argument 1)
/usr/include/bits/unistd.h:95: error: nonnull argument has invalid operand number (argument 1)
/usr/include/bits/unistd.h:119: error: nonnull argument has invalid operand number (argument 1)
/usr/include/bits/unistd.h:121: error: nonnull argument has invalid operand number (argument 1)
/usr/include/bits/unistd.h:125: error: nonnull argument has invalid operand number (argument 1)
/usr/include/bits/unistd.h:164: error: nonnull argument has invalid operand number (argument 1)
/usr/include/bits/unistd.h:167: error: nonnull argument has invalid operand number (argument 1)
/usr/include/bits/unistd.h:181: error: nonnull argument has invalid operand number (argument 1)
/usr/include/bits/unistd.h:182: error: nonnull argument has invalid operand number (argument 1)
/usr/include/bits/unistd.h:198: error: nonnull argument has invalid operand number (argument 1)
/usr/include/bits/unistd.h:199: error: nonnull argument has invalid operand number (argument 1)
/usr/include/bits/unistd.h:215: error: nonnull argument has invalid operand number (argument 1)
/usr/include/bits/unistd.h:216: error: nonnull argument has invalid operand number (argument 1)
In file included from ../../gcc/tsystem.h:111,
from ../../gcc/crtstuff.c:68:
/usr/include/time.h:275: error: size of array ‘__tzname’ is too large
/usr/include/time.h:282: error: size of array ‘tzname’ is too large
In file included from ./tm.h:7,
from ../../gcc/crtstuff.c:70:
../../gcc/config/sparc/sparc.h:1074: warning: integer constant is too large for ‘long’ type
../../gcc/config/sparc/sparc.h:1074: error: size of array ‘sparc_regno_reg_class’ is too large
../../gcc/config/sparc/sparc.h:1618: warning: integer constant is too large for ‘long’ type
../../gcc/config/sparc/sparc.h:1618: error: size of array ‘sparc_hard_reg_printed’ is too large
In file included from ../../gcc/crtstuff.c:71:
../../gcc/unwind-dw2-fde.h:59: warning: integer constant is too large for ‘long’ type
../../gcc/unwind-dw2-fde.h:59: error: width of ‘sorted’ exceeds its type
../../gcc/unwind-dw2-fde.h:60: warning: integer constant is too large for ‘long’ type
../../gcc/unwind-dw2-fde.h:60: error: width of ‘from_array’ exceeds its type
../../gcc/unwind-dw2-fde.h:61: warning: integer constant is too large for ‘long’ type
../../gcc/unwind-dw2-fde.h:61: error: width of ‘mixed_encoding’ exceeds its type
../../gcc/unwind-dw2-fde.h:62: warning: integer constant is too large for ‘long’ type
../../gcc/unwind-dw2-fde.h:62: error: width of ‘encoding’ exceeds its type
../../gcc/unwind-dw2-fde.h:65: warning: integer constant is too large for ‘long’ type
../../gcc/unwind-dw2-fde.h:65: error: width of ‘count’ exceeds its type
../../gcc/unwind-dw2-fde.h: In function ‘last_fde’:
../../gcc/unwind-dw2-fde.h:180: warning: integer constant is too large for ‘long’ type
../../gcc/unwind-dw2-fde.h:180: warning: comparison is always false due to limited range of data type
In file included from /usr/include/link.h:25,
from ../../gcc/crtstuff.c:92:
/usr/include/elf.h: At top level:
/usr/include/elf.h:70: error: size of array ‘e_ident’ is too large
/usr/include/elf.h:88: error: size of array ‘e_ident’ is too large
/usr/include/elf.h:1391: error: size of array ‘ri_cprmask’ is too large
In file included from /usr/include/link.h:26,
from ../../gcc/crtstuff.c:92:
/usr/include/dlfcn.h:62: error: nonnull argument has invalid operand number (argument 1)
/usr/include/dlfcn.h:67: error: nonnull argument has invalid operand number (argument 1)
/usr/include/dlfcn.h:78: error: nonnull argument has invalid operand number (argument 1)
/usr/include/dlfcn.h:101: error: nonnull argument has invalid operand number (argument 1)
/usr/include/dlfcn.h:105: error: nonnull argument has invalid operand number (argument 1)
/usr/include/dlfcn.h:127: error: nonnull argument has invalid operand number (argument 1)
/usr/include/dlfcn.h:185: error: size of array ‘dls_serpath’ is too large
In file included from /usr/include/link.h:36,
from ../../gcc/crtstuff.c:92:
/usr/include/bits/link.h:28: error: size of array ‘lr_lreg’ is too large
/usr/include/bits/link.h:29: error: size of array ‘lr_reg’ is too large
/usr/include/bits/link.h:37: error: size of array ‘lrv_reg’ is too large
/usr/include/bits/link.h:38: error: size of array ‘lrv_fpreg’ is too large
../../gcc/crtstuff.c:184: warning: integer constant is too large for ‘long’ type
../../gcc/crtstuff.c:186: error: size of array ‘__CTOR_LIST__’ is too large
../../gcc/crtstuff.c:186: warning: integer constant is too large for ‘long’ type
../../gcc/crtstuff.c:197: warning: integer constant is too large for ‘long’ type
../../gcc/crtstuff.c:199: error: size of array ‘__DTOR_LIST__’ is too large
../../gcc/crtstuff.c:199: warning: integer constant is too large for ‘long’ type
../../gcc/crtstuff.c:234: warning: initialization makes pointer from integer without a cast
../../gcc/crtstuff.c: In function ‘__do_global_dtors_aux’:
../../gcc/crtstuff.c:264: warning: integer constant is too large for ‘long’ type
../../gcc/crtstuff.c:269: warning: integer constant is too large for ‘long’ type
../../gcc/crtstuff.c:269: warning: overflow in implicit constant conversion
../../gcc/crtstuff.c:300: warning: integer constant is too large for ‘long’ type
../../gcc/crtstuff.c: In function ‘frame_dummy’:
../../gcc/crtstuff.c:334: warning: integer constant is too large for ‘long’ type
make[2]: *** [crtbegin.o] Error 1
make[2]: Leaving directory `/usr/RPM/BUILD/gcc-4.1.2/obj-sparcv9-mandriva-linux-gnu/gcc'
make[1]: *** [all-gcc] Error 2
make[1]: Leaving directory `/usr/RPM/BUILD/gcc-4.1.2/obj-sparcv9-mandriva-linux-gnu'
make: *** [all] Error 2
[peroyvind@cm-84 obj-sparcv9-mandriva-linux-gnu]$