rendered paste body conftest.c -lm -lm -L/usr/local/lib -lcurl -lcares -ldl >&5
configure:23515: $? = 0
configure:23519: test -z
|| test ! -s conftest.err
configure:23522: $? = 0
configure:23525: test -s conftest
configure:23528: $? = 0
configure:23541: result: yes
configure:23551: checking for powf in -lm
configure:23581: gcc -o conftest -g -O2 -I/usr/share/doc/NVIDIA_GLX-1.0/include -I/usr/X11R6/include -lpthread -L/usr/X11R6/lib conftest.c -lm -lm -L/usr/local/lib -lcurl -lcares -ldl >&5
configure:23587: $? = 0
configure:23591: test -z
|| test ! -s conftest.err
configure:23594: $? = 0
configure:23597: test -s conftest
configure:23600: $? = 0
configure:23613: result: yes
configure:23623: checking for sinf in -lm
configure:23653: gcc -o conftest -g -O2 -I/usr/share/doc/NVIDIA_GLX-1.0/include -I/usr/X11R6/include -lpthread -L/usr/X11R6/lib conftest.c -lm -lm -L/usr/local/lib -lcurl -lcares -ldl >&5
conftest.c:64: warning: conflicting types for built-in function `sinf'
configure:23659: $? = 0
configure:23663: test -z
|| test ! -s conftest.err
configure:23666: $? = 0
configure:23669: test -s conftest
configure:23672: $? = 0
configure:23685: result: yes
configure:23695: checking for sqrtf in -lm
configure:23757: result: yes
configure:23767: checking for tanf in -lm
configure:23797: gcc -o conftest -g -O2 -I/usr/share/doc/NVIDIA_GLX-1.0/include -I/usr/X11R6/include -lpthread -L/usr/X11R6/lib conftest.c -lm -lm -L/usr/local/lib -lcurl -lcares -ldl >&5
configure:23803: $? = 0
configure:23807: test -z
|| test ! -s conftest.err
configure:23810: $? = 0
configure:23813: test -s conftest
configure:23816: $? = 0
configure:23829: result: yes
configure:23851: checking for XextAddDisplay in -lXext
configure:23881: gcc -o conftest -g -O2 -I/usr/share/doc/NVIDIA_GLX-1.0/include -I/usr/X11R6/include -lpthread -L/usr/X11R6/lib conftest.c -lXext -lSM -lICE -lX11 -lm -L/usr/local/lib -lcurl -lcares -ldl >&5
configure:23887: $? = 0
configure:23891: test -z
|| test ! -s conftest.err
configure:23894: $? = 0
configure:23897: test -s conftest
configure:23900: $? = 0
configure:23913: result: yes
configure:23921: checking for XF86VidModeGetAllModeLines in -lXxf86vm
configure:23951: gcc -o conftest -g -O2 -I/usr/share/doc/NVIDIA_GLX-1.0/include -I/usr/X11R6/include -lpthread -L/usr/X11R6/lib conftest.c -lXxf86vm -lXext -lSM -lICE -lX11 -lm -L/usr/local/lib -lcurl -lcares -ldl >&5
configure:23957: $? = 0
configure:23961: test -z
|| test ! -s conftest.err
configure:23964: $? = 0
configure:23967: test -s conftest
configure:23970: $? = 0
configure:23983: result: yes
configure:23989: checking for XListInputDevices in -lXi
configure:24019: gcc -o conftest -g -O2 -I/usr/share/doc/NVIDIA_GLX-1.0/include -I/usr/X11R6/include -lpthread -L/usr/X11R6/lib conftest.c -lXi -lXxf86vm -lXext -lSM -lICE -lX11 -lm -L/usr/local/lib -lcurl -lcares -ldl >&5
configure:24025: $? = 0
configure:24029: test -z
|| test ! -s conftest.err
configure:24032: $? = 0
configure:24035: test -s conftest
configure:24038: $? = 0
configure:24051: result: yes
configure:24090: g++ -o conftest -g -O2 -I/usr/share/doc/NVIDIA_GLX-1.0/include -I/usr/X11R6/include -lpthread -L/usr/X11R6/lib conftest.cc -lm -L/usr/local/lib -lcurl -lcares -ldl >&5
configure:24096: $? = 0
configure:24100: test -z
|| test ! -s conftest.err
configure:24103: $? = 0
configure:24106: test -s conftest
configure:24109: $? = 0
configure:24145: g++ -o conftest -g -O2 -I/usr/share/doc/NVIDIA_GLX-1.0/include -I/usr/X11R6/include -lpthread -L/usr/X11R6/lib conftest.cc -framework OpenGL -lXi -lXxf86vm -lXext -lSM -lICE -lX11 -lm -L/usr/local/lib -lcurl -lcares -ldl >&5
g++: OpenGL: No such file or directory
cc1plus: error: unrecognized option `-framework'
configure:24151: $? = 1
configure: failed program was:
| /* confdefs.h. */
|
| #define PACKAGE_NAME ""
| #define PACKAGE_TARNAME ""
| #define PACKAGE_VERSION ""
| #define PACKAGE_STRING ""
| #define PACKAGE_BUGREPORT ""
| #define PACKAGE "bzflag"
| #define VERSION "2.0.4.20051024"
| #define BZ_BUILD_OS "linux-gnu"
| #define BZ_BUILD_USER "patrick"
| #define BUILD_REGEX 1
| #ifdef __cplusplus
| extern "C" void std::exit (int) throw (); using std::exit;
| #endif
| #define STDC_HEADERS 1
| #define HAVE_SYS_TYPES_H 1
| #define HAVE_SYS_STAT_H 1
| #define HAVE_STDLIB_H 1
| #define HAVE_STRING_H 1
| #define HAVE_MEMORY_H 1
| #define HAVE_STRINGS_H 1
| #define HAVE_INTTYPES_H 1
| #define HAVE_STDINT_H 1
| #define HAVE_UNISTD_H 1
| #define HAVE_DLFCN_H 1
| #define STDC_HEADERS 1
| #define HAVE_CSTDLIB 1
| #define HAVE_CSTDIO 1
| #define HAVE_CSTRING 1
| #define HAVE_GL_GLX_H 1
| #define HAVE_SDL_SDL_H 1
| #define HAVE_X11_XLIB_H 1
| #define HAVE_LINUX_INPUT_H 1
| #define HAVE_STDINT_H 1
| #define HAVE_SYS_PARAM_H 1
| #define HAVE_UNISTD_H 1
| #define HAVE_VALUES_H 1
| #define HAVE_SOCKLEN_T 1
| #define HAVE_FF_EFFECT_RUMBLE 1
| #define HAVE_FF_EFFECT_DIRECTIONAL 1
| #define HAVE_LIBM 1
| #define HAVE_ACOSF 1
| #define HAVE_ASINF 1
| #define HAVE_ATAN2F 1
| #define HAVE_ATANF 1
| #define HAVE_COSF 1
| #define HAVE_EXPF 1
| #define HAVE_FABSF 1
| #define HAVE_FLOORF 1
| #define HAVE_FMODF 1
| #define HAVE_HYPOTF 1
| #define HAVE_LOGF 1
| #define HAVE_LOG10F 1
| #define HAVE_POWF 1
| #define HAVE_SINF 1
| #define HAVE_SQRTF 1
| #define HAVE_TANF 1
| #define HAVE_REGEX_H 1
| /* end confdefs.h. */
| #include <OpenGL/gl.h>
| int
| main ()
| {
| glBegin(GL_POINTS)
| ;
| return 0;
| }
configure:24192: g++ -o conftest -g -O2 -I/usr/share/doc/NVIDIA_GLX-1.0/include -I/usr/X11R6/include -lpthread -L/usr/X11R6/lib conftest.cc -lopengl32 -lXi -lXxf86vm -lXext -lSM -lICE -lX11 -lm -L/usr/local/lib -lcurl -lcares -ldl >&5
/usr/lib/gcc-lib/i586-suse-linux/3.3.4/../../../../i586-suse-linux/bin/ld: cannot find -lopengl32
collect2: ld returned 1 exit status
configure:24198: $? = 1
configure: failed program was:
| /* confdefs.h. */
|
| #define PACKAGE_NAME ""
| #define PACKAGE_TARNAME ""
| #define PACKAGE_VERSION ""
| #define PACKAGE_STRING ""
| #define PACKAGE_BUGREPORT ""
| #define PACKAGE "bzflag"
| #define VERSION "2.0.4.20051024"
| #define BZ_BUILD_OS "linux-gnu"
| #define BZ_BUILD_USER "patrick"
| #define BUILD_REGEX 1
| #ifdef __cplusplus
| extern "C" void std::exit (int) throw (); using std::exit;
| #endif
| #define STDC_HEADERS 1
| #define HAVE_SYS_TYPES_H 1
| #define HAVE_SYS_STAT_H 1
| #define HAVE_STDLIB_H 1
| #define HAVE_STRING_H 1
| #define HAVE_MEMORY_H 1
| #define HAVE_STRINGS_H 1
| #define HAVE_INTTYPES_H 1
| #define HAVE_STDINT_H 1
| #define HAVE_UNISTD_H 1
| #define HAVE_DLFCN_H 1
| #define STDC_HEADERS 1
| #define HAVE_CSTDLIB 1
| #define HAVE_CSTDIO 1
| #define HAVE_CSTRING 1
| #define HAVE_GL_GLX_H 1
| #define HAVE_SDL_SDL_H 1
| #define HAVE_X11_XLIB_H 1
| #define HAVE_LINUX_INPUT_H 1
| #define HAVE_STDINT_H 1
| #define HAVE_SYS_PARAM_H 1
| #define HAVE_UNISTD_H 1
| #define HAVE_VALUES_H 1
| #define HAVE_SOCKLEN_T 1
| #define HAVE_FF_EFFECT_RUMBLE 1
| #define HAVE_FF_EFFECT_DIRECTIONAL 1
| #define HAVE_LIBM 1
| #define HAVE_ACOSF 1
| #define HAVE_ASINF 1
| #define HAVE_ATAN2F 1
| #define HAVE_ATANF 1
| #define HAVE_COSF 1
| #define HAVE_EXPF 1
| #define HAVE_FABSF 1
| #define HAVE_FLOORF 1
| #define HAVE_FMODF 1
| #define HAVE_HYPOTF 1
| #define HAVE_LOGF 1
| #define HAVE_LOG10F 1
| #define HAVE_POWF 1
| #define HAVE_SINF 1
| #define HAVE_SQRTF 1
| #define HAVE_TANF 1
| #define HAVE_REGEX_H 1
| /* end confdefs.h. */
| #include <GL/gl.h>
| int
| main ()
| {
| glBegin(GL_POINTS)
| ;
| return 0;
| }
configure:24192: g++ -o conftest -g -O2 -I/usr/share/doc/NVIDIA_GLX-1.0/include -I/usr/X11R6/include -lpthread -L/usr/X11R6/lib conftest.cc -lGL -lXi -lXxf86vm -lXext -lSM -lICE -lX11 -lm -L/usr/local/lib -lcurl -lcares -ldl >&5
configure:24198: $? = 0
configure:24202: test -z
|| test ! -s conftest.err
configure:24205: $? = 0
configure:24208: test -s conftest
configure:24211: $? = 0
configure:24250: g++ -o conftest -g -O2 -I/usr/share/doc/NVIDIA_GLX-1.0/include -I/usr/X11R6/include -lpthread -L/usr/X11R6/lib conftest.cc -framework OpenGL -lm -L/usr/local/lib -lcurl -lcares -ldl >&5
g++: OpenGL: No such file or directory
cc1plus: error: unrecognized option `-framework'
configure:24256: $? = 1
configure: failed program was:
| /* confdefs.h. */
|
| #define PACKAGE_NAME ""
| #define PACKAGE_TARNAME ""
| #define PACKAGE_VERSION ""
| #define PACKAGE_STRING ""
| #define PACKAGE_BUGREPORT ""
| #define PACKAGE "bzflag"
| #define VERSION "2.0.4.20051024"
| #define BZ_BUILD_OS "linux-gnu"
| #define BZ_BUILD_USER "patrick"
| #define BUILD_REGEX 1
| #ifdef __cplusplus
| extern "C" void std::exit (int) throw (); using std::exit;
| #endif
| #define STDC_HEADERS 1
| #define HAVE_SYS_TYPES_H 1
| #define HAVE_SYS_STAT_H 1
| #define HAVE_STDLIB_H 1
| #define HAVE_STRING_H 1
| #define HAVE_MEMORY_H 1
| #define HAVE_STRINGS_H 1
| #define HAVE_INTTYPES_H 1
| #define HAVE_STDINT_H 1
| #define HAVE_UNISTD_H 1
| #define HAVE_DLFCN_H 1
| #define STDC_HEADERS 1
| #define HAVE_CSTDLIB 1
| #define HAVE_CSTDIO 1
| #define HAVE_CSTRING 1
| #define HAVE_GL_GLX_H 1
| #define HAVE_SDL_SDL_H 1
| #define HAVE_X11_XLIB_H 1
| #define HAVE_LINUX_INPUT_H 1
| #define HAVE_STDINT_H 1
| #define HAVE_SYS_PARAM_H 1
| #define HAVE_UNISTD_H 1
| #define HAVE_VALUES_H 1
| #define HAVE_SOCKLEN_T 1
| #define HAVE_FF_EFFECT_RUMBLE 1
| #define HAVE_FF_EFFECT_DIRECTIONAL 1
| #define HAVE_LIBM 1
| #define HAVE_ACOSF 1
| #define HAVE_ASINF 1
| #define HAVE_ATAN2F 1
| #define HAVE_ATANF 1
| #define HAVE_COSF 1
| #define HAVE_EXPF 1
| #define HAVE_FABSF 1
| #define HAVE_FLOORF 1
| #define HAVE_FMODF 1
| #define HAVE_HYPOTF 1
| #define HAVE_LOGF 1
| #define HAVE_LOG10F 1
| #define HAVE_POWF 1
| #define HAVE_SINF 1
| #define HAVE_SQRTF 1
| #define HAVE_TANF 1
| #define HAVE_REGEX_H 1
| /* end confdefs.h. */
| #include <OpenGL/glu.h>
| int
| main ()
| {
| gluScaleImage(GL_RED,0,0,GL_INT,0,0,0,GL_INT,0)
| ;
| return 0;
| }
configure:24297: g++ -o conftest -g -O2 -I/usr/share/doc/NVIDIA_GLX-1.0/include -I/usr/X11R6/include -lpthread -L/usr/X11R6/lib conftest.cc -lglu32 -lGL -lXi -lXxf86vm -lXext -lSM -lICE -lX11 -lm -L/usr/local/lib -lcurl -lcares -ldl >&5
conftest.cc:61:20: GL/glu.h: No such file or directory
conftest.cc: In function `int main()':
conftest.cc:65: error: `GL_RED' undeclared (first use this function)
conftest.cc:65: error: (Each undeclared identifier is reported only once for
each function it appears in.)
conftest.cc:65: error: `GL_INT' undeclared (first use this function)
conftest.cc:65: error: `gluScaleImage' undeclared (first use this function)
configure:24303: $? = 1
configure: failed program was:
| /* confdefs.h. */
|
| #define PACKAGE_NAME ""
| #define PACKAGE_TARNAME ""
| #define PACKAGE_VERSION ""
| #define PACKAGE_STRING ""
| #define PACKAGE_BUGREPORT ""
| #define PACKAGE "bzflag"
| #define VERSION "2.0.4.20051024"
| #define BZ_BUILD_OS "linux-gnu"
| #define BZ_BUILD_USER "patrick"
| #define BUILD_REGEX 1
| #ifdef __cplusplus
| extern "C" void std::exit (int) throw (); using std::exit;
| #endif
| #define STDC_HEADERS 1
| #define HAVE_SYS_TYPES_H 1
| #define HAVE_SYS_STAT_H 1
| #define HAVE_STDLIB_H 1
| #define HAVE_STRING_H 1
| #define HAVE_MEMORY_H 1
| #define HAVE_STRINGS_H 1
| #define HAVE_INTTYPES_H 1
| #define HAVE_STDINT_H 1
| #define HAVE_UNISTD_H 1
| #define HAVE_DLFCN_H 1
| #define STDC_HEADERS 1
| #define HAVE_CSTDLIB 1
| #define HAVE_CSTDIO 1
| #define HAVE_CSTRING 1
| #define HAVE_GL_GLX_H 1
| #define HAVE_SDL_SDL_H 1
| #define HAVE_X11_XLIB_H 1
| #define HAVE_LINUX_INPUT_H 1
| #define HAVE_STDINT_H 1
| #define HAVE_SYS_PARAM_H 1
| #define HAVE_UNISTD_H 1
| #define HAVE_VALUES_H 1
| #define HAVE_SOCKLEN_T 1
| #define HAVE_FF_EFFECT_RUMBLE 1
| #define HAVE_FF_EFFECT_DIRECTIONAL 1
| #define HAVE_LIBM 1
| #define HAVE_ACOSF 1
| #define HAVE_ASINF 1
| #define HAVE_ATAN2F 1
| #define HAVE_ATANF 1
| #define HAVE_COSF 1
| #define HAVE_EXPF 1
| #define HAVE_FABSF 1
| #define HAVE_FLOORF 1
| #define HAVE_FMODF 1
| #define HAVE_HYPOTF 1
| #define HAVE_LOGF 1
| #define HAVE_LOG10F 1
| #define HAVE_POWF 1
| #define HAVE_SINF 1
| #define HAVE_SQRTF 1
| #define HAVE_TANF 1
| #define HAVE_REGEX_H 1
| /* end confdefs.h. */
| #include <GL/glu.h>
| int
| main ()
| {
| gluScaleImage(GL_RED,0,0,GL_INT,0,0,0,GL_INT,0)
| ;
| return 0;
| }
configure:24297: g++ -o conftest -g -O2 -I/usr/share/doc/NVIDIA_GLX-1.0/include -I/usr/X11R6/include -lpthread -L/usr/X11R6/lib conftest.cc -lGL -lGL -lXi -lXxf86vm -lXext -lSM -lICE -lX11 -lm -L/usr/local/lib -lcurl -lcares -ldl >&5
conftest.cc:61:20: GL/glu.h: No such file or directory
conftest.cc: In function `int main()':
conftest.cc:65: error: `GL_RED' undeclared (first use this function)
conftest.cc:65: error: (Each undeclared identifier is reported only once for
each function it appears in.)
conftest.cc:65: error: `GL_INT' undeclared (first use this function)
conftest.cc:65: error: `gluScaleImage' undeclared (first use this function)
configure:24303: $? = 1
configure: failed program was:
| /* confdefs.h. */
|
| #define PACKAGE_NAME ""
| #define PACKAGE_TARNAME ""
| #define PACKAGE_VERSION ""
| #define PACKAGE_STRING ""
| #define PACKAGE_BUGREPORT ""
| #define PACKAGE "bzflag"
| #define VERSION "2.0.4.20051024"
| #define BZ_BUILD_OS "linux-gnu"
| #define BZ_BUILD_USER "patrick"
| #define BUILD_REGEX 1
| #ifdef __cplusplus
| extern "C" void std::exit (int) throw (); using std::exit;
| #endif
| #define STDC_HEADERS 1
| #define HAVE_SYS_TYPES_H 1
| #define HAVE_SYS_STAT_H 1
| #define HAVE_STDLIB_H 1
| #define HAVE_STRING_H 1
| #define HAVE_MEMORY_H 1
| #define HAVE_STRINGS_H 1
| #define HAVE_INTTYPES_H 1
| #define HAVE_STDINT_H 1
| #define HAVE_UNISTD_H 1
| #define HAVE_DLFCN_H 1
| #define STDC_HEADERS 1
| #define HAVE_CSTDLIB 1
| #define HAVE_CSTDIO 1
| #define HAVE_CSTRING 1
| #define HAVE_GL_GLX_H 1
| #define HAVE_SDL_SDL_H 1
| #define HAVE_X11_XLIB_H 1
| #define HAVE_LINUX_INPUT_H 1
| #define HAVE_STDINT_H 1
| #define HAVE_SYS_PARAM_H 1
| #define HAVE_UNISTD_H 1
| #define HAVE_VALUES_H 1
| #define HAVE_SOCKLEN_T 1
| #define HAVE_FF_EFFECT_RUMBLE 1
| #define HAVE_FF_EFFECT_DIRECTIONAL 1
| #define HAVE_LIBM 1
| #define HAVE_ACOSF 1
| #define HAVE_ASINF 1
| #define HAVE_ATAN2F 1
| #define HAVE_ATANF 1
| #define HAVE_COSF 1
| #define HAVE_EXPF 1
| #define HAVE_FABSF 1
| #define HAVE_FLOORF 1
| #define HAVE_FMODF 1
| #define HAVE_HYPOTF 1
| #define HAVE_LOGF 1
| #define HAVE_LOG10F 1
| #define HAVE_POWF 1
| #define HAVE_SINF 1
| #define HAVE_SQRTF 1
| #define HAVE_TANF 1
| #define HAVE_REGEX_H 1
| /* end confdefs.h. */
| #include <GL/glu.h>
| int
| main ()
| {
| gluScaleImage(GL_RED,0,0,GL_INT,0,0,0,GL_INT,0)
| ;
| return 0;
| }
configure:24297: g++ -o conftest -g -O2 -I/usr/share/doc/NVIDIA_GLX-1.0/include -I/usr/X11R6/include -lpthread -L/usr/X11R6/lib conftest.cc -lGLU -lGL -lXi -lXxf86vm -lXext -lSM -lICE -lX11 -lm -L/usr/local/lib -lcurl -lcares -ldl >&5
conftest.cc:61:20: GL/glu.h: No such file or directory
conftest.cc: In function `int main()':
conftest.cc:65: error: `GL_RED' undeclared (first use this function)
conftest.cc:65: error: (Each undeclared identifier is reported only once for
each function it appears in.)
conftest.cc:65: error: `GL_INT' undeclared (first use this function)
conftest.cc:65: error: `gluScaleImage' undeclared (first use this function)
configure:24303: $? = 1
configure: failed program was:
| /* confdefs.h. */
|
| #define PACKAGE_NAME ""
| #define PACKAGE_TARNAME ""
| #define PACKAGE_VERSION ""
| #define PACKAGE_STRING ""
| #define PACKAGE_BUGREPORT ""
| #define PACKAGE "bzflag"
| #define VERSION "2.0.4.20051024"
| #define BZ_BUILD_OS "linux-gnu"
| #define BZ_BUILD_USER "patrick"
| #define BUILD_REGEX 1
| #ifdef __cplusplus
| extern "C" void std::exit (int) throw (); using std::exit;
| #endif
| #define STDC_HEADERS 1
| #define HAVE_SYS_TYPES_H 1
| #define HAVE_SYS_STAT_H 1
| #define HAVE_STDLIB_H 1
| #define HAVE_STRING_H 1
| #define HAVE_MEMORY_H 1
| #define HAVE_STRINGS_H 1
| #define HAVE_INTTYPES_H 1
| #define HAVE_STDINT_H 1
| #define HAVE_UNISTD_H 1
| #define HAVE_DLFCN_H 1
| #define STDC_HEADERS 1
| #define HAVE_CSTDLIB 1
| #define HAVE_CSTDIO 1
| #define HAVE_CSTRING 1
| #define HAVE_GL_GLX_H 1
| #define HAVE_SDL_SDL_H 1
| #define HAVE_X11_XLIB_H 1
| #define HAVE_LINUX_INPUT_H 1
| #define HAVE_STDINT_H 1
| #define HAVE_SYS_PARAM_H 1
| #define HAVE_UNISTD_H 1
| #define HAVE_VALUES_H 1
| #define HAVE_SOCKLEN_T 1
| #define HAVE_FF_EFFECT_RUMBLE 1
| #define HAVE_FF_EFFECT_DIRECTIONAL 1
| #define HAVE_LIBM 1
| #define HAVE_ACOSF 1
| #define HAVE_ASINF 1
| #define HAVE_ATAN2F 1
| #define HAVE_ATANF 1
| #define HAVE_COSF 1
| #define HAVE_EXPF 1
| #define HAVE_FABSF 1
| #define HAVE_FLOORF 1
| #define HAVE_FMODF 1
| #define HAVE_HYPOTF 1
| #define HAVE_LOGF 1
| #define HAVE_LOG10F 1
| #define HAVE_POWF 1
| #define HAVE_SINF 1
| #define HAVE_SQRTF 1
| #define HAVE_TANF 1
| #define HAVE_REGEX_H 1
| /* end confdefs.h. */
| #include <GL/glu.h>
| int
| main ()
| {
| gluScaleImage(GL_RED,0,0,GL_INT,0,0,0,GL_INT,0)
| ;
| return 0;
| }
configure:24622: checking for ares_init in -lcares
configure:24652: g++ -o conftest -g -O2 -I/usr/share/doc/NVIDIA_GLX-1.0/include -I/usr/X11R6/include -lpthread -L/usr/X11R6/lib conftest.cc -lcares -lm -L/usr/local/lib -lcurl -lcares -ldl >&5
configure:24658: $? = 0
configure:24662: test -z
|| test ! -s conftest.err
configure:24665: $? = 0
configure:24668: test -s conftest
configure:24671: $? = 0
configure:24684: result: yes
configure:24728: checking for working ncurses
configure:24753: g++ -o conftest -g -O2 -I/usr/share/doc/NVIDIA_GLX-1.0/include -I/usr/X11R6/include -lpthread -L/usr/X11R6/lib conftest.cc -lm -L/usr/local/lib -lcurl -lcares -ldl -lncurses >&5
conftest.cc:63:21: ncurses.h: No such file or directory
conftest.cc: In function `int main()':
conftest.cc:68: error: `chtype' undeclared (first use this function)
conftest.cc:68: error: (Each undeclared identifier is reported only once for
each function it appears in.)
conftest.cc:68: error: syntax error before `;' token
conftest.cc:68: error: `A_STANDOUT' undeclared (first use this function)
conftest.cc:68: error: `KEY_LEFT' undeclared (first use this function)
conftest.cc:68: error: `initscr' undeclared (first use this function)
configure:24759: $? = 1
configure: failed program was:
|
| /* confdefs.h. */
|
| #define PACKAGE_NAME ""
| #define PACKAGE_TARNAME ""
| #define PACKAGE_VERSION ""
| #define PACKAGE_STRING ""
| #define PACKAGE_BUGREPORT ""
| #define PACKAGE "bzflag"
| #define VERSION "2.0.4.20051024"
| #define BZ_BUILD_OS "linux-gnu"
| #define BZ_BUILD_USER "patrick"
| #define BUILD_REGEX 1
| #ifdef __cplusplus
| extern "C" void std::exit (int) throw (); using std::exit;
| #endif
| #define STDC_HEADERS 1
| #define HAVE_SYS_TYPES_H 1
| #define HAVE_SYS_STAT_H 1
| #define HAVE_STDLIB_H 1
| #define HAVE_STRING_H 1
| #define HAVE_MEMORY_H 1
| #define HAVE_STRINGS_H 1
| #define HAVE_INTTYPES_H 1
| #define HAVE_STDINT_H 1
| #define HAVE_UNISTD_H 1
| #define HAVE_DLFCN_H 1
| #define STDC_HEADERS 1
| #define HAVE_CSTDLIB 1
| #define HAVE_CSTDIO 1
| #define HAVE_CSTRING 1
| #define HAVE_GL_GLX_H 1
| #define HAVE_SDL_SDL_H 1
| #define HAVE_X11_XLIB_H 1
| #define HAVE_LINUX_INPUT_H 1
| #define HAVE_STDINT_H 1
| #define HAVE_SYS_PARAM_H 1
| #define HAVE_UNISTD_H 1
| #define HAVE_VALUES_H 1
| #define HAVE_SOCKLEN_T 1
| #define HAVE_FF_EFFECT_RUMBLE 1
| #define HAVE_FF_EFFECT_DIRECTIONAL 1
| #define HAVE_LIBM 1
| #define HAVE_ACOSF 1
| #define HAVE_ASINF 1
| #define HAVE_ATAN2F 1
| #define HAVE_ATANF 1
| #define HAVE_COSF 1
| #define HAVE_EXPF 1
| #define HAVE_FABSF 1
| #define HAVE_FLOORF 1
| #define HAVE_FMODF 1
| #define HAVE_HYPOTF 1
| #define HAVE_LOGF 1
| #define HAVE_LOG10F 1
| #define HAVE_POWF 1
| #define HAVE_SINF 1
| #define HAVE_SQRTF 1
| #define HAVE_TANF 1
| #define HAVE_REGEX_H 1
| #define _USE_BZ_API 1
| /* end confdefs.h. */
| #include <ncurses.h>
|
| int
| main ()
| {
| chtype a; int b=A_STANDOUT, c=KEY_LEFT; initscr();
|
| ;
| return 0;
| }
configure:24784: result: no
configure:24798: checking for working curses
configure:24823: g++ -o conftest -g -O2 -I/usr/share/doc/NVIDIA_GLX-1.0/include -I/usr/X11R6/include -lpthread -L/usr/X11R6/lib conftest.cc -lm -L/usr/local/lib -lcurl -lcares -ldl -lcurses >&5
conftest.cc:63:20: curses.h: No such file or directory
conftest.cc: In function `int main()':
conftest.cc:68: error: `chtype' undeclared (first use this function)
conftest.cc:68: error: (Each undeclared identifier is reported only once for
each function it appears in.)
conftest.cc:68: error: syntax error before `;' token
conftest.cc:68: error: `A_STANDOUT' undeclared (first use this function)
conftest.cc:68: error: `KEY_LEFT' undeclared (first use this function)
conftest.cc:68: error: `initscr' undeclared (first use this function)
configure:24829: $? = 1
configure: failed program was:
|
| /* confdefs.h. */
|
| #define PACKAGE_NAME ""
| #define PACKAGE_TARNAME ""
| #define PACKAGE_VERSION ""
| #define PACKAGE_STRING ""
| #define PACKAGE_BUGREPORT ""
| #define PACKAGE "bzflag"
| #define VERSION "2.0.4.20051024"
| #define BZ_BUILD_OS "linux-gnu"
| #define BZ_BUILD_USER "patrick"
| #define BUILD_REGEX 1
| #ifdef __cplusplus
| extern "C" void std::exit (int) throw (); using std::exit;
| #endif
| #define STDC_HEADERS 1
| #define HAVE_SYS_TYPES_H 1
| #define HAVE_SYS_STAT_H 1
| #define HAVE_STDLIB_H 1
| #define HAVE_STRING_H 1
| #define HAVE_MEMORY_H 1
| #define HAVE_STRINGS_H 1
| #define HAVE_INTTYPES_H 1
| #define HAVE_STDINT_H 1
| #define HAVE_UNISTD_H 1
| #define HAVE_DLFCN_H 1
| #define STDC_HEADERS 1
| #define HAVE_CSTDLIB 1
| #define HAVE_CSTDIO 1
| #define HAVE_CSTRING 1
| #define HAVE_GL_GLX_H 1
| #define HAVE_SDL_SDL_H 1
| #define HAVE_X11_XLIB_H 1
| #define HAVE_LINUX_INPUT_H 1
| #define HAVE_STDINT_H 1
| #define HAVE_SYS_PARAM_H 1
| #define HAVE_UNISTD_H 1
| #define HAVE_VALUES_H 1
| #define HAVE_SOCKLEN_T 1
| #define HAVE_FF_EFFECT_RUMBLE 1
| #define HAVE_FF_EFFECT_DIRECTIONAL 1
| #define HAVE_LIBM 1
| #define HAVE_ACOSF 1
| #define HAVE_ASINF 1
| #define HAVE_ATAN2F 1
| #define HAVE_ATANF 1
| #define HAVE_COSF 1
| #define HAVE_EXPF 1
| #define HAVE_FABSF 1
| #define HAVE_FLOORF 1
| #define HAVE_FMODF 1
| #define HAVE_HYPOTF 1
| #define HAVE_LOGF 1
| #define HAVE_LOG10F 1
| #define HAVE_POWF 1
| #define HAVE_SINF 1
| #define HAVE_SQRTF 1
| #define HAVE_TANF 1
| #define HAVE_REGEX_H 1
| #define _USE_BZ_API 1
| /* end confdefs.h. */
| #include <curses.h>
|
| int
| main ()
| {
| chtype a; int b=A_STANDOUT, c=KEY_LEFT; initscr();
|
| ;
| return 0;
| }
configure:24854: result: no
configure:24868: checking for working PDcurses
configure:24893: g++ -o conftest -g -O2 -I/usr/share/doc/NVIDIA_GLX-1.0/include -I/usr/X11R6/include -lpthread -L/usr/X11R6/lib conftest.cc -lm -L/usr/local/lib -lcurl -lcares -ldl -lpdcurses >&5
conftest.cc:63:20: curses.h: No such file or directory
conftest.cc: In function `int main()':
conftest.cc:68: error: `chtype' undeclared (first use this function)
conftest.cc:68: error: (Each undeclared identifier is reported only once for
each function it appears in.)
conftest.cc:68: error: syntax error before `;' token
conftest.cc:68: error: `A_STANDOUT' undeclared (first use this function)
conftest.cc:68: error: `KEY_LEFT' undeclared (first use this function)
conftest.cc:68: error: `initscr' undeclared (first use this function)
configure:24899: $? = 1
configure: failed program was:
|
| /* confdefs.h. */
|
| #define PACKAGE_NAME ""
| #define PACKAGE_TARNAME ""
| #define PACKAGE_VERSION ""
| #define PACKAGE_STRING ""
| #define PACKAGE_BUGREPORT ""
| #define PACKAGE "bzflag"
| #define VERSION "2.0.4.20051024"
| #define BZ_BUILD_OS "linux-gnu"
| #define BZ_BUILD_USER "patrick"
| #define BUILD_REGEX 1
| #ifdef __cplusplus
| extern "C" void std::exit (int) throw (); using std::exit;
| #endif
| #define STDC_HEADERS 1
| #define HAVE_SYS_TYPES_H 1
| #define HAVE_SYS_STAT_H 1
| #define HAVE_STDLIB_H 1
| #define HAVE_STRING_H 1
| #define HAVE_MEMORY_H 1
| #define HAVE_STRINGS_H 1
| #define HAVE_INTTYPES_H 1
| #define HAVE_STDINT_H 1
| #define HAVE_UNISTD_H 1
| #define HAVE_DLFCN_H 1
| #define STDC_HEADERS 1
| #define HAVE_CSTDLIB 1
| #define HAVE_CSTDIO 1
| #define HAVE_CSTRING 1
| #define HAVE_GL_GLX_H 1
| #define HAVE_SDL_SDL_H 1
| #define HAVE_X11_XLIB_H 1
| #define HAVE_LINUX_INPUT_H 1
| #define HAVE_STDINT_H 1
| #define HAVE_SYS_PARAM_H 1
| #define HAVE_UNISTD_H 1
| #define HAVE_VALUES_H 1
| #define HAVE_SOCKLEN_T 1
| #define HAVE_FF_EFFECT_RUMBLE 1
| #define HAVE_FF_EFFECT_DIRECTIONAL 1
| #define HAVE_LIBM 1
| #define HAVE_ACOSF 1
| #define HAVE_ASINF 1
| #define HAVE_ATAN2F 1
| #define HAVE_ATANF 1
| #define HAVE_COSF 1
| #define HAVE_EXPF 1
| #define HAVE_FABSF 1
| #define HAVE_FLOORF 1
| #define HAVE_FMODF 1
| #define HAVE_HYPOTF 1
| #define HAVE_LOGF 1
| #define HAVE_LOG10F 1
| #define HAVE_POWF 1
| #define HAVE_SINF 1
| #define HAVE_SQRTF 1
| #define HAVE_TANF 1
| #define HAVE_REGEX_H 1
| #define _USE_BZ_API 1
| /* end confdefs.h. */
| #include <curses.h>
|
| int
| main ()
| {
| chtype a; int b=A_STANDOUT, c=KEY_LEFT; initscr();
|
| ;
| return 0;
| }
configure:24924: result: no
configure:24939: checking for working XCurses
configure:24964: g++ -o conftest -g -O2 -I/usr/share/doc/NVIDIA_GLX-1.0/include -I/usr/X11R6/include -lpthread -L/usr/X11R6/lib conftest.cc -lm -L/usr/local/lib -lcurl -lcares -ldl -lXCurses -L/usr/X11R6/lib -lXaw -lXmu -lXt -lX11 -lSM -lICE -lXext >&5
conftest.cc:63:21: xcurses.h: No such file or directory
conftest.cc: In function `int main()':
conftest.cc:68: error: `chtype' undeclared (first use this function)
conftest.cc:68: error: (Each undeclared identifier is reported only once for
each function it appears in.)
conftest.cc:68: error: syntax error before `;' token
conftest.cc:68: error: `A_STANDOUT' undeclared (first use this function)
conftest.cc:68: error: `KEY_LEFT' undeclared (first use this function)
conftest.cc:68: error: `initscr' undeclared (first use this function)
configure:24970: $? = 1
configure: failed program was:
|
| /* confdefs.h. */
|
| #define PACKAGE_NAME ""
| #define PACKAGE_TARNAME ""
| #define PACKAGE_VERSION ""
| #define PACKAGE_STRING ""
| #define PACKAGE_BUGREPORT ""
| #define PACKAGE "bzflag"
| #define VERSION "2.0.4.20051024"
| #define BZ_BUILD_OS "linux-gnu"
| #define BZ_BUILD_USER "patrick"
| #define BUILD_REGEX 1
| #ifdef __cplusplus
| extern "C" void std::exit (int) throw (); using std::exit;
| #endif
| #define STDC_HEADERS 1
| #define HAVE_SYS_TYPES_H 1
| #define HAVE_SYS_STAT_H 1
| #define HAVE_STDLIB_H 1
| #define HAVE_STRING_H 1
| #define HAVE_MEMORY_H 1
| #define HAVE_STRINGS_H 1
| #define HAVE_INTTYPES_H 1
| #define HAVE_STDINT_H 1
| #define HAVE_UNISTD_H 1
| #define HAVE_DLFCN_H 1
| #define STDC_HEADERS 1
| #define HAVE_CSTDLIB 1
| #define HAVE_CSTDIO 1
| #define HAVE_CSTRING 1
| #define HAVE_GL_GLX_H 1
| #define HAVE_SDL_SDL_H 1
| #define HAVE_X11_XLIB_H 1
| #define HAVE_LINUX_INPUT_H 1
| #define HAVE_STDINT_H 1
| #define HAVE_SYS_PARAM_H 1
| #define HAVE_UNISTD_H 1
| #define HAVE_VALUES_H 1
| #define HAVE_SOCKLEN_T 1
| #define HAVE_FF_EFFECT_RUMBLE 1
| #define HAVE_FF_EFFECT_DIRECTIONAL 1
| #define HAVE_LIBM 1
| #define HAVE_ACOSF 1
| #define HAVE_ASINF 1
| #define HAVE_ATAN2F 1
| #define HAVE_ATANF 1
| #define HAVE_COSF 1
| #define HAVE_EXPF 1
| #define HAVE_FABSF 1
| #define HAVE_FLOORF 1
| #define HAVE_FMODF 1
| #define HAVE_HYPOTF 1
| #define HAVE_LOGF 1
| #define HAVE_LOG10F 1
| #define HAVE_POWF 1
| #define HAVE_SINF 1
| #define HAVE_SQRTF 1
| #define HAVE_TANF 1
| #define HAVE_REGEX_H 1
| #define _USE_BZ_API 1
| /* end confdefs.h. */
| #include <xcurses.h>
|
| int
| main ()
| {
| chtype a; int b=A_STANDOUT, c=KEY_LEFT; initscr();
|
| ;
| return 0;
| }
configure:24995: result: no
configure:25017: WARNING: could not find a curses library, will build bzadmin without curses
configure:25078: checking for SDL framework
configure:25099: gcc -o conftest -g -O2 -I/usr/share/doc/NVIDIA_GLX-1.0/include -I/usr/X11R6/include -lpthread -L/usr/X11R6/lib -framework SDL conftest.c -lGL -lXi -lXxf86vm -lXext -lSM -lICE -lX11 -lm -L/usr/local/lib -lcurl -lcares -ldl >&5
gcc: SDL: No such file or directory
cc1: error: unrecognized option `-framework'
configure:25105: $? = 1
configure: failed program was:
| /* confdefs.h. */
|
| #define PACKAGE_NAME ""
| #define PACKAGE_TARNAME ""
| #define PACKAGE_VERSION ""
| #define PACKAGE_STRING ""
| #define PACKAGE_BUGREPORT ""
| #define PACKAGE "bzflag"
| #define VERSION "2.0.4.20051024"
| #define BZ_BUILD_OS "linux-gnu"
| #define BZ_BUILD_USER "patrick"
| #define BUILD_REGEX 1
| #ifdef __cplusplus
| extern "C" void std::exit (int) throw (); using std::exit;
| #endif
| #define STDC_HEADERS 1
| #define HAVE_SYS_TYPES_H 1
| #define HAVE_SYS_STAT_H 1
| #define HAVE_STDLIB_H 1
| #define HAVE_STRING_H 1
| #define HAVE_MEMORY_H 1
| #define HAVE_STRINGS_H 1
| #define HAVE_INTTYPES_H 1
| #define HAVE_STDINT_H 1
| #define HAVE_UNISTD_H 1
| #define HAVE_DLFCN_H 1
| #define STDC_HEADERS 1
| #define HAVE_CSTDLIB 1
| #define HAVE_CSTDIO 1
| #define HAVE_CSTRING 1
| #define HAVE_GL_GLX_H 1
| #define HAVE_SDL_SDL_H 1
| #define HAVE_X11_XLIB_H 1
| #define HAVE_LINUX_INPUT_H 1
| #define HAVE_STDINT_H 1
| #define HAVE_SYS_PARAM_H 1
| #define HAVE_UNISTD_H 1
| #define HAVE_VALUES_H 1
| #define HAVE_SOCKLEN_T 1
| #define HAVE_FF_EFFECT_RUMBLE 1
| #define HAVE_FF_EFFECT_DIRECTIONAL 1
| #define HAVE_LIBM 1
| #define HAVE_ACOSF 1
| #define HAVE_ASINF 1
| #define HAVE_ATAN2F 1
| #define HAVE_ATANF 1
| #define HAVE_COSF 1
| #define HAVE_EXPF 1
| #define HAVE_FABSF 1
| #define HAVE_FLOORF 1
| #define HAVE_FMODF 1
| #define HAVE_HYPOTF 1
| #define HAVE_LOGF 1
| #define HAVE_LOG10F 1
| #define HAVE_POWF 1
| #define HAVE_SINF 1
| #define HAVE_SQRTF 1
| #define HAVE_TANF 1
| #define HAVE_REGEX_H 1
| #define _USE_BZ_API 1
| /* end confdefs.h. */
| #include <SDL/SDL_version.h>
| int
| main ()
| {
|
| ;
| return 0;
| }
configure:25129: result: no
configure:25178: checking for sdl-config
configure:25196: found /usr/bin/sdl-config
configure:25209: result: /usr/bin/sdl-config
configure:25217: checking for SDL - version >= 1.2.5
configure:25309: gcc -o conftest -g -O2 -I/usr/include/SDL -D_REENTRANT -I/usr/share/doc/NVIDIA_GLX-1.0/include -I/usr/X11R6/include -lpthread -L/usr/X11R6/lib conftest.c -lGL -lXi -lXxf86vm -lXext -lSM -lICE -lX11 -lm -L/usr/local/lib -lcurl -lcares -ldl -L/usr/lib -Wl,-rpath,/usr/lib -lSDL -lpthread >&5
configure:25312: $? = 0
configure:25314: ./conftest
configure:25317: $? = 0
configure:25336: result: yes
configure:25502: WARNING: Client build has been requested, but GL is not fully available (missing gl.h)
... disabling client generation
configure:25731: checking if the compiler understands -Wl,-search_paths_first -mdynamic-no-pic
configure:25752: g++ -o conftest -g -O2 -DBZ_BUILD_DATE=20051024 -O0 -Wno-deprecated -fsigned-char -I/usr/share/doc/NVIDIA_GLX-1.0/include -I/usr/X11R6/include -Wall -W -Wshadow -mcpu=i686 -Werror -lpthread -L/usr/X11R6/lib -Wl,-search_paths_first -mdynamic-no-pic conftest.cc -lm -L/usr/local/lib -lcurl -lcares -ldl >&5
cc1plus: error: invalid option `dynamic-no-pic'
configure:25758: $? = 1
configure: failed program was:
| /* confdefs.h. */
|
| #define PACKAGE_NAME ""
| #define PACKAGE_TARNAME ""
| #define PACKAGE_VERSION ""
| #define PACKAGE_STRING ""
| #define PACKAGE_BUGREPORT ""
| #define PACKAGE "bzflag"
| #define VERSION "2.0.4.20051024"
| #define BZ_BUILD_OS "linux-gnu"
| #define BZ_BUILD_USER "patrick"
| #define BUILD_REGEX 1
| #ifdef __cplusplus
| extern "C" void std::exit (int) throw (); using std::exit;
| #endif
| #define STDC_HEADERS 1
| #define HAVE_SYS_TYPES_H 1
| #define HAVE_SYS_STAT_H 1
| #define HAVE_STDLIB_H 1
| #define HAVE_STRING_H 1
| #define HAVE_MEMORY_H 1
| #define HAVE_STRINGS_H 1
| #define HAVE_INTTYPES_H 1
| #define HAVE_STDINT_H 1
| #define HAVE_UNISTD_H 1
| #define HAVE_DLFCN_H 1
| #define STDC_HEADERS 1
| #define HAVE_CSTDLIB 1
| #define HAVE_CSTDIO 1
| #define HAVE_CSTRING 1
| #define HAVE_GL_GLX_H 1
| #define HAVE_SDL_SDL_H 1
| #define HAVE_X11_XLIB_H 1
| #define HAVE_LINUX_INPUT_H 1
| #define HAVE_STDINT_H 1
| #define HAVE_SYS_PARAM_H 1
| #define HAVE_UNISTD_H 1
| #define HAVE_VALUES_H 1
| #define HAVE_SOCKLEN_T 1
| #define HAVE_FF_EFFECT_RUMBLE 1
| #define HAVE_FF_EFFECT_DIRECTIONAL 1
| #define HAVE_LIBM 1
| #define HAVE_ACOSF 1
| #define HAVE_ASINF 1
| #define HAVE_ATAN2F 1
| #define HAVE_ATANF 1
| #define HAVE_COSF 1
| #define HAVE_EXPF 1
| #define HAVE_FABSF 1
| #define HAVE_FLOORF 1
| #define HAVE_FMODF 1
| #define HAVE_HYPOTF 1
| #define HAVE_LOGF 1
| #define HAVE_LOG10F 1
| #define HAVE_POWF 1
| #define HAVE_SINF 1
| #define HAVE_SQRTF 1
| #define HAVE_TANF 1
| #define HAVE_REGEX_H 1
| #define _USE_BZ_API 1
| #define HAVE_SDL 1
| #define DEBUG_RENDERING 1
| #define ROBOT 1
| #define SNAPPING 1
| #define INSTALL_DATA_DIR "/usr/local/share/bzflag"
| #define HALF_RATE_AUDIO 1
| #define XF86VIDMODE_EXT 1
| #define DEBUG 1
| /* end confdefs.h. */
|
| int
| main ()
| {
|
| ;
| return 0;
| }
configure:25782: result: no
configure:25822: checking for CGLGetCurrentContext
configure:25879: g++ -o conftest -g -O2 -DBZ_BUILD_DATE=20051024 -O0 -Wno-deprecated -fsigned-char -I/usr/share/doc/NVIDIA_GLX-1.0/include -I/usr/X11R6/include -Wall -W -Wshadow -mcpu=i686 -Werror -lpthread -L/usr/X11R6/lib conftest.cc -lm -L/usr/local/lib -lcurl -lcares -ldl >&5
/tmp/cc4eoe8B.o(.text+0x22): In function `main':
/home/patrick/src/bzflag-2.0.4.20050930/conftest.cc:110: undefined reference to `CGLGetCurrentContext'
/tmp/cc4eoe8B.o(.data+0x0):/home/patrick/src/bzflag-2.0.4.20050930/conftest.cc:109: undefined reference to `CGLGetCurrentContext'
collect2: ld returned 1 exit status
configure:25885: $? = 1
configure: failed program was:
| /* confdefs.h. */
|
| #define PACKAGE_NAME ""
| #define PACKAGE_TARNAME ""
| #define PACKAGE_VERSION ""
| #define PACKAGE_STRING ""
| #define PACKAGE_BUGREPORT ""
| #define PACKAGE "bzflag"
| #define VERSION "2.0.4.20051024"
| #define BZ_BUILD_OS "linux-gnu"
| #define BZ_BUILD_USER "patrick"
| #define BUILD_REGEX 1
| #ifdef __cplusplus
| extern "C" void std::exit (int) throw (); using std::exit;
| #endif
| #define STDC_HEADERS 1
| #define HAVE_SYS_TYPES_H 1
| #define HAVE_SYS_STAT_H 1
| #define HAVE_STDLIB_H 1
| #define HAVE_STRING_H 1
| #define HAVE_MEMORY_H 1
| #define HAVE_STRINGS_H 1
| #define HAVE_INTTYPES_H 1
| #define HAVE_STDINT_H 1
| #define HAVE_UNISTD_H 1
| #define HAVE_DLFCN_H 1
| #define STDC_HEADERS 1
| #define HAVE_CSTDLIB 1
| #define HAVE_CSTDIO 1
| #define HAVE_CSTRING 1
| #define HAVE_GL_GLX_H 1
| #define HAVE_SDL_SDL_H 1
| #define HAVE_X11_XLIB_H 1
| #define HAVE_LINUX_INPUT_H 1
| #define HAVE_STDINT_H 1
| #define HAVE_SYS_PARAM_H 1
| #define HAVE_UNISTD_H 1
| #define HAVE_VALUES_H 1
| #define HAVE_SOCKLEN_T 1
| #define HAVE_FF_EFFECT_RUMBLE 1
| #define HAVE_FF_EFFECT_DIRECTIONAL 1
| #define HAVE_LIBM 1
| #define HAVE_ACOSF 1
| #define HAVE_ASINF 1
| #define HAVE_ATAN2F 1
| #define HAVE_ATANF 1
| #define HAVE_COSF 1
| #define HAVE_EXPF 1
| #define HAVE_FABSF 1
| #define HAVE_FLOORF 1
| #define HAVE_FMODF 1
| #define HAVE_HYPOTF 1
| #define HAVE_LOGF 1
| #define HAVE_LOG10F 1
| #define HAVE_POWF 1
| #define HAVE_SINF 1
| #define HAVE_SQRTF 1
| #define HAVE_TANF 1
| #define HAVE_REGEX_H 1
| #define _USE_BZ_API 1
| #define HAVE_SDL 1
| #define DEBUG_RENDERING 1
| #define ROBOT 1
| #define SNAPPING 1
| #define INSTALL_DATA_DIR "/usr/local/share/bzflag"
| #define HALF_RATE_AUDIO 1
| #define XF86VIDMODE_EXT 1
| #define DEBUG 1
| /* end confdefs.h. */
| /* Define CGLGetCurrentContext to an innocuous variant, in case <limits.h> declares CGLGetCurrentContext.
| For example, HP-UX 11i <limits.h> declares gettimeofday. */
| #define CGLGetCurrentContext innocuous_CGLGetCurrentContext
|
| /* System header to define __stub macros and hopefully few prototypes,
| which can conflict with char CGLGetCurrentContext (); below.
| Prefer <limits.h> to <assert.h> if __STDC__ is defined, since
| <limits.h> exists even on freestanding compilers. */
|
| #ifdef __STDC__
| # include <limits.h>
| #else
| # include <assert.h>
| #endif
|
| #undef CGLGetCurrentContext
|
| /* Override any gcc2 internal prototype to avoid an error. */
| #ifdef __cplusplus
| extern "C"
| {
| #endif
| /* We use char because int might match the return type of a gcc2
| builtin and then its argument prototype would still apply. */
| char CGLGetCurrentContext ();
| /* The GNU C library defines this for functions which it implements
| to always fail with ENOSYS. Some functions are actually named
| something starting with __ and the normal name is an alias. */
| #if defined (__stub_CGLGetCurrentContext) || defined (__stub___CGLGetCurrentContext)
| choke me
| #else
| char (*f) () = CGLGetCurrentContext;
| #endif
| #ifdef __cplusplus
| }
| #endif
|
| int
| main ()
| {
| return f != CGLGetCurrentContext;
| ;
| return 0;
| }
configure:25910: result: no
configure:25822: checking for Sleep
configure:25879: g++ -o conftest -g -O2 -DBZ_BUILD_DATE=20051024 -O0 -Wno-deprecated -fsigned-char -I/usr/share/doc/NVIDIA_GLX-1.0/include -I/usr/X11R6/include -Wall -W -Wshadow -mcpu=i686 -Werror -lpthread -L/usr/X11R6/lib conftest.cc -lm -L/usr/local/lib -lcurl -lcares -ldl >&5
/tmp/cckHq2Ya.o(.text+0x22): In function `main':
/home/patrick/src/bzflag-2.0.4.20050930/conftest.cc:110: undefined reference to `Sleep'
/tmp/cckHq2Ya.o(.data+0x0):/home/patrick/src/bzflag-2.0.4.20050930/conftest.cc:109: undefined reference to `Sleep'
collect2: ld returned 1 exit status
configure:25885: $? = 1
configure: failed program was:
| /* confdefs.h. */
|
| #define PACKAGE_NAME ""
| #define PACKAGE_TARNAME ""
| #define PACKAGE_VERSION ""
| #define PACKAGE_STRING ""
| #define PACKAGE_BUGREPORT ""
| #define PACKAGE "bzflag"
| #define VERSION "2.0.4.20051024"
| #define BZ_BUILD_OS "linux-gnu"
| #define BZ_BUILD_USER "patrick"
| #define BUILD_REGEX 1
| #ifdef __cplusplus
| extern "C" void std::exit (int) throw (); using std::exit;
| #endif
| #define STDC_HEADERS 1
| #define HAVE_SYS_TYPES_H 1
| #define HAVE_SYS_STAT_H 1
| #define HAVE_STDLIB_H 1
| #define HAVE_STRING_H 1
| #define HAVE_MEMORY_H 1
| #define HAVE_STRINGS_H 1
| #define HAVE_INTTYPES_H 1
| #define HAVE_STDINT_H 1
| #define HAVE_UNISTD_H 1
| #define HAVE_DLFCN_H 1
| #define STDC_HEADERS 1
| #define HAVE_CSTDLIB 1
| #define HAVE_CSTDIO 1
| #define HAVE_CSTRING 1
| #define HAVE_GL_GLX_H 1
| #define HAVE_SDL_SDL_H 1
| #define HAVE_X11_XLIB_H 1
| #define HAVE_LINUX_INPUT_H 1
| #define HAVE_STDINT_H 1
| #define HAVE_SYS_PARAM_H 1
| #define HAVE_UNISTD_H 1
| #define HAVE_VALUES_H 1
| #define HAVE_SOCKLEN_T 1
| #define HAVE_FF_EFFECT_RUMBLE 1
| #define HAVE_FF_EFFECT_DIRECTIONAL 1
| #define HAVE_LIBM 1
| #define HAVE_ACOSF 1
| #define HAVE_ASINF 1
| #define HAVE_ATAN2F 1
| #define HAVE_ATANF 1
| #define HAVE_COSF 1
| #define HAVE_EXPF 1
| #define HAVE_FABSF 1
| #define HAVE_FLOORF 1
| #define HAVE_FMODF 1
| #define HAVE_HYPOTF 1
| #define HAVE_LOGF 1
| #define HAVE_LOG10F 1
| #define HAVE_POWF 1
| #define HAVE_SINF 1
| #define HAVE_SQRTF 1
| #define HAVE_TANF 1
| #define HAVE_REGEX_H 1
| #define _USE_BZ_API 1
| #define HAVE_SDL 1
| #define DEBUG_RENDERING 1
| #define ROBOT 1
| #define SNAPPING 1
| #define INSTALL_DATA_DIR "/usr/local/share/bzflag"
| #define HALF_RATE_AUDIO 1
| #define XF86VIDMODE_EXT 1
| #define DEBUG 1
| /* end confdefs.h. */
| /* Define Sleep to an innocuous variant, in case <limits.h> declares Sleep.
| For example, HP-UX 11i <limits.h> declares gettimeofday. */
| #define Sleep innocuous_Sleep
|
| /* System header to define __stub macros and hopefully few prototypes,
| which can conflict with char Sleep (); below.
| Prefer <limits.h> to <assert.h> if __STDC__ is defined, since
| <limits.h> exists even on freestanding compilers. */
|
| #ifdef __STDC__
| # include <limits.h>
| #else
| # include <assert.h>
| #endif
|
| #undef Sleep
|
| /* Override any gcc2 internal prototype to avoid an error. */
| #ifdef __cplusplus
| extern "C"
| {
| #endif
| /* We use char because int might match the return type of a gcc2
| builtin and then its argument prototype would still apply. */
| char Sleep ();
| /* The GNU C library defines this for functions which it implements
| to always fail with ENOSYS. Some functions are actually named
| something starting with __ and the normal name is an alias. */
| #if defined (__stub_Sleep) || defined (__stub___Sleep)
| choke me
| #else
| char (*f) () = Sleep;
| #endif
| #ifdef __cplusplus
| }
| #endif
|
| int
| main ()
| {
| return f != Sleep;
| ;
| return 0;
| }
configure:25910: result: no
configure:25822: checking for WaitForSingleObject
configure:25879: g++ -o conftest -g -O2 -DBZ_BUILD_DATE=20051024 -O0 -Wno-deprecated -fsigned-char -I/usr/share/doc/NVIDIA_GLX-1.0/include -I/usr/X11R6/include -Wall -W -Wshadow -mcpu=i686 -Werror -lpthread -L/usr/X11R6/lib conftest.cc -lm -L/usr/local/lib -lcurl -lcares -ldl >&5
/tmp/ccIJnhXH.o(.text+0x22): In function `main':
/home/patrick/src/bzflag-2.0.4.20050930/conftest.cc:110: undefined reference to `WaitForSingleObject'
/tmp/ccIJnhXH.o(.data+0x0):/home/patrick/src/bzflag-2.0.4.20050930/conftest.cc:109: undefined reference to `WaitForSingleObject'
collect2: ld returned 1 exit status
configure:25885: $? = 1
configure: failed program was:
| /* confdefs.h. */
|
| #define PACKAGE_NAME ""
| #define PACKAGE_TARNAME ""
| #define PACKAGE_VERSION ""
| #define PACKAGE_STRING ""
| #define PACKAGE_BUGREPORT ""
| #define PACKAGE "bzflag"
| #define VERSION "2.0.4.20051024"
| #define BZ_BUILD_OS "linux-gnu"
| #define BZ_BUILD_USER "patrick"
| #define BUILD_REGEX 1
| #ifdef __cplusplus
| extern "C" void std::exit (int) throw (); using std::exit;
| #endif
| #define STDC_HEADERS 1
| #define HAVE_SYS_TYPES_H 1
| #define HAVE_SYS_STAT_H 1
| #define HAVE_STDLIB_H 1
| #define HAVE_STRING_H 1
| #define HAVE_MEMORY_H 1
| #define HAVE_STRINGS_H 1
| #define HAVE_INTTYPES_H 1
| #define HAVE_STDINT_H 1
| #define HAVE_UNISTD_H 1
| #define HAVE_DLFCN_H 1
| #define STDC_HEADERS 1
| #define HAVE_CSTDLIB 1
| #define HAVE_CSTDIO 1
| #define HAVE_CSTRING 1
| #define HAVE_GL_GLX_H 1
| #define HAVE_SDL_SDL_H 1
| #define HAVE_X11_XLIB_H 1
| #define HAVE_LINUX_INPUT_H 1
| #define HAVE_STDINT_H 1
| #define HAVE_SYS_PARAM_H 1
| #define HAVE_UNISTD_H 1
| #define HAVE_VALUES_H 1
| #define HAVE_SOCKLEN_T 1
| #define HAVE_FF_EFFECT_RUMBLE 1
| #define HAVE_FF_EFFECT_DIRECTIONAL 1
| #define HAVE_LIBM 1
| #define HAVE_ACOSF 1
| #define HAVE_ASINF 1
| #define HAVE_ATAN2F 1
| #define HAVE_ATANF 1
| #define HAVE_COSF 1
| #define HAVE_EXPF 1
| #define HAVE_FABSF 1
| #define HAVE_FLOORF 1
| #define HAVE_FMODF 1
| #define HAVE_HYPOTF 1
| #define HAVE_LOGF 1
| #define HAVE_LOG10F 1
| #define HAVE_POWF 1
| #define HAVE_SINF 1
| #define HAVE_SQRTF 1
| #define HAVE_TANF 1
| #define HAVE_REGEX_H 1
| #define _USE_BZ_API 1
| #define HAVE_SDL 1
| #define DEBUG_RENDERING 1
| #define ROBOT 1
| #define SNAPPING 1
| #define INSTALL_DATA_DIR "/usr/local/share/bzflag"
| #define HALF_RATE_AUDIO 1
| #define XF86VIDMODE_EXT 1
| #define DEBUG 1
| /* end confdefs.h. */
| /* Define WaitForSingleObject to an innocuous variant, in case <limits.h> declares WaitForSingleObject.
| For example, HP-UX 11i <limits.h> declares gettimeofday. */
| #define WaitForSingleObject innocuous_WaitForSingleObject
|
| /* System header to define __stub macros and hopefully few prototypes,
| which can conflict with char WaitForSingleObject (); below.
| Prefer <limits.h> to <assert.h> if __STDC__ is defined, since
| <limits.h> exists even on freestanding compilers. */
|
| #ifdef __STDC__
| # include <limits.h>
| #else
| # include <assert.h>
| #endif
|
| #undef WaitForSingleObject
|
| /* Override any gcc2 internal prototype to avoid an error. */
| #ifdef __cplusplus
| extern "C"
| {
| #endif
| /* We use char because int might match the return type of a gcc2
| builtin and then its argument prototype would still apply. */
| char WaitForSingleObject ();
| /* The GNU C library defines this for functions which it implements
| to always fail with ENOSYS. Some functions are actually named
| something starting with __ and the normal name is an alias. */
| #if defined (__stub_WaitForSingleObject) || defined (__stub___WaitForSingleObject)
| choke me
| #else
| char (*f) () = WaitForSingleObject;
| #endif
| #ifdef __cplusplus
| }
| #endif
|
| int
| main ()
| {
| return f != WaitForSingleObject;
| ;
| return 0;
| }
configure:25910: result: no
configure:25822: checking for _stricmp
configure:25879: g++ -o conftest -g -O2 -DBZ_BUILD_DATE=20051024 -O0 -Wno-deprecated -fsigned-char -I/usr/share/doc/NVIDIA_GLX-1.0/include -I/usr/X11R6/include -Wall -W -Wshadow -mcpu=i686 -Werror -lpthread -L/usr/X11R6/lib conftest.cc -lm -L/usr/local/lib -lcurl -lcares -ldl >&5
/tmp/ccE5ROme.o(.text+0x22): In function `main':
/home/patrick/src/bzflag-2.0.4.20050930/conftest.cc:110: undefined reference to `_stricmp'
/tmp/ccE5ROme.o(.data+0x0):/home/patrick/src/bzflag-2.0.4.20050930/conftest.cc:109: undefined reference to `_stricmp'
collect2: ld returned 1 exit status
configure:25885: $? = 1
configure: failed program was:
| /* confdefs.h. */
|
| #define PACKAGE_NAME ""
| #define PACKAGE_TARNAME ""
| #define PACKAGE_VERSION ""
| #define PACKAGE_STRING ""
| #define PACKAGE_BUGREPORT ""
| #define PACKAGE "bzflag"
| #define VERSION "2.0.4.20051024"
| #define BZ_BUILD_OS "linux-gnu"
| #define BZ_BUILD_USER "patrick"
| #define BUILD_REGEX 1
| #ifdef __cplusplus
| extern "C" void std::exit (int) throw (); using std::exit;
| #endif
| #define STDC_HEADERS 1
| #define HAVE_SYS_TYPES_H 1
| #define HAVE_SYS_STAT_H 1
| #define HAVE_STDLIB_H 1
| #define HAVE_STRING_H 1
| #define HAVE_MEMORY_H 1
| #define HAVE_STRINGS_H 1
| #define HAVE_INTTYPES_H 1
| #define HAVE_STDINT_H 1
| #define HAVE_UNISTD_H 1
| #define HAVE_DLFCN_H 1
| #define STDC_HEADERS 1
| #define HAVE_CSTDLIB 1
| #define HAVE_CSTDIO 1
| #define HAVE_CSTRING 1
| #define HAVE_GL_GLX_H 1
| #define HAVE_SDL_SDL_H 1
| #define HAVE_X11_XLIB_H 1
| #define HAVE_LINUX_INPUT_H 1
| #define HAVE_STDINT_H 1
| #define HAVE_SYS_PARAM_H 1
| #define HAVE_UNISTD_H 1
| #define HAVE_VALUES_H 1
| #define HAVE_SOCKLEN_T 1
| #define HAVE_FF_EFFECT_RUMBLE 1
| #define HAVE_FF_EFFECT_DIRECTIONAL 1
| #define HAVE_LIBM 1
| #define HAVE_ACOSF 1
| #define HAVE_ASINF 1
| #define HAVE_ATAN2F 1
| #define HAVE_ATANF 1
| #define HAVE_COSF 1
| #define HAVE_EXPF 1
| #define HAVE_FABSF 1
| #define HAVE_FLOORF 1
| #define HAVE_FMODF 1
| #define HAVE_HYPOTF 1
| #define HAVE_LOGF 1
| #define HAVE_LOG10F 1
| #define HAVE_POWF 1
| #define HAVE_SINF 1
| #define HAVE_SQRTF 1
| #define HAVE_TANF 1
| #define HAVE_REGEX_H 1
| #define _USE_BZ_API 1
| #define HAVE_SDL 1
| #define DEBUG_RENDERING 1
| #define ROBOT 1
| #define SNAPPING 1
| #define INSTALL_DATA_DIR "/usr/local/share/bzflag"
| #define HALF_RATE_AUDIO 1
| #define XF86VIDMODE_EXT 1
| #define DEBUG 1
| /* end confdefs.h. */
| /* Define _stricmp to an innocuous variant, in case <limits.h> declares _stricmp.
| For example, HP-UX 11i <limits.h> declares gettimeofday. */
| #define _stricmp innocuous__stricmp
|
| /* System header to define __stub macros and hopefully few prototypes,
| which can conflict with char _stricmp (); below.
| Prefer <limits.h> to <assert.h> if __STDC__ is defined, since
| <limits.h> exists even on freestanding compilers. */
|
| #ifdef __STDC__
| # include <limits.h>
| #else
| # include <assert.h>
| #endif
|
| #undef _stricmp
|
| /* Override any gcc2 internal prototype to avoid an error. */
| #ifdef __cplusplus
| extern "C"
| {
| #endif
| /* We use char because int might match the return type of a gcc2
| builtin and then its argument prototype would still apply. */
| char _stricmp ();
| /* The GNU C library defines this for functions which it implements
| to always fail with ENOSYS. Some functions are actually named
| something starting with __ and the normal name is an alias. */
| #if defined (__stub__stricmp) || defined (__stub____stricmp)
| choke me
| #else
| char (*f) () = _stricmp;
| #endif
| #ifdef __cplusplus
| }
| #endif
|
| int
| main ()
| {
| return f != _stricmp;
| ;
| return 0;
| }
configure:25910: result: no
configure:25822: checking for _strnicmp
configure:25879: g++ -o conftest -g -O2 -DBZ_BUILD_DATE=20051024 -O0 -Wno-deprecated -fsigned-char -I/usr/share/doc/NVIDIA_GLX-1.0/include -I/usr/X11R6/include -Wall -W -Wshadow -mcpu=i686 -Werror -lpthread -L/usr/X11R6/lib conftest.cc -lm -L/usr/local/lib -lcurl -lcares -ldl >&5
/tmp/cceJ8lVn.o(.text+0x22): In function `main':
/home/patrick/src/bzflag-2.0.4.20050930/conftest.cc:110: undefined reference to `_strnicmp'
/tmp/cceJ8lVn.o(.data+0x0):/home/patrick/src/bzflag-2.0.4.20050930/conftest.cc:109: undefined reference to `_strnicmp'
collect2: ld returned 1 exit status
configure:25885: $? = 1
configure: failed program was:
| /* confdefs.h. */
|
| #define PACKAGE_NAME ""
| #define PACKAGE_TARNAME ""
| #define PACKAGE_VERSION ""
| #define PACKAGE_STRING ""
| #define PACKAGE_BUGREPORT ""
| #define PACKAGE "bzflag"
| #define VERSION "2.0.4.20051024"
| #define BZ_BUILD_OS "linux-gnu"
| #define BZ_BUILD_USER "patrick"
| #define BUILD_REGEX 1
| #ifdef __cplusplus
| extern "C" void std::exit (int) throw (); using std::exit;
| #endif
| #define STDC_HEADERS 1
| #define HAVE_SYS_TYPES_H 1
| #define HAVE_SYS_STAT_H 1
| #define HAVE_STDLIB_H 1
| #define HAVE_STRING_H 1
| #define HAVE_MEMORY_H 1
| #define HAVE_STRINGS_H 1
| #define HAVE_INTTYPES_H 1
| #define HAVE_STDINT_H 1
| #define HAVE_UNISTD_H 1
| #define HAVE_DLFCN_H 1
| #define STDC_HEADERS 1
| #define HAVE_CSTDLIB 1
| #define HAVE_CSTDIO 1
| #define HAVE_CSTRING 1
| #define HAVE_GL_GLX_H 1
| #define HAVE_SDL_SDL_H 1
| #define HAVE_X11_XLIB_H 1
| #define HAVE_LINUX_INPUT_H 1
| #define HAVE_STDINT_H 1
| #define HAVE_SYS_PARAM_H 1
| #define HAVE_UNISTD_H 1
| #define HAVE_VALUES_H 1
| #define HAVE_SOCKLEN_T 1
| #define HAVE_FF_EFFECT_RUMBLE 1
| #define HAVE_FF_EFFECT_DIRECTIONAL 1
| #define HAVE_LIBM 1
| #define HAVE_ACOSF 1
| #define HAVE_ASINF 1
| #define HAVE_ATAN2F 1
| #define HAVE_ATANF 1
| #define HAVE_COSF 1
| #define HAVE_EXPF 1
| #define HAVE_FABSF 1
| #define HAVE_FLOORF 1
| #define HAVE_FMODF 1
| #define HAVE_HYPOTF 1
| #define HAVE_LOGF 1
| #define HAVE_LOG10F 1
| #define HAVE_POWF 1
| #define HAVE_SINF 1
| #define HAVE_SQRTF 1
| #define HAVE_TANF 1
| #define HAVE_REGEX_H 1
| #define _USE_BZ_API 1
| #define HAVE_SDL 1
| #define DEBUG_RENDERING 1
| #define ROBOT 1
| #define SNAPPING 1
| #define INSTALL_DATA_DIR "/usr/local/share/bzflag"
| #define HALF_RATE_AUDIO 1
| #define XF86VIDMODE_EXT 1
| #define DEBUG 1
| /* end confdefs.h. */
| /* Define _strnicmp to an innocuous variant, in case <limits.h> declares _strnicmp.
| For example, HP-UX 11i <limits.h> declares gettimeofday. */
| #define _strnicmp innocuous__strnicmp
|
| /* System header to define __stub macros and hopefully few prototypes,
| which can conflict with char _strnicmp (); below.
| Prefer <limits.h> to <assert.h> if __STDC__ is defined, since
| <limits.h> exists even on freestanding compilers. */
|
| #ifdef __STDC__
| # include <limits.h>
| #else
| # include <assert.h>
| #endif
|
| #undef _strnicmp
|
| /* Override any gcc2 internal prototype to avoid an error. */
| #ifdef __cplusplus
| extern "C"
| {
| #endif
| /* We use char because int might match the return type of a gcc2
| builtin and then its argument prototype would still apply. */
| char _strnicmp ();
| /* The GNU C library defines this for functions which it implements
| to always fail with ENOSYS. Some functions are actually named
| something starting with __ and the normal name is an alias. */
| #if defined (__stub__strnicmp) || defined (__stub____strnicmp)
| choke me
| #else
| char (*f) () = _strnicmp;
| #endif
| #ifdef __cplusplus
| }
| #endif
|
| int
| main ()
| {
| return f != _strnicmp;
| ;
| return 0;
| }
configure:25910: result: no
configure:25822: checking for _vsnprintf
configure:25879: g++ -o conftest -g -O2 -DBZ_BUILD_DATE=20051024 -O0 -Wno-deprecated -fsigned-char -I/usr/share/doc/NVIDIA_GLX-1.0/include -I/usr/X11R6/include -Wall -W -Wshadow -mcpu=i686 -Werror -lpthread -L/usr/X11R6/lib conftest.cc -lm -L/usr/local/lib -lcurl -lcares -ldl >&5
/tmp/ccI4ZLsU.o(.text+0x22): In function `main':
/home/patrick/src/bzflag-2.0.4.20050930/conftest.cc:110: undefined reference to `_vsnprintf'
/tmp/ccI4ZLsU.o(.data+0x0):/home/patrick/src/bzflag-2.0.4.20050930/conftest.cc:109: undefined reference to `_vsnprintf'
collect2: ld returned 1 exit status
configure:25885: $? = 1
configure: failed program was:
| /* confdefs.h. */
|
| #define PACKAGE_NAME ""
| #define PACKAGE_TARNAME ""
| #define PACKAGE_VERSION ""
| #define PACKAGE_STRING ""
| #define PACKAGE_BUGREPORT ""
| #define PACKAGE "bzflag"
| #define VERSION "2.0.4.20051024"
| #define BZ_BUILD_OS "linux-gnu"
| #define BZ_BUILD_USER "patrick"
| #define BUILD_REGEX 1
| #ifdef __cplusplus
| extern "C" void std::exit (int) throw (); using std::exit;
| #endif
| #define STDC_HEADERS 1
| #define HAVE_SYS_TYPES_H 1
| #define HAVE_SYS_STAT_H 1
| #define HAVE_STDLIB_H 1
| #define HAVE_STRING_H 1
| #define HAVE_MEMORY_H 1
| #define HAVE_STRINGS_H 1
| #define HAVE_INTTYPES_H 1
| #define HAVE_STDINT_H 1
| #define HAVE_UNISTD_H 1
| #define HAVE_DLFCN_H 1
| #define STDC_HEADERS 1
| #define HAVE_CSTDLIB 1
| #define HAVE_CSTDIO 1
| #define HAVE_CSTRING 1
| #define HAVE_GL_GLX_H 1
| #define HAVE_SDL_SDL_H 1
| #define HAVE_X11_XLIB_H 1
| #define HAVE_LINUX_INPUT_H 1
| #define HAVE_STDINT_H 1
| #define HAVE_SYS_PARAM_H 1
| #define HAVE_UNISTD_H 1
| #define HAVE_VALUES_H 1
| #define HAVE_SOCKLEN_T 1
| #define HAVE_FF_EFFECT_RUMBLE 1
| #define HAVE_FF_EFFECT_DIRECTIONAL 1
| #define HAVE_LIBM 1
| #define HAVE_ACOSF 1
| #define HAVE_ASINF 1
| #define HAVE_ATAN2F 1
| #define HAVE_ATANF 1
| #define HAVE_COSF 1
| #define HAVE_EXPF 1
| #define HAVE_FABSF 1
| #define HAVE_FLOORF 1
| #define HAVE_FMODF 1
| #define HAVE_HYPOTF 1
| #define HAVE_LOGF 1
| #define HAVE_LOG10F 1
| #define HAVE_POWF 1
| #define HAVE_SINF 1
| #define HAVE_SQRTF 1
| #define HAVE_TANF 1
| #define HAVE_REGEX_H 1
| #define _USE_BZ_API 1
| #define HAVE_SDL 1
| #define DEBUG_RENDERING 1
| #define ROBOT 1
| #define SNAPPING 1
| #define INSTALL_DATA_DIR "/usr/local/share/bzflag"
| #define HALF_RATE_AUDIO 1
| #define XF86VIDMODE_EXT 1
| #define DEBUG 1
| /* end confdefs.h. */
| /* Define _vsnprintf to an innocuous variant, in case <limits.h> declares _vsnprintf.
| For example, HP-UX 11i <limits.h> declares gettimeofday. */
| #define _vsnprintf innocuous__vsnprintf
|
| /* System header to define __stub macros and hopefully few prototypes,
| which can conflict with char _vsnprintf (); below.
| Prefer <limits.h> to <assert.h> if __STDC__ is defined, since
| <limits.h> exists even on freestanding compilers. */
|
| #ifdef __STDC__
| # include <limits.h>
| #else
| # include <assert.h>
| #endif
|
| #undef _vsnprintf
|
| /* Override any gcc2 internal prototype to avoid an error. */
| #ifdef __cplusplus
| extern "C"
| {
| #endif
| /* We use char because int might match the return type of a gcc2
| builtin and then its argument prototype would still apply. */
| char _vsnprintf ();
| /* The GNU C library defines this for functions which it implements
| to always fail with ENOSYS. Some functions are actually named
| something starting with __ and the normal name is an alias. */
| #if defined (__stub__vsnprintf) || defined (__stub____vsnprintf)
| choke me
| #else
| char (*f) () = _vsnprintf;
| #endif
| #ifdef __cplusplus
| }
| #endif
|
| int
| main ()
| {
| return f != _vsnprintf;
| ;
| return 0;
| }
configure:25910: result: no
configure:25822: checking for atexit
configure:25879: g++ -o conftest -g -O2 -DBZ_BUILD_DATE=20051024 -O0 -Wno-deprecated -fsigned-char -I/usr/share/doc/NVIDIA_GLX-1.0/include -I/usr/X11R6/include -Wall -W -Wshadow -mcpu=i686 -Werror -lpthread -L/usr/X11R6/lib conftest.cc -lm -L/usr/local/lib -lcurl -lcares -ldl >&5
configure:25885: $? = 0
configure:25889: test -z
|| test ! -s conftest.err
configure:25892: $? = 0
configure:25895: test -s conftest
configure:25898: $? = 0
configure:25910: result: yes
configure:25822: checking for getrlimit
configure:25879: g++ -o conftest -g -O2 -DBZ_BUILD_DATE=20051024 -O0 -Wno-deprecated -fsigned-char -I/usr/share/doc/NVIDIA_GLX-1.0/include -I/usr/X11R6/include -Wall -W -Wshadow -mcpu=i686 -Werror -lpthread -L/usr/X11R6/lib conftest.cc -lm -L/usr/local/lib -lcurl -lcares -ldl >&5
configure:25885: $? = 0
configure:25889: test -z
|| test ! -s conftest.err
configure:25892: $? = 0
configure:25895: test -s conftest
configure:25898: $? = 0
configure:25910: result: yes
configure:25822: checking for glXGetCurrentContext
configure:25879: g++ -o conftest -g -O2 -DBZ_BUILD_DATE=20051024 -O0 -Wno-deprecated -fsigned-char -I/usr/share/doc/NVIDIA_GLX-1.0/include -I/usr/X11R6/include -Wall -W -Wshadow -mcpu=i686 -Werror -lpthread -L/usr/X11R6/lib conftest.cc -lm -L/usr/local/lib -lcurl -lcares -ldl >&5
/tmp/cco7DQUh.o(.text+0x22): In function `main':
/home/patrick/src/bzflag-2.0.4.20050930/conftest.cc:112: undefined reference to `glXGetCurrentContext'
/tmp/cco7DQUh.o(.data+0x0):/home/patrick/src/bzflag-2.0.4.20050930/conftest.cc:111: undefined reference to `glXGetCurrentContext'
collect2: ld returned 1 exit status
configure:25885: $? = 1
configure: failed program was:
| /* confdefs.h. */
|
| #define PACKAGE_NAME ""
| #define PACKAGE_TARNAME ""
| #define PACKAGE_VERSION ""
| #define PACKAGE_STRING ""
| #define PACKAGE_BUGREPORT ""
| #define PACKAGE "bzflag"
| #define VERSION "2.0.4.20051024"
| #define BZ_BUILD_OS "linux-gnu"
| #define BZ_BUILD_USER "patrick"
| #define BUILD_REGEX 1
| #ifdef __cplusplus
| extern "C" void std::exit (int) throw (); using std::exit;
| #endif
| #define STDC_HEADERS 1
| #define HAVE_SYS_TYPES_H 1
| #define HAVE_SYS_STAT_H 1
| #define HAVE_STDLIB_H 1
| #define HAVE_STRING_H 1
| #define HAVE_MEMORY_H 1
| #define HAVE_STRINGS_H 1
| #define HAVE_INTTYPES_H 1
| #define HAVE_STDINT_H 1
| #define HAVE_UNISTD_H 1
| #define HAVE_DLFCN_H 1
| #define STDC_HEADERS 1
| #define HAVE_CSTDLIB 1
| #define HAVE_CSTDIO 1
| #define HAVE_CSTRING 1
| #define HAVE_GL_GLX_H 1
| #define HAVE_SDL_SDL_H 1
| #define HAVE_X11_XLIB_H 1
| #define HAVE_LINUX_INPUT_H 1
| #define HAVE_STDINT_H 1
| #define HAVE_SYS_PARAM_H 1
| #define HAVE_UNISTD_H 1
| #define HAVE_VALUES_H 1
| #define HAVE_SOCKLEN_T 1
| #define HAVE_FF_EFFECT_RUMBLE 1
| #define HAVE_FF_EFFECT_DIRECTIONAL 1
| #define HAVE_LIBM 1
| #define HAVE_ACOSF 1
| #define HAVE_ASINF 1
| #define HAVE_ATAN2F 1
| #define HAVE_ATANF 1
| #define HAVE_COSF 1
| #define HAVE_EXPF 1
| #define HAVE_FABSF 1
| #define HAVE_FLOORF 1
| #define HAVE_FMODF 1
| #define HAVE_HYPOTF 1
| #define HAVE_LOGF 1
| #define HAVE_LOG10F 1
| #define HAVE_POWF 1
| #define HAVE_SINF 1
| #define HAVE_SQRTF 1
| #define HAVE_TANF 1
| #define HAVE_REGEX_H 1
| #define _USE_BZ_API 1
| #define HAVE_SDL 1
| #define DEBUG_RENDERING 1
| #define ROBOT 1
| #define SNAPPING 1
| #define INSTALL_DATA_DIR "/usr/local/share/bzflag"
| #define HALF_RATE_AUDIO 1
| #define XF86VIDMODE_EXT 1
| #define DEBUG 1
| #define HAVE_ATEXIT 1
| #define HAVE_GETRLIMIT 1
| /* end confdefs.h. */
| /* Define glXGetCurrentContext to an innocuous variant, in case <limits.h> declares glXGetCurrentContext.
| For example, HP-UX 11i <limits.h> declares gettimeofday. */
| #define glXGetCurrentContext innocuous_glXGetCurrentContext
|