All pastes #26402 Raw Edit

Weems python Blues

public text v1 · immutable
#26402 ·published 2005-10-23 20:18 UTC
rendered paste body
[root@192 Zope-3.1.0]# make
/usr/bin/python install.py -q build
Dependencies/zope.interface-Zope-3.1.0/zope.interface/_zope_interface_coptimizations.c:15:20: error: Python.h: No such file or directory
Dependencies/zope.interface-Zope-3.1.0/zope.interface/_zope_interface_coptimizations.c:16:26: error: structmember.h: No such file or directory
Dependencies/zope.interface-Zope-3.1.0/zope.interface/_zope_interface_coptimizations.c:22: error: syntax error before ‘*’ token
Dependencies/zope.interface-Zope-3.1.0/zope.interface/_zope_interface_coptimizations.c:22: warning: data definition has no type or storage class
Dependencies/zope.interface-Zope-3.1.0/zope.interface/_zope_interface_coptimizations.c:23: error: syntax error before ‘*’ token
Dependencies/zope.interface-Zope-3.1.0/zope.interface/_zope_interface_coptimizations.c:23: warning: data definition has no type or storage class
Dependencies/zope.interface-Zope-3.1.0/zope.interface/_zope_interface_coptimizations.c:24: error: syntax error before ‘*’ token
Dependencies/zope.interface-Zope-3.1.0/zope.interface/_zope_interface_coptimizations.c:24: warning: data definition has no type or storage class
Dependencies/zope.interface-Zope-3.1.0/zope.interface/_zope_interface_coptimizations.c:25: error: syntax error before ‘*’ token
Dependencies/zope.interface-Zope-3.1.0/zope.interface/_zope_interface_coptimizations.c:25: warning: data definition has no type or storage class
Dependencies/zope.interface-Zope-3.1.0/zope.interface/_zope_interface_coptimizations.c:26: error: syntax error before ‘*’ token
Dependencies/zope.interface-Zope-3.1.0/zope.interface/_zope_interface_coptimizations.c:26: warning: data definition has no type or storage class
Dependencies/zope.interface-Zope-3.1.0/zope.interface/_zope_interface_coptimizations.c: In function ‘import_declarations’:
Dependencies/zope.interface-Zope-3.1.0/zope.interface/_zope_interface_coptimizations.c:33: error: ‘PyObject’ undeclared (first use in this function)
Dependencies/zope.interface-Zope-3.1.0/zope.interface/_zope_interface_coptimizations.c:33: error: (Each undeclared identifier is reported only once
Dependencies/zope.interface-Zope-3.1.0/zope.interface/_zope_interface_coptimizations.c:33: error: for each function it appears in.)
Dependencies/zope.interface-Zope-3.1.0/zope.interface/_zope_interface_coptimizations.c:33: error: ‘declarations’ undeclared (first use in this function)
Dependencies/zope.interface-Zope-3.1.0/zope.interface/_zope_interface_coptimizations.c:33: error: ‘i’ undeclared (first use in this function)
Dependencies/zope.interface-Zope-3.1.0/zope.interface/_zope_interface_coptimizations.c:36: error: ‘NULL’ undeclared (first use in this function)
Dependencies/zope.interface-Zope-3.1.0/zope.interface/_zope_interface_coptimizations.c:40: warning: assignment makes pointer from integer without a cast
Dependencies/zope.interface-Zope-3.1.0/zope.interface/_zope_interface_coptimizations.c:44: warning: assignment makes pointer from integer without a cast
Dependencies/zope.interface-Zope-3.1.0/zope.interface/_zope_interface_coptimizations.c:48: warning: assignment makes pointer from integer without a cast
Dependencies/zope.interface-Zope-3.1.0/zope.interface/_zope_interface_coptimizations.c:60: error: ‘PyExc_TypeError’ undeclared (first use in this function)
Dependencies/zope.interface-Zope-3.1.0/zope.interface/_zope_interface_coptimizations.c:65: error: ‘PyTypeObject’ undeclared (first use in this function)
Dependencies/zope.interface-Zope-3.1.0/zope.interface/_zope_interface_coptimizations.c:65: error: syntax error before ‘)’ token
Dependencies/zope.interface-Zope-3.1.0/zope.interface/_zope_interface_coptimizations.c: At top level:
Dependencies/zope.interface-Zope-3.1.0/zope.interface/_zope_interface_coptimizations.c:73: error: syntax error before ‘SpecType’
Dependencies/zope.interface-Zope-3.1.0/zope.interface/_zope_interface_coptimizations.c:73: warning: data definition has no type or storage class
Dependencies/zope.interface-Zope-3.1.0/zope.interface/_zope_interface_coptimizations.c:75: error: syntax error before ‘*’ token
Dependencies/zope.interface-Zope-3.1.0/zope.interface/_zope_interface_coptimizations.c:76: error: syntax error before ‘*’ token
Dependencies/zope.interface-Zope-3.1.0/zope.interface/_zope_interface_coptimizations.c: In function ‘implementedByFallback’:
Dependencies/zope.interface-Zope-3.1.0/zope.interface/_zope_interface_coptimizations.c:79: error: ‘NULL’ undeclared (first use in this function)
Dependencies/zope.interface-Zope-3.1.0/zope.interface/_zope_interface_coptimizations.c:81: error: ‘cls’ undeclared (first use in this function)
Dependencies/zope.interface-Zope-3.1.0/zope.interface/_zope_interface_coptimizations.c:81: warning: return makes pointer from integer without a cast
Dependencies/zope.interface-Zope-3.1.0/zope.interface/_zope_interface_coptimizations.c: At top level:
Dependencies/zope.interface-Zope-3.1.0/zope.interface/_zope_interface_coptimizations.c:84: error: syntax error before ‘*’ token
Dependencies/zope.interface-Zope-3.1.0/zope.interface/_zope_interface_coptimizations.c:85: error: syntax error before ‘*’ token
Dependencies/zope.interface-Zope-3.1.0/zope.interface/_zope_interface_coptimizations.c: In function ‘implementedBy’:
Dependencies/zope.interface-Zope-3.1.0/zope.interface/_zope_interface_coptimizations.c:91: error: ‘PyObject’ undeclared (first use in this function)
Dependencies/zope.interface-Zope-3.1.0/zope.interface/_zope_interface_coptimizations.c:91: error: ‘dict’ undeclared (first use in this function)
Dependencies/zope.interface-Zope-3.1.0/zope.interface/_zope_interface_coptimizations.c:91: error: ‘NULL’ undeclared (first use in this function)
Dependencies/zope.interface-Zope-3.1.0/zope.interface/_zope_interface_coptimizations.c:91: error: ‘spec’ undeclared (first use in this function)
Dependencies/zope.interface-Zope-3.1.0/zope.interface/_zope_interface_coptimizations.c:93: error: ‘cls’ undeclared (first use in this function)
Dependencies/zope.interface-Zope-3.1.0/zope.interface/_zope_interface_coptimizations.c:95: error: ‘PyTypeObject’ undeclared (first use in this function)
Dependencies/zope.interface-Zope-3.1.0/zope.interface/_zope_interface_coptimizations.c:95: error: syntax error before ‘)’ token
Dependencies/zope.interface-Zope-3.1.0/zope.interface/_zope_interface_coptimizations.c: At top level:
Dependencies/zope.interface-Zope-3.1.0/zope.interface/_zope_interface_coptimizations.c:141: error: syntax error before ‘*’ token
Dependencies/zope.interface-Zope-3.1.0/zope.interface/_zope_interface_coptimizations.c:142: error: syntax error before ‘*’ token
Dependencies/zope.interface-Zope-3.1.0/zope.interface/_zope_interface_coptimizations.c: In function ‘getObjectSpecification’:
Dependencies/zope.interface-Zope-3.1.0/zope.interface/_zope_interface_coptimizations.c:144: error: ‘PyObject’ undeclared (first use in this function)
Dependencies/zope.interface-Zope-3.1.0/zope.interface/_zope_interface_coptimizations.c:144: error: ‘cls’ undeclared (first use in this function)
Dependencies/zope.interface-Zope-3.1.0/zope.interface/_zope_interface_coptimizations.c:144: error: ‘result’ undeclared (first use in this function)
Dependencies/zope.interface-Zope-3.1.0/zope.interface/_zope_interface_coptimizations.c:146: error: ‘ob’ undeclared (first use in this function)
Dependencies/zope.interface-Zope-3.1.0/zope.interface/_zope_interface_coptimizations.c:147: error: ‘NULL’ undeclared (first use in this function)
Dependencies/zope.interface-Zope-3.1.0/zope.interface/_zope_interface_coptimizations.c: At top level:
Dependencies/zope.interface-Zope-3.1.0/zope.interface/_zope_interface_coptimizations.c:169: error: syntax error before ‘*’ token
Dependencies/zope.interface-Zope-3.1.0/zope.interface/_zope_interface_coptimizations.c:170: error: syntax error before ‘*’ token
Dependencies/zope.interface-Zope-3.1.0/zope.interface/_zope_interface_coptimizations.c: In function ‘providedBy’:
Dependencies/zope.interface-Zope-3.1.0/zope.interface/_zope_interface_coptimizations.c:172: error: ‘PyObject’ undeclared (first use in this function)
Dependencies/zope.interface-Zope-3.1.0/zope.interface/_zope_interface_coptimizations.c:172: error: ‘result’ undeclared (first use in this function)
Dependencies/zope.interface-Zope-3.1.0/zope.interface/_zope_interface_coptimizations.c:172: error: ‘cls’ undeclared (first use in this function)
Dependencies/zope.interface-Zope-3.1.0/zope.interface/_zope_interface_coptimizations.c:172: error: ‘cp’ undeclared (first use in this function)
Dependencies/zope.interface-Zope-3.1.0/zope.interface/_zope_interface_coptimizations.c:174: error: ‘ob’ undeclared (first use in this function)
Dependencies/zope.interface-Zope-3.1.0/zope.interface/_zope_interface_coptimizations.c:175: error: ‘NULL’ undeclared (first use in this function)
Dependencies/zope.interface-Zope-3.1.0/zope.interface/_zope_interface_coptimizations.c: At top level:
Dependencies/zope.interface-Zope-3.1.0/zope.interface/_zope_interface_coptimizations.c:236: error: syntax error before ‘*’ token
Dependencies/zope.interface-Zope-3.1.0/zope.interface/_zope_interface_coptimizations.c:237: error: syntax error before ‘*’ token
Dependencies/zope.interface-Zope-3.1.0/zope.interface/_zope_interface_coptimizations.c: In function ‘inst_attr’:
Dependencies/zope.interface-Zope-3.1.0/zope.interface/_zope_interface_coptimizations.c:242: error: ‘PyObject’ undeclared (first use in this function)
Dependencies/zope.interface-Zope-3.1.0/zope.interface/_zope_interface_coptimizations.c:242: error: ‘dictp’ undeclared (first use in this function)
Dependencies/zope.interface-Zope-3.1.0/zope.interface/_zope_interface_coptimizations.c:242: error: ‘v’ undeclared (first use in this function)
Dependencies/zope.interface-Zope-3.1.0/zope.interface/_zope_interface_coptimizations.c:244: error: ‘self’ undeclared (first use in this function)
Dependencies/zope.interface-Zope-3.1.0/zope.interface/_zope_interface_coptimizations.c:245: error: ‘name’ undeclared (first use in this function)
Dependencies/zope.interface-Zope-3.1.0/zope.interface/_zope_interface_coptimizations.c:247: error: ‘PyExc_AttributeError’ undeclared (first use in this function)
Dependencies/zope.interface-Zope-3.1.0/zope.interface/_zope_interface_coptimizations.c:248: error: ‘NULL’ undeclared (first use in this function)
Dependencies/zope.interface-Zope-3.1.0/zope.interface/_zope_interface_coptimizations.c: At top level:
Dependencies/zope.interface-Zope-3.1.0/zope.interface/_zope_interface_coptimizations.c:252: error: syntax error before ‘*’ token
Dependencies/zope.interface-Zope-3.1.0/zope.interface/_zope_interface_coptimizations.c:253: error: syntax error before ‘*’ token
Dependencies/zope.interface-Zope-3.1.0/zope.interface/_zope_interface_coptimizations.c: In function ‘Spec_extends’:
Dependencies/zope.interface-Zope-3.1.0/zope.interface/_zope_interface_coptimizations.c:255: error: ‘PyObject’ undeclared (first use in this function)
Dependencies/zope.interface-Zope-3.1.0/zope.interface/_zope_interface_coptimizations.c:255: error: ‘implied’ undeclared (first use in this function)
Dependencies/zope.interface-Zope-3.1.0/zope.interface/_zope_interface_coptimizations.c:257: error: ‘self’ undeclared (first use in this function)
Dependencies/zope.interface-Zope-3.1.0/zope.interface/_zope_interface_coptimizations.c:258: error: ‘NULL’ undeclared (first use in this function)
Dependencies/zope.interface-Zope-3.1.0/zope.interface/_zope_interface_coptimizations.c:270: error: ‘other’ undeclared (first use in this function)
Dependencies/zope.interface-Zope-3.1.0/zope.interface/_zope_interface_coptimizations.c:270: warning: return makes pointer from integer without a cast
Dependencies/zope.interface-Zope-3.1.0/zope.interface/_zope_interface_coptimizations.c: At top level:
Dependencies/zope.interface-Zope-3.1.0/zope.interface/_zope_interface_coptimizations.c:282: error: syntax error before ‘*’ token
Dependencies/zope.interface-Zope-3.1.0/zope.interface/_zope_interface_coptimizations.c:283: error: syntax error before ‘*’ token
Dependencies/zope.interface-Zope-3.1.0/zope.interface/_zope_interface_coptimizations.c: In function ‘Spec_providedBy’:
Dependencies/zope.interface-Zope-3.1.0/zope.interface/_zope_interface_coptimizations.c:285: error: ‘PyObject’ undeclared (first use in this function)
Dependencies/zope.interface-Zope-3.1.0/zope.interface/_zope_interface_coptimizations.c:285: error: ‘decl’ undeclared (first use in this function)
Dependencies/zope.interface-Zope-3.1.0/zope.interface/_zope_interface_coptimizations.c:285: error: ‘item’ undeclared (first use in this function)
Dependencies/zope.interface-Zope-3.1.0/zope.interface/_zope_interface_coptimizations.c:287: error: ‘NULL’ undeclared (first use in this function)
Dependencies/zope.interface-Zope-3.1.0/zope.interface/_zope_interface_coptimizations.c:287: error: ‘ob’ undeclared (first use in this function)
Dependencies/zope.interface-Zope-3.1.0/zope.interface/_zope_interface_coptimizations.c:292: error: ‘self’ undeclared (first use in this function)
Dependencies/zope.interface-Zope-3.1.0/zope.interface/_zope_interface_coptimizations.c: At top level:
Dependencies/zope.interface-Zope-3.1.0/zope.interface/_zope_interface_coptimizations.c:308: error: syntax error before ‘*’ token
Dependencies/zope.interface-Zope-3.1.0/zope.interface/_zope_interface_coptimizations.c:309: error: syntax error before ‘*’ token
Dependencies/zope.interface-Zope-3.1.0/zope.interface/_zope_interface_coptimizations.c: In function ‘Spec_implementedBy’:
Dependencies/zope.interface-Zope-3.1.0/zope.interface/_zope_interface_coptimizations.c:311: error: ‘PyObject’ undeclared (first use in this function)
Dependencies/zope.interface-Zope-3.1.0/zope.interface/_zope_interface_coptimizations.c:311: error: ‘decl’ undeclared (first use in this function)
Dependencies/zope.interface-Zope-3.1.0/zope.interface/_zope_interface_coptimizations.c:311: error: ‘item’ undeclared (first use in this function)
Dependencies/zope.interface-Zope-3.1.0/zope.interface/_zope_interface_coptimizations.c:313: error: ‘NULL’ undeclared (first use in this function)
Dependencies/zope.interface-Zope-3.1.0/zope.interface/_zope_interface_coptimizations.c:313: error: ‘cls’ undeclared (first use in this function)
Dependencies/zope.interface-Zope-3.1.0/zope.interface/_zope_interface_coptimizations.c:318: error: ‘self’ undeclared (first use in this function)
Dependencies/zope.interface-Zope-3.1.0/zope.interface/_zope_interface_coptimizations.c: At top level:
Dependencies/zope.interface-Zope-3.1.0/zope.interface/_zope_interface_coptimizations.c:326: error: array type has incomplete element type
Dependencies/zope.interface-Zope-3.1.0/zope.interface/_zope_interface_coptimizations.c:328: error: ‘PyCFunction’ undeclared here (not in a function)
Dependencies/zope.interface-Zope-3.1.0/zope.interface/_zope_interface_coptimizations.c:328: error: syntax error before ‘Spec_providedBy’
Dependencies/zope.interface-Zope-3.1.0/zope.interface/_zope_interface_coptimizations.c:328: error: ‘METH_O’ undeclared here (not in a function)
Dependencies/zope.interface-Zope-3.1.0/zope.interface/_zope_interface_coptimizations.c:331: error: syntax error before ‘Spec_implementedBy’
Dependencies/zope.interface-Zope-3.1.0/zope.interface/_zope_interface_coptimizations.c:333: error: syntax error before ‘Spec_extends’
Dependencies/zope.interface-Zope-3.1.0/zope.interface/_zope_interface_coptimizations.c:336: error: ‘NULL’ undeclared here (not in a function)
Dependencies/zope.interface-Zope-3.1.0/zope.interface/_zope_interface_coptimizations.c:339: error: syntax error before ‘SpecType’
Dependencies/zope.interface-Zope-3.1.0/zope.interface/_zope_interface_coptimizations.c:341: error: initializer element is not constant
Dependencies/zope.interface-Zope-3.1.0/zope.interface/_zope_interface_coptimizations.c:341: error: (near initialization for ‘SpecType’)
Dependencies/zope.interface-Zope-3.1.0/zope.interface/_zope_interface_coptimizations.c:341: error: syntax error before numeric constant
Dependencies/zope.interface-Zope-3.1.0/zope.interface/_zope_interface_coptimizations.c:343: warning: excess elements in scalar initializer
Dependencies/zope.interface-Zope-3.1.0/zope.interface/_zope_interface_coptimizations.c:343: warning: (near initialization for ‘SpecType’)
Dependencies/zope.interface-Zope-3.1.0/zope.interface/_zope_interface_coptimizations.c:344: warning: excess elements in scalar initializer
Dependencies/zope.interface-Zope-3.1.0/zope.interface/_zope_interface_coptimizations.c:344: warning: (near initialization for ‘SpecType’)
Dependencies/zope.interface-Zope-3.1.0/zope.interface/_zope_interface_coptimizations.c:345: warning: excess elements in scalar initializer
Dependencies/zope.interface-Zope-3.1.0/zope.interface/_zope_interface_coptimizations.c:345: warning: (near initialization for ‘SpecType’)
Dependencies/zope.interface-Zope-3.1.0/zope.interface/_zope_interface_coptimizations.c:346: error: ‘destructor’ undeclared here (not in a function)
Dependencies/zope.interface-Zope-3.1.0/zope.interface/_zope_interface_coptimizations.c:346: warning: excess elements in scalar initializer
Dependencies/zope.interface-Zope-3.1.0/zope.interface/_zope_interface_coptimizations.c:346: warning: (near initialization for ‘SpecType’)
Dependencies/zope.interface-Zope-3.1.0/zope.interface/_zope_interface_coptimizations.c:346: error: syntax error before numeric constant
Dependencies/zope.interface-Zope-3.1.0/zope.interface/_zope_interface_coptimizations.c:347: error: ‘printfunc’ undeclared here (not in a function)
Dependencies/zope.interface-Zope-3.1.0/zope.interface/_zope_interface_coptimizations.c:347: warning: excess elements in scalar initializer
Dependencies/zope.interface-Zope-3.1.0/zope.interface/_zope_interface_coptimizations.c:347: warning: (near initialization for ‘SpecType’)
Dependencies/zope.interface-Zope-3.1.0/zope.interface/_zope_interface_coptimizations.c:347: error: syntax error before numeric constant
Dependencies/zope.interface-Zope-3.1.0/zope.interface/_zope_interface_coptimizations.c:348: error: ‘getattrfunc’ undeclared here (not in a function)
Dependencies/zope.interface-Zope-3.1.0/zope.interface/_zope_interface_coptimizations.c:348: warning: excess elements in scalar initializer
Dependencies/zope.interface-Zope-3.1.0/zope.interface/_zope_interface_coptimizations.c:348: warning: (near initialization for ‘SpecType’)
Dependencies/zope.interface-Zope-3.1.0/zope.interface/_zope_interface_coptimizations.c:348: error: syntax error before numeric constant
Dependencies/zope.interface-Zope-3.1.0/zope.interface/_zope_interface_coptimizations.c:349: error: ‘setattrfunc’ undeclared here (not in a function)
Dependencies/zope.interface-Zope-3.1.0/zope.interface/_zope_interface_coptimizations.c:349: warning: excess elements in scalar initializer
Dependencies/zope.interface-Zope-3.1.0/zope.interface/_zope_interface_coptimizations.c:349: warning: (near initialization for ‘SpecType’)
Dependencies/zope.interface-Zope-3.1.0/zope.interface/_zope_interface_coptimizations.c:349: error: syntax error before numeric constant
Dependencies/zope.interface-Zope-3.1.0/zope.interface/_zope_interface_coptimizations.c:350: error: ‘cmpfunc’ undeclared here (not in a function)
Dependencies/zope.interface-Zope-3.1.0/zope.interface/_zope_interface_coptimizations.c:350: warning: excess elements in scalar initializer
Dependencies/zope.interface-Zope-3.1.0/zope.interface/_zope_interface_coptimizations.c:350: warning: (near initialization for ‘SpecType’)
Dependencies/zope.interface-Zope-3.1.0/zope.interface/_zope_interface_coptimizations.c:350: error: syntax error before numeric constant
Dependencies/zope.interface-Zope-3.1.0/zope.interface/_zope_interface_coptimizations.c:351: error: ‘reprfunc’ undeclared here (not in a function)
Dependencies/zope.interface-Zope-3.1.0/zope.interface/_zope_interface_coptimizations.c:351: warning: excess elements in scalar initializer
Dependencies/zope.interface-Zope-3.1.0/zope.interface/_zope_interface_coptimizations.c:351: warning: (near initialization for ‘SpecType’)
Dependencies/zope.interface-Zope-3.1.0/zope.interface/_zope_interface_coptimizations.c:351: error: syntax error before numeric constant
Dependencies/zope.interface-Zope-3.1.0/zope.interface/_zope_interface_coptimizations.c:352: warning: excess elements in scalar initializer
Dependencies/zope.interface-Zope-3.1.0/zope.interface/_zope_interface_coptimizations.c:352: warning: (near initialization for ‘SpecType’)
Dependencies/zope.interface-Zope-3.1.0/zope.interface/_zope_interface_coptimizations.c:353: warning: excess elements in scalar initializer
Dependencies/zope.interface-Zope-3.1.0/zope.interface/_zope_interface_coptimizations.c:353: warning: (near initialization for ‘SpecType’)
Dependencies/zope.interface-Zope-3.1.0/zope.interface/_zope_interface_coptimizations.c:354: warning: excess elements in scalar initializer
Dependencies/zope.interface-Zope-3.1.0/zope.interface/_zope_interface_coptimizations.c:354: warning: (near initialization for ‘SpecType’)
Dependencies/zope.interface-Zope-3.1.0/zope.interface/_zope_interface_coptimizations.c:355: error: ‘hashfunc’ undeclared here (not in a function)
Dependencies/zope.interface-Zope-3.1.0/zope.interface/_zope_interface_coptimizations.c:355: warning: excess elements in scalar initializer
Dependencies/zope.interface-Zope-3.1.0/zope.interface/_zope_interface_coptimizations.c:355: warning: (near initialization for ‘SpecType’)
Dependencies/zope.interface-Zope-3.1.0/zope.interface/_zope_interface_coptimizations.c:355: error: syntax error before numeric constant
Dependencies/zope.interface-Zope-3.1.0/zope.interface/_zope_interface_coptimizations.c:356: error: ‘ternaryfunc’ undeclared here (not in a function)
Dependencies/zope.interface-Zope-3.1.0/zope.interface/_zope_interface_coptimizations.c:356: warning: excess elements in scalar initializer
Dependencies/zope.interface-Zope-3.1.0/zope.interface/_zope_interface_coptimizations.c:356: warning: (near initialization for ‘SpecType’)
Dependencies/zope.interface-Zope-3.1.0/zope.interface/_zope_interface_coptimizations.c:356: error: syntax error before numeric constant
Dependencies/zope.interface-Zope-3.1.0/zope.interface/_zope_interface_coptimizations.c:357: warning: excess elements in scalar initializer
Dependencies/zope.interface-Zope-3.1.0/zope.interface/_zope_interface_coptimizations.c:357: warning: (near initialization for ‘SpecType’)
Dependencies/zope.interface-Zope-3.1.0/zope.interface/_zope_interface_coptimizations.c:357: error: syntax error before numeric constant
Dependencies/zope.interface-Zope-3.1.0/zope.interface/_zope_interface_coptimizations.c:358: error: ‘getattrofunc’ undeclared here (not in a function)
Dependencies/zope.interface-Zope-3.1.0/zope.interface/_zope_interface_coptimizations.c:358: warning: excess elements in scalar initializer
Dependencies/zope.interface-Zope-3.1.0/zope.interface/_zope_interface_coptimizations.c:358: warning: (near initialization for ‘SpecType’)
Dependencies/zope.interface-Zope-3.1.0/zope.interface/_zope_interface_coptimizations.c:358: error: syntax error before numeric constant
Dependencies/zope.interface-Zope-3.1.0/zope.interface/_zope_interface_coptimizations.c:359: error: ‘setattrofunc’ undeclared here (not in a function)
Dependencies/zope.interface-Zope-3.1.0/zope.interface/_zope_interface_coptimizations.c:359: warning: excess elements in scalar initializer
Dependencies/zope.interface-Zope-3.1.0/zope.interface/_zope_interface_coptimizations.c:359: warning: (near initialization for ‘SpecType’)
Dependencies/zope.interface-Zope-3.1.0/zope.interface/_zope_interface_coptimizations.c:359: error: syntax error before numeric constant
Dependencies/zope.interface-Zope-3.1.0/zope.interface/_zope_interface_coptimizations.c:360: warning: excess elements in scalar initializer
Dependencies/zope.interface-Zope-3.1.0/zope.interface/_zope_interface_coptimizations.c:360: warning: (near initialization for ‘SpecType’)
Dependencies/zope.interface-Zope-3.1.0/zope.interface/_zope_interface_coptimizations.c:361: error: ‘Py_TPFLAGS_DEFAULT’ undeclared here (not in a function)
Dependencies/zope.interface-Zope-3.1.0/zope.interface/_zope_interface_coptimizations.c:361: error: ‘Py_TPFLAGS_BASETYPE’ undeclared here (not in a function)
Dependencies/zope.interface-Zope-3.1.0/zope.interface/_zope_interface_coptimizations.c:361: warning: excess elements in scalar initializer
Dependencies/zope.interface-Zope-3.1.0/zope.interface/_zope_interface_coptimizations.c:361: warning: (near initialization for ‘SpecType’)
Dependencies/zope.interface-Zope-3.1.0/zope.interface/_zope_interface_coptimizations.c:362: warning: excess elements in scalar initializer
Dependencies/zope.interface-Zope-3.1.0/zope.interface/_zope_interface_coptimizations.c:362: warning: (near initialization for ‘SpecType’)
Dependencies/zope.interface-Zope-3.1.0/zope.interface/_zope_interface_coptimizations.c:363: error: ‘traverseproc’ undeclared here (not in a function)
Dependencies/zope.interface-Zope-3.1.0/zope.interface/_zope_interface_coptimizations.c:363: warning: excess elements in scalar initializer
Dependencies/zope.interface-Zope-3.1.0/zope.interface/_zope_interface_coptimizations.c:363: warning: (near initialization for ‘SpecType’)
Dependencies/zope.interface-Zope-3.1.0/zope.interface/_zope_interface_coptimizations.c:363: error: syntax error before numeric constant
Dependencies/zope.interface-Zope-3.1.0/zope.interface/_zope_interface_coptimizations.c:364: error: ‘inquiry’ undeclared here (not in a function)
Dependencies/zope.interface-Zope-3.1.0/zope.interface/_zope_interface_coptimizations.c:364: warning: excess elements in scalar initializer
Dependencies/zope.interface-Zope-3.1.0/zope.interface/_zope_interface_coptimizations.c:364: warning: (near initialization for ‘SpecType’)
Dependencies/zope.interface-Zope-3.1.0/zope.interface/_zope_interface_coptimizations.c:364: error: syntax error before numeric constant
Dependencies/zope.interface-Zope-3.1.0/zope.interface/_zope_interface_coptimizations.c:365: error: ‘richcmpfunc’ undeclared here (not in a function)
Dependencies/zope.interface-Zope-3.1.0/zope.interface/_zope_interface_coptimizations.c:365: warning: excess elements in scalar initializer
Dependencies/zope.interface-Zope-3.1.0/zope.interface/_zope_interface_coptimizations.c:365: warning: (near initialization for ‘SpecType’)
Dependencies/zope.interface-Zope-3.1.0/zope.interface/_zope_interface_coptimizations.c:365: error: syntax error before numeric constant
Dependencies/zope.interface-Zope-3.1.0/zope.interface/_zope_interface_coptimizations.c:366: warning: excess elements in scalar initializer
Dependencies/zope.interface-Zope-3.1.0/zope.interface/_zope_interface_coptimizations.c:366: warning: (near initialization for ‘SpecType’)
Dependencies/zope.interface-Zope-3.1.0/zope.interface/_zope_interface_coptimizations.c:367: error: ‘getiterfunc’ undeclared here (not in a function)
Dependencies/zope.interface-Zope-3.1.0/zope.interface/_zope_interface_coptimizations.c:367: warning: excess elements in scalar initializer
Dependencies/zope.interface-Zope-3.1.0/zope.interface/_zope_interface_coptimizations.c:367: warning: (near initialization for ‘SpecType’)
Dependencies/zope.interface-Zope-3.1.0/zope.interface/_zope_interface_coptimizations.c:367: error: syntax error before numeric constant
Dependencies/zope.interface-Zope-3.1.0/zope.interface/_zope_interface_coptimizations.c:368: error: ‘iternextfunc’ undeclared here (not in a function)
Dependencies/zope.interface-Zope-3.1.0/zope.interface/_zope_interface_coptimizations.c:368: warning: excess elements in scalar initializer
Dependencies/zope.interface-Zope-3.1.0/zope.interface/_zope_interface_coptimizations.c:368: warning: (near initialization for ‘SpecType’)
Dependencies/zope.interface-Zope-3.1.0/zope.interface/_zope_interface_coptimizations.c:368: error: syntax error before numeric constant
Dependencies/zope.interface-Zope-3.1.0/zope.interface/_zope_interface_coptimizations.c:369: warning: excess elements in scalar initializer
Dependencies/zope.interface-Zope-3.1.0/zope.interface/_zope_interface_coptimizations.c:369: warning: (near initialization for ‘SpecType’)
Dependencies/zope.interface-Zope-3.1.0/zope.interface/_zope_interface_coptimizations.c:370: warning: data definition has no type or storage class
Dependencies/zope.interface-Zope-3.1.0/zope.interface/_zope_interface_coptimizations.c:372: error: syntax error before ‘*’ token
Dependencies/zope.interface-Zope-3.1.0/zope.interface/_zope_interface_coptimizations.c:373: error: syntax error before ‘*’ token
Dependencies/zope.interface-Zope-3.1.0/zope.interface/_zope_interface_coptimizations.c: In function ‘OSD_descr_get’:
Dependencies/zope.interface-Zope-3.1.0/zope.interface/_zope_interface_coptimizations.c:375: error: ‘PyObject’ undeclared (first use in this function)
Dependencies/zope.interface-Zope-3.1.0/zope.interface/_zope_interface_coptimizations.c:375: error: ‘provides’ undeclared (first use in this function)
Dependencies/zope.interface-Zope-3.1.0/zope.interface/_zope_interface_coptimizations.c:377: error: ‘inst’ undeclared (first use in this function)
Dependencies/zope.interface-Zope-3.1.0/zope.interface/_zope_interface_coptimizations.c:378: error: ‘cls’ undeclared (first use in this function)
Dependencies/zope.interface-Zope-3.1.0/zope.interface/_zope_interface_coptimizations.c: At top level:
Dependencies/zope.interface-Zope-3.1.0/zope.interface/_zope_interface_coptimizations.c:387: error: syntax error before ‘OSDType’
Dependencies/zope.interface-Zope-3.1.0/zope.interface/_zope_interface_coptimizations.c:389: error: initializer element is not constant
Dependencies/zope.interface-Zope-3.1.0/zope.interface/_zope_interface_coptimizations.c:389: error: (near initialization for ‘OSDType’)
Dependencies/zope.interface-Zope-3.1.0/zope.interface/_zope_interface_coptimizations.c:389: error: syntax error before numeric constant
Dependencies/zope.interface-Zope-3.1.0/zope.interface/_zope_interface_coptimizations.c:391: warning: excess elements in scalar initializer
Dependencies/zope.interface-Zope-3.1.0/zope.interface/_zope_interface_coptimizations.c:391: warning: (near initialization for ‘OSDType’)
Dependencies/zope.interface-Zope-3.1.0/zope.interface/_zope_interface_coptimizations.c:392: warning: excess elements in scalar initializer
Dependencies/zope.interface-Zope-3.1.0/zope.interface/_zope_interface_coptimizations.c:392: warning: (near initialization for ‘OSDType’)
Dependencies/zope.interface-Zope-3.1.0/zope.interface/_zope_interface_coptimizations.c:393: warning: excess elements in scalar initializer
Dependencies/zope.interface-Zope-3.1.0/zope.interface/_zope_interface_coptimizations.c:393: warning: (near initialization for ‘OSDType’)
Dependencies/zope.interface-Zope-3.1.0/zope.interface/_zope_interface_coptimizations.c:394: warning: excess elements in scalar initializer
Dependencies/zope.interface-Zope-3.1.0/zope.interface/_zope_interface_coptimizations.c:394: warning: (near initialization for ‘OSDType’)
Dependencies/zope.interface-Zope-3.1.0/zope.interface/_zope_interface_coptimizations.c:394: error: syntax error before numeric constant
Dependencies/zope.interface-Zope-3.1.0/zope.interface/_zope_interface_coptimizations.c:395: warning: excess elements in scalar initializer
Dependencies/zope.interface-Zope-3.1.0/zope.interface/_zope_interface_coptimizations.c:395: warning: (near initialization for ‘OSDType’)
Dependencies/zope.interface-Zope-3.1.0/zope.interface/_zope_interface_coptimizations.c:395: error: syntax error before numeric constant
Dependencies/zope.interface-Zope-3.1.0/zope.interface/_zope_interface_coptimizations.c:396: warning: excess elements in scalar initializer
Dependencies/zope.interface-Zope-3.1.0/zope.interface/_zope_interface_coptimizations.c:396: warning: (near initialization for ‘OSDType’)
Dependencies/zope.interface-Zope-3.1.0/zope.interface/_zope_interface_coptimizations.c:396: error: syntax error before numeric constant
Dependencies/zope.interface-Zope-3.1.0/zope.interface/_zope_interface_coptimizations.c:397: warning: excess elements in scalar initializer
Dependencies/zope.interface-Zope-3.1.0/zope.interface/_zope_interface_coptimizations.c:397: warning: (near initialization for ‘OSDType’)
Dependencies/zope.interface-Zope-3.1.0/zope.interface/_zope_interface_coptimizations.c:397: error: syntax error before numeric constant
Dependencies/zope.interface-Zope-3.1.0/zope.interface/_zope_interface_coptimizations.c:398: warning: excess elements in scalar initializer
Dependencies/zope.interface-Zope-3.1.0/zope.interface/_zope_interface_coptimizations.c:398: warning: (near initialization for ‘OSDType’)
Dependencies/zope.interface-Zope-3.1.0/zope.interface/_zope_interface_coptimizations.c:398: error: syntax error before numeric constant
Dependencies/zope.interface-Zope-3.1.0/zope.interface/_zope_interface_coptimizations.c:399: warning: excess elements in scalar initializer
Dependencies/zope.interface-Zope-3.1.0/zope.interface/_zope_interface_coptimizations.c:399: warning: (near initialization for ‘OSDType’)
Dependencies/zope.interface-Zope-3.1.0/zope.interface/_zope_interface_coptimizations.c:399: error: syntax error before numeric constant
Dependencies/zope.interface-Zope-3.1.0/zope.interface/_zope_interface_coptimizations.c:400: warning: excess elements in scalar initializer
Dependencies/zope.interface-Zope-3.1.0/zope.interface/_zope_interface_coptimizations.c:400: warning: (near initialization for ‘OSDType’)
Dependencies/zope.interface-Zope-3.1.0/zope.interface/_zope_interface_coptimizations.c:401: warning: excess elements in scalar initializer
Dependencies/zope.interface-Zope-3.1.0/zope.interface/_zope_interface_coptimizations.c:401: warning: (near initialization for ‘OSDType’)
Dependencies/zope.interface-Zope-3.1.0/zope.interface/_zope_interface_coptimizations.c:402: warning: excess elements in scalar initializer
Dependencies/zope.interface-Zope-3.1.0/zope.interface/_zope_interface_coptimizations.c:402: warning: (near initialization for ‘OSDType’)
Dependencies/zope.interface-Zope-3.1.0/zope.interface/_zope_interface_coptimizations.c:403: warning: excess elements in scalar initializer
Dependencies/zope.interface-Zope-3.1.0/zope.interface/_zope_interface_coptimizations.c:403: warning: (near initialization for ‘OSDType’)
Dependencies/zope.interface-Zope-3.1.0/zope.interface/_zope_interface_coptimizations.c:403: error: syntax error before numeric constant
Dependencies/zope.interface-Zope-3.1.0/zope.interface/_zope_interface_coptimizations.c:404: warning: excess elements in scalar initializer
Dependencies/zope.interface-Zope-3.1.0/zope.interface/_zope_interface_coptimizations.c:404: warning: (near initialization for ‘OSDType’)
Dependencies/zope.interface-Zope-3.1.0/zope.interface/_zope_interface_coptimizations.c:404: error: syntax error before numeric constant
Dependencies/zope.interface-Zope-3.1.0/zope.interface/_zope_interface_coptimizations.c:405: warning: excess elements in scalar initializer
Dependencies/zope.interface-Zope-3.1.0/zope.interface/_zope_interface_coptimizations.c:405: warning: (near initialization for ‘OSDType’)
Dependencies/zope.interface-Zope-3.1.0/zope.interface/_zope_interface_coptimizations.c:405: error: syntax error before numeric constant
Dependencies/zope.interface-Zope-3.1.0/zope.interface/_zope_interface_coptimizations.c:406: warning: excess elements in scalar initializer
Dependencies/zope.interface-Zope-3.1.0/zope.interface/_zope_interface_coptimizations.c:406: warning: (near initialization for ‘OSDType’)
Dependencies/zope.interface-Zope-3.1.0/zope.interface/_zope_interface_coptimizations.c:406: error: syntax error before numeric constant
Dependencies/zope.interface-Zope-3.1.0/zope.interface/_zope_interface_coptimizations.c:407: warning: excess elements in scalar initializer
Dependencies/zope.interface-Zope-3.1.0/zope.interface/_zope_interface_coptimizations.c:407: warning: (near initialization for ‘OSDType’)
Dependencies/zope.interface-Zope-3.1.0/zope.interface/_zope_interface_coptimizations.c:407: error: syntax error before numeric constant
Dependencies/zope.interface-Zope-3.1.0/zope.interface/_zope_interface_coptimizations.c:408: warning: excess elements in scalar initializer
Dependencies/zope.interface-Zope-3.1.0/zope.interface/_zope_interface_coptimizations.c:408: warning: (near initialization for ‘OSDType’)
Dependencies/zope.interface-Zope-3.1.0/zope.interface/_zope_interface_coptimizations.c:410: warning: excess elements in scalar initializer
Dependencies/zope.interface-Zope-3.1.0/zope.interface/_zope_interface_coptimizations.c:410: warning: (near initialization for ‘OSDType’)
Dependencies/zope.interface-Zope-3.1.0/zope.interface/_zope_interface_coptimizations.c:411: warning: excess elements in scalar initializer
Dependencies/zope.interface-Zope-3.1.0/zope.interface/_zope_interface_coptimizations.c:411: warning: (near initialization for ‘OSDType’)
Dependencies/zope.interface-Zope-3.1.0/zope.interface/_zope_interface_coptimizations.c:412: warning: excess elements in scalar initializer
Dependencies/zope.interface-Zope-3.1.0/zope.interface/_zope_interface_coptimizations.c:412: warning: (near initialization for ‘OSDType’)
Dependencies/zope.interface-Zope-3.1.0/zope.interface/_zope_interface_coptimizations.c:412: error: syntax error before numeric constant
Dependencies/zope.interface-Zope-3.1.0/zope.interface/_zope_interface_coptimizations.c:413: warning: excess elements in scalar initializer
Dependencies/zope.interface-Zope-3.1.0/zope.interface/_zope_interface_coptimizations.c:413: warning: (near initialization for ‘OSDType’)
Dependencies/zope.interface-Zope-3.1.0/zope.interface/_zope_interface_coptimizations.c:413: error: syntax error before numeric constant
Dependencies/zope.interface-Zope-3.1.0/zope.interface/_zope_interface_coptimizations.c:414: warning: excess elements in scalar initializer
Dependencies/zope.interface-Zope-3.1.0/zope.interface/_zope_interface_coptimizations.c:414: warning: (near initialization for ‘OSDType’)
Dependencies/zope.interface-Zope-3.1.0/zope.interface/_zope_interface_coptimizations.c:414: error: syntax error before numeric constant
Dependencies/zope.interface-Zope-3.1.0/zope.interface/_zope_interface_coptimizations.c:415: warning: excess elements in scalar initializer
Dependencies/zope.interface-Zope-3.1.0/zope.interface/_zope_interface_coptimizations.c:415: warning: (near initialization for ‘OSDType’)
Dependencies/zope.interface-Zope-3.1.0/zope.interface/_zope_interface_coptimizations.c:416: warning: excess elements in scalar initializer
Dependencies/zope.interface-Zope-3.1.0/zope.interface/_zope_interface_coptimizations.c:416: warning: (near initialization for ‘OSDType’)
Dependencies/zope.interface-Zope-3.1.0/zope.interface/_zope_interface_coptimizations.c:416: error: syntax error before numeric constant
Dependencies/zope.interface-Zope-3.1.0/zope.interface/_zope_interface_coptimizations.c:417: warning: excess elements in scalar initializer
Dependencies/zope.interface-Zope-3.1.0/zope.interface/_zope_interface_coptimizations.c:417: warning: (near initialization for ‘OSDType’)
Dependencies/zope.interface-Zope-3.1.0/zope.interface/_zope_interface_coptimizations.c:417: error: syntax error before numeric constant
Dependencies/zope.interface-Zope-3.1.0/zope.interface/_zope_interface_coptimizations.c:418: warning: excess elements in scalar initializer
Dependencies/zope.interface-Zope-3.1.0/zope.interface/_zope_interface_coptimizations.c:418: warning: (near initialization for ‘OSDType’)
Dependencies/zope.interface-Zope-3.1.0/zope.interface/_zope_interface_coptimizations.c:419: warning: excess elements in scalar initializer
Dependencies/zope.interface-Zope-3.1.0/zope.interface/_zope_interface_coptimizations.c:419: warning: (near initialization for ‘OSDType’)
Dependencies/zope.interface-Zope-3.1.0/zope.interface/_zope_interface_coptimizations.c:420: warning: excess elements in scalar initializer
Dependencies/zope.interface-Zope-3.1.0/zope.interface/_zope_interface_coptimizations.c:420: warning: (near initialization for ‘OSDType’)
Dependencies/zope.interface-Zope-3.1.0/zope.interface/_zope_interface_coptimizations.c:421: warning: excess elements in scalar initializer
Dependencies/zope.interface-Zope-3.1.0/zope.interface/_zope_interface_coptimizations.c:421: warning: (near initialization for ‘OSDType’)
Dependencies/zope.interface-Zope-3.1.0/zope.interface/_zope_interface_coptimizations.c:422: warning: excess elements in scalar initializer
Dependencies/zope.interface-Zope-3.1.0/zope.interface/_zope_interface_coptimizations.c:422: warning: (near initialization for ‘OSDType’)
Dependencies/zope.interface-Zope-3.1.0/zope.interface/_zope_interface_coptimizations.c:423: error: ‘descrgetfunc’ undeclared here (not in a function)
Dependencies/zope.interface-Zope-3.1.0/zope.interface/_zope_interface_coptimizations.c:423: warning: excess elements in scalar initializer
Dependencies/zope.interface-Zope-3.1.0/zope.interface/_zope_interface_coptimizations.c:423: warning: (near initialization for ‘OSDType’)
Dependencies/zope.interface-Zope-3.1.0/zope.interface/_zope_interface_coptimizations.c:423: error: syntax error before ‘OSD_descr_get’
Dependencies/zope.interface-Zope-3.1.0/zope.interface/_zope_interface_coptimizations.c:424: warning: data definition has no type or storage class
Dependencies/zope.interface-Zope-3.1.0/zope.interface/_zope_interface_coptimizations.c:426: error: syntax error before ‘*’ token
Dependencies/zope.interface-Zope-3.1.0/zope.interface/_zope_interface_coptimizations.c:427: error: syntax error before ‘*’ token
Dependencies/zope.interface-Zope-3.1.0/zope.interface/_zope_interface_coptimizations.c: In function ‘CPB_descr_get’:
Dependencies/zope.interface-Zope-3.1.0/zope.interface/_zope_interface_coptimizations.c:429: error: ‘PyObject’ undeclared (first use in this function)
Dependencies/zope.interface-Zope-3.1.0/zope.interface/_zope_interface_coptimizations.c:429: error: ‘mycls’ undeclared (first use in this function)
Dependencies/zope.interface-Zope-3.1.0/zope.interface/_zope_interface_coptimizations.c:429: error: ‘implements’ undeclared (first use in this function)
Dependencies/zope.interface-Zope-3.1.0/zope.interface/_zope_interface_coptimizations.c:431: error: ‘self’ undeclared (first use in this function)
Dependencies/zope.interface-Zope-3.1.0/zope.interface/_zope_interface_coptimizations.c:435: error: ‘cls’ undeclared (first use in this function)
Dependencies/zope.interface-Zope-3.1.0/zope.interface/_zope_interface_coptimizations.c:437: error: ‘inst’ undeclared (first use in this function)
Dependencies/zope.interface-Zope-3.1.0/zope.interface/_zope_interface_coptimizations.c:440: error: syntax error before ‘)’ token
Dependencies/zope.interface-Zope-3.1.0/zope.interface/_zope_interface_coptimizations.c:448: error: ‘PyExc_AttributeError’ undeclared (first use in this function)
Dependencies/zope.interface-Zope-3.1.0/zope.interface/_zope_interface_coptimizations.c: At top level:
Dependencies/zope.interface-Zope-3.1.0/zope.interface/_zope_interface_coptimizations.c:452: error: syntax error before ‘CPBType’
Dependencies/zope.interface-Zope-3.1.0/zope.interface/_zope_interface_coptimizations.c:454: error: initializer element is not constant
Dependencies/zope.interface-Zope-3.1.0/zope.interface/_zope_interface_coptimizations.c:454: error: (near initialization for ‘CPBType’)
Dependencies/zope.interface-Zope-3.1.0/zope.interface/_zope_interface_coptimizations.c:454: error: syntax error before numeric constant
Dependencies/zope.interface-Zope-3.1.0/zope.interface/_zope_interface_coptimizations.c:456: warning: excess elements in scalar initializer
Dependencies/zope.interface-Zope-3.1.0/zope.interface/_zope_interface_coptimizations.c:456: warning: (near initialization for ‘CPBType’)
Dependencies/zope.interface-Zope-3.1.0/zope.interface/_zope_interface_coptimizations.c:457: warning: excess elements in scalar initializer
Dependencies/zope.interface-Zope-3.1.0/zope.interface/_zope_interface_coptimizations.c:457: warning: (near initialization for ‘CPBType’)
Dependencies/zope.interface-Zope-3.1.0/zope.interface/_zope_interface_coptimizations.c:458: warning: excess elements in scalar initializer
Dependencies/zope.interface-Zope-3.1.0/zope.interface/_zope_interface_coptimizations.c:458: warning: (near initialization for ‘CPBType’)
Dependencies/zope.interface-Zope-3.1.0/zope.interface/_zope_interface_coptimizations.c:459: warning: excess elements in scalar initializer
Dependencies/zope.interface-Zope-3.1.0/zope.interface/_zope_interface_coptimizations.c:459: warning: (near initialization for ‘CPBType’)
Dependencies/zope.interface-Zope-3.1.0/zope.interface/_zope_interface_coptimizations.c:459: error: syntax error before numeric constant
Dependencies/zope.interface-Zope-3.1.0/zope.interface/_zope_interface_coptimizations.c:460: warning: excess elements in scalar initializer
Dependencies/zope.interface-Zope-3.1.0/zope.interface/_zope_interface_coptimizations.c:460: warning: (near initialization for ‘CPBType’)
Dependencies/zope.interface-Zope-3.1.0/zope.interface/_zope_interface_coptimizations.c:460: error: syntax error before numeric constant
Dependencies/zope.interface-Zope-3.1.0/zope.interface/_zope_interface_coptimizations.c:461: warning: excess elements in scalar initializer
Dependencies/zope.interface-Zope-3.1.0/zope.interface/_zope_interface_coptimizations.c:461: warning: (near initialization for ‘CPBType’)
Dependencies/zope.interface-Zope-3.1.0/zope.interface/_zope_interface_coptimizations.c:461: error: syntax error before numeric constant
Dependencies/zope.interface-Zope-3.1.0/zope.interface/_zope_interface_coptimizations.c:462: warning: excess elements in scalar initializer
Dependencies/zope.interface-Zope-3.1.0/zope.interface/_zope_interface_coptimizations.c:462: warning: (near initialization for ‘CPBType’)
Dependencies/zope.interface-Zope-3.1.0/zope.interface/_zope_interface_coptimizations.c:462: error: syntax error before numeric constant
Dependencies/zope.interface-Zope-3.1.0/zope.interface/_zope_interface_coptimizations.c:463: warning: excess elements in scalar initializer
Dependencies/zope.interface-Zope-3.1.0/zope.interface/_zope_interface_coptimizations.c:463: warning: (near initialization for ‘CPBType’)
Dependencies/zope.interface-Zope-3.1.0/zope.interface/_zope_interface_coptimizations.c:463: error: syntax error before numeric constant
Dependencies/zope.interface-Zope-3.1.0/zope.interface/_zope_interface_coptimizations.c:464: warning: excess elements in scalar initializer
Dependencies/zope.interface-Zope-3.1.0/zope.interface/_zope_interface_coptimizations.c:464: warning: (near initialization for ‘CPBType’)
Dependencies/zope.interface-Zope-3.1.0/zope.interface/_zope_interface_coptimizations.c:464: error: syntax error before numeric constant
Dependencies/zope.interface-Zope-3.1.0/zope.interface/_zope_interface_coptimizations.c:465: warning: excess elements in scalar initializer
Dependencies/zope.interface-Zope-3.1.0/zope.interface/_zope_interface_coptimizations.c:465: warning: (near initialization for ‘CPBType’)
Dependencies/zope.interface-Zope-3.1.0/zope.interface/_zope_interface_coptimizations.c:466: warning: excess elements in scalar initializer
Dependencies/zope.interface-Zope-3.1.0/zope.interface/_zope_interface_coptimizations.c:466: warning: (near initialization for ‘CPBType’)
Dependencies/zope.interface-Zope-3.1.0/zope.interface/_zope_interface_coptimizations.c:467: warning: excess elements in scalar initializer
Dependencies/zope.interface-Zope-3.1.0/zope.interface/_zope_interface_coptimizations.c:467: warning: (near initialization for ‘CPBType’)
Dependencies/zope.interface-Zope-3.1.0/zope.interface/_zope_interface_coptimizations.c:468: warning: excess elements in scalar initializer
Dependencies/zope.interface-Zope-3.1.0/zope.interface/_zope_interface_coptimizations.c:468: warning: (near initialization for ‘CPBType’)
Dependencies/zope.interface-Zope-3.1.0/zope.interface/_zope_interface_coptimizations.c:468: error: syntax error before numeric constant
Dependencies/zope.interface-Zope-3.1.0/zope.interface/_zope_interface_coptimizations.c:469: warning: excess elements in scalar initializer
Dependencies/zope.interface-Zope-3.1.0/zope.interface/_zope_interface_coptimizations.c:469: warning: (near initialization for ‘CPBType’)
Dependencies/zope.interface-Zope-3.1.0/zope.interface/_zope_interface_coptimizations.c:469: error: syntax error before numeric constant
Dependencies/zope.interface-Zope-3.1.0/zope.interface/_zope_interface_coptimizations.c:470: warning: excess elements in scalar initializer
Dependencies/zope.interface-Zope-3.1.0/zope.interface/_zope_interface_coptimizations.c:470: warning: (near initialization for ‘CPBType’)
Dependencies/zope.interface-Zope-3.1.0/zope.interface/_zope_interface_coptimizations.c:470: error: syntax error before numeric constant
Dependencies/zope.interface-Zope-3.1.0/zope.interface/_zope_interface_coptimizations.c:471: warning: excess elements in scalar initializer
Dependencies/zope.interface-Zope-3.1.0/zope.interface/_zope_interface_coptimizations.c:471: warning: (near initialization for ‘CPBType’)
Dependencies/zope.interface-Zope-3.1.0/zope.interface/_zope_interface_coptimizations.c:471: error: syntax error before numeric constant
Dependencies/zope.interface-Zope-3.1.0/zope.interface/_zope_interface_coptimizations.c:472: warning: excess elements in scalar initializer
Dependencies/zope.interface-Zope-3.1.0/zope.interface/_zope_interface_coptimizations.c:472: warning: (near initialization for ‘CPBType’)
Dependencies/zope.interface-Zope-3.1.0/zope.interface/_zope_interface_coptimizations.c:472: error: syntax error before numeric constant
Dependencies/zope.interface-Zope-3.1.0/zope.interface/_zope_interface_coptimizations.c:473: warning: excess elements in scalar initializer
Dependencies/zope.interface-Zope-3.1.0/zope.interface/_zope_interface_coptimizations.c:473: warning: (near initialization for ‘CPBType’)
Dependencies/zope.interface-Zope-3.1.0/zope.interface/_zope_interface_coptimizations.c:474: warning: excess elements in scalar initializer
Dependencies/zope.interface-Zope-3.1.0/zope.interface/_zope_interface_coptimizations.c:474: warning: (near initialization for ‘CPBType’)
Dependencies/zope.interface-Zope-3.1.0/zope.interface/_zope_interface_coptimizations.c:475: warning: excess elements in scalar initializer
Dependencies/zope.interface-Zope-3.1.0/zope.interface/_zope_interface_coptimizations.c:475: warning: (near initialization for ‘CPBType’)
Dependencies/zope.interface-Zope-3.1.0/zope.interface/_zope_interface_coptimizations.c:476: warning: excess elements in scalar initializer
Dependencies/zope.interface-Zope-3.1.0/zope.interface/_zope_interface_coptimizations.c:476: warning: (near initialization for ‘CPBType’)
Dependencies/zope.interface-Zope-3.1.0/zope.interface/_zope_interface_coptimizations.c:476: error: syntax error before numeric constant
Dependencies/zope.interface-Zope-3.1.0/zope.interface/_zope_interface_coptimizations.c:477: warning: excess elements in scalar initializer
Dependencies/zope.interface-Zope-3.1.0/zope.interface/_zope_interface_coptimizations.c:477: warning: (near initialization for ‘CPBType’)
Dependencies/zope.interface-Zope-3.1.0/zope.interface/_zope_interface_coptimizations.c:477: error: syntax error before numeric constant
Dependencies/zope.interface-Zope-3.1.0/zope.interface/_zope_interface_coptimizations.c:478: warning: excess elements in scalar initializer
Dependencies/zope.interface-Zope-3.1.0/zope.interface/_zope_interface_coptimizations.c:478: warning: (near initialization for ‘CPBType’)
Dependencies/zope.interface-Zope-3.1.0/zope.interface/_zope_interface_coptimizations.c:478: error: syntax error before numeric constant
Dependencies/zope.interface-Zope-3.1.0/zope.interface/_zope_interface_coptimizations.c:479: warning: excess elements in scalar initializer
Dependencies/zope.interface-Zope-3.1.0/zope.interface/_zope_interface_coptimizations.c:479: warning: (near initialization for ‘CPBType’)
Dependencies/zope.interface-Zope-3.1.0/zope.interface/_zope_interface_coptimizations.c:480: warning: excess elements in scalar initializer
Dependencies/zope.interface-Zope-3.1.0/zope.interface/_zope_interface_coptimizations.c:480: warning: (near initialization for ‘CPBType’)
Dependencies/zope.interface-Zope-3.1.0/zope.interface/_zope_interface_coptimizations.c:480: error: syntax error before numeric constant
Dependencies/zope.interface-Zope-3.1.0/zope.interface/_zope_interface_coptimizations.c:481: warning: excess elements in scalar initializer
Dependencies/zope.interface-Zope-3.1.0/zope.interface/_zope_interface_coptimizations.c:481: warning: (near initialization for ‘CPBType’)
Dependencies/zope.interface-Zope-3.1.0/zope.interface/_zope_interface_coptimizations.c:481: error: syntax error before numeric constant
Dependencies/zope.interface-Zope-3.1.0/zope.interface/_zope_interface_coptimizations.c:482: warning: excess elements in scalar initializer
Dependencies/zope.interface-Zope-3.1.0/zope.interface/_zope_interface_coptimizations.c:482: warning: (near initialization for ‘CPBType’)
Dependencies/zope.interface-Zope-3.1.0/zope.interface/_zope_interface_coptimizations.c:483: warning: excess elements in scalar initializer
Dependencies/zope.interface-Zope-3.1.0/zope.interface/_zope_interface_coptimizations.c:483: warning: (near initialization for ‘CPBType’)
Dependencies/zope.interface-Zope-3.1.0/zope.interface/_zope_interface_coptimizations.c:484: warning: excess elements in scalar initializer
Dependencies/zope.interface-Zope-3.1.0/zope.interface/_zope_interface_coptimizations.c:484: warning: (near initialization for ‘CPBType’)
Dependencies/zope.interface-Zope-3.1.0/zope.interface/_zope_interface_coptimizations.c:485: warning: excess elements in scalar initializer
Dependencies/zope.interface-Zope-3.1.0/zope.interface/_zope_interface_coptimizations.c:485: warning: (near initialization for ‘CPBType’)
Dependencies/zope.interface-Zope-3.1.0/zope.interface/_zope_interface_coptimizations.c:486: warning: excess elements in scalar initializer
Dependencies/zope.interface-Zope-3.1.0/zope.interface/_zope_interface_coptimizations.c:486: warning: (near initialization for ‘CPBType’)
Dependencies/zope.interface-Zope-3.1.0/zope.interface/_zope_interface_coptimizations.c:487: warning: excess elements in scalar initializer
Dependencies/zope.interface-Zope-3.1.0/zope.interface/_zope_interface_coptimizations.c:487: warning: (near initialization for ‘CPBType’)
Dependencies/zope.interface-Zope-3.1.0/zope.interface/_zope_interface_coptimizations.c:487: error: syntax error before ‘CPB_descr_get’
Dependencies/zope.interface-Zope-3.1.0/zope.interface/_zope_interface_coptimizations.c:488: warning: data definition has no type or storage class
Dependencies/zope.interface-Zope-3.1.0/zope.interface/_zope_interface_coptimizations.c:491: error: array type has incomplete element type
Dependencies/zope.interface-Zope-3.1.0/zope.interface/_zope_interface_coptimizations.c:492: error: syntax error before ‘implementedBy’
Dependencies/zope.interface-Zope-3.1.0/zope.interface/_zope_interface_coptimizations.c:494: error: syntax error before ‘getObjectSpecification’
Dependencies/zope.interface-Zope-3.1.0/zope.interface/_zope_interface_coptimizations.c:496: error: syntax error before ‘providedBy’
Dependencies/zope.interface-Zope-3.1.0/zope.interface/_zope_interface_coptimizations.c:499: error: syntax error before ‘NULL’
Dependencies/zope.interface-Zope-3.1.0/zope.interface/_zope_interface_coptimizations.c: In function ‘init_zope_interface_coptimizations’:
Dependencies/zope.interface-Zope-3.1.0/zope.interface/_zope_interface_coptimizations.c:508: error: ‘PyObject’ undeclared (first use in this function)
Dependencies/zope.interface-Zope-3.1.0/zope.interface/_zope_interface_coptimizations.c:508: error: ‘m’ undeclared (first use in this function)
Dependencies/zope.interface-Zope-3.1.0/zope.interface/_zope_interface_coptimizations.c:513: warning: assignment makes pointer from integer without a cast
Dependencies/zope.interface-Zope-3.1.0/zope.interface/_zope_interface_coptimizations.c:514: warning: assignment makes pointer from integer without a cast
Dependencies/zope.interface-Zope-3.1.0/zope.interface/_zope_interface_coptimizations.c:515: warning: assignment makes pointer from integer without a cast
Dependencies/zope.interface-Zope-3.1.0/zope.interface/_zope_interface_coptimizations.c:516: warning: assignment makes pointer from integer without a cast
Dependencies/zope.interface-Zope-3.1.0/zope.interface/_zope_interface_coptimizations.c:517: warning: assignment makes pointer from integer without a cast
Dependencies/zope.interface-Zope-3.1.0/zope.interface/_zope_interface_coptimizations.c:518: warning: assignment makes pointer from integer without a cast
Dependencies/zope.interface-Zope-3.1.0/zope.interface/_zope_interface_coptimizations.c:519: warning: assignment makes pointer from integer without a cast
Dependencies/zope.interface-Zope-3.1.0/zope.interface/_zope_interface_coptimizations.c:520: warning: assignment makes pointer from integer without a cast
Dependencies/zope.interface-Zope-3.1.0/zope.interface/_zope_interface_coptimizations.c:521: warning: assignment makes pointer from integer without a cast
Dependencies/zope.interface-Zope-3.1.0/zope.interface/_zope_interface_coptimizations.c:522: warning: assignment makes pointer from integer without a cast
Dependencies/zope.interface-Zope-3.1.0/zope.interface/_zope_interface_coptimizations.c:527: error: request for member ‘tp_new’ in something not a structure or union
Dependencies/zope.interface-Zope-3.1.0/zope.interface/_zope_interface_coptimizations.c:527: error: ‘PyBaseObject_Type’ undeclared (first use in this function)
Dependencies/zope.interface-Zope-3.1.0/zope.interface/_zope_interface_coptimizations.c:530: error: request for member ‘tp_new’ in something not a structure or union
Dependencies/zope.interface-Zope-3.1.0/zope.interface/_zope_interface_coptimizations.c:533: error: request for member ‘tp_new’ in something not a structure or union
Dependencies/zope.interface-Zope-3.1.0/zope.interface/_zope_interface_coptimizations.c:545: error: syntax error before ‘)’ token
Dependencies/zope.interface-Zope-3.1.0/zope.interface/_zope_interface_coptimizations.c:548: error: syntax error before ‘)’ token
Dependencies/zope.interface-Zope-3.1.0/zope.interface/_zope_interface_coptimizations.c:550: error: syntax error before ‘)’ token
error: command 'gcc' failed with exit status 1
make: *** [build] Error 1