All pastes #263517 Raw Edit

Mine

public text v1 · immutable
·published 2006-12-01 16:44 UTC
rendered paste body
        done
make[1]: Entering directory `/usr/src/modules/shfs'
/usr/bin/make -w -f debian/rules kdist_clean kdist_config binary-modules
make[2]: Entering directory `/usr/src/modules/shfs'
dh_clean
make -C Linux-2.6 clean
make[3]: Entering directory `/usr/src/modules/shfs/Linux-2.6'
rm -rf linux-2.6.17-2-686 linux-2.6.17-2-686.orig;
rm -f linux-2.6.17-2-686.diff
rm -f *.o *.ko *.mod.c .*o.cmd
make[3]: Leaving directory `/usr/src/modules/shfs/Linux-2.6'
for templ in /usr/src/modules/shfs/debian/shfs-module-_KVERS_.postinst /usr/src/modules/shfs/debian/shfs-module-_KVERS_.postinst.modules.in; do \
    cp $templ `echo $templ | sed -e 's/_KVERS_/2.6.19-486/g'` ; \
  done
for templ in `ls debian/*.modules.in` ; do \
    test -e ${templ%.modules.in}.backup || cp ${templ%.modules.in} ${templ%.modules.in}.backup 2>/dev/null || true; \
    sed -e 's/##KVERS##/2.6.19-486/g ;s/#KVERS#/2.6.19-486/g ; s/_KVERS_/2.6.19-486/g ; s/##KDREV##/rev.01/g ; s/#KDREV#/rev.01/g ; s/_KDREV_/rev.01/g  ' < $templ > ${templ%.modules.in}; \
  done
dh_testdir
dh_testroot
dh_clean -k
env MODVERSIONS=detect make -C Linux-2.6 KERNEL_SOURCES=/usr/src/linux-2.6.19 KERNEL=linux-2.6.19-486
make[3]: Entering directory `/usr/src/modules/shfs/Linux-2.6'
make -C /usr/src/linux-2.6.19 SUBDIRS=/usr/src/modules/shfs/Linux-2.6 modules
make[4]: Entering directory `/usr/src/linux-2.6.19'
  CC [M]  /usr/src/modules/shfs/Linux-2.6/dcache.o
  CC [M]  /usr/src/modules/shfs/Linux-2.6/dir.o
/usr/src/modules/shfs/Linux-2.6/dir.c: In function ‘shfs_create’:
/usr/src/modules/shfs/Linux-2.6/dir.c:305: error: ‘struct inode’ has no member named ‘u’
/usr/src/modules/shfs/Linux-2.6/dir.c:306: error: ‘struct inode’ has no member named ‘u’
make[5]: *** [/usr/src/modules/shfs/Linux-2.6/dir.o] Error 1
make[4]: *** [_module_/usr/src/modules/shfs/Linux-2.6] Error 2
make[4]: Leaving directory `/usr/src/linux-2.6.19'
make[3]: *** [default] Error 2
make[3]: Leaving directory `/usr/src/modules/shfs/Linux-2.6'
make[2]: *** [binary-modules] Error 2
make[2]: Leaving directory `/usr/src/modules/shfs'
make[1]: *** [kdist_build] Error 2
make[1]: Leaving directory `/usr/src/modules/shfs'
Module /usr/src/modules/shfs failed.
Hit return to Continue