All pastes #26328 Raw Edit

zaptel compilation e

public text v1 · immutable
#26328 ·published 2005-10-22 22:31 UTC
rendered paste body
/usr/src/linux/include/linux/version.h:6:2: #error "The kernel sources in /usr/src/linux are not yet configured."
/usr/src/linux/include/linux/version.h:7:2: #error "Please run 'make cloneconfig && make dep' in /usr/src/linux/"
/usr/src/linux/include/linux/version.h:8:2: #error "to get a kernel that is configured like the running kernel."
/usr/src/linux/include/linux/version.h:9:2: #error "Alternatively, you can copy one of the config files"
/usr/src/linux/include/linux/version.h:10:2: #error "arch/$ARCH/defconfig.* to .config, and run"
/usr/src/linux/include/linux/version.h:11:2: #error "'make oldconfig && make dep' to configure the kernel"
/usr/src/linux/include/linux/version.h:12:2: #error "for that configuration."
In file included from zaptel.c:82:
zaptel.h:47:41: missing binary operator before token "("
In file included from /usr/src/linux/include/linux/poll.h:11,
                 from zaptel.h:899,
                 from zaptel.c:82:
/usr/include/asm/uaccess.h: At top level:
/usr/include/asm/uaccess.h:102: error: parse error before '*' token
/usr/include/asm/uaccess.h: In function `verify_area':
/usr/include/asm/uaccess.h:104: error: `addr' undeclared (first use in this function)
/usr/include/asm/uaccess.h:104: error: `size' undeclared (first use in this function)
/usr/include/asm/uaccess.h: At top level:
/usr/include/asm/uaccess.h:374: error: parse error before '*' token
/usr/include/asm/uaccess.h:375: error: parse error before '*' token
/usr/include/asm/uaccess.h:399: error: parse error before '*' token
/usr/include/asm/uaccess.h: In function `__copy_to_user':
/usr/include/asm/uaccess.h:401: error: `n' undeclared (first use in this function)
/usr/include/asm/uaccess.h:406: error: `to' undeclared (first use in this function)
/usr/include/asm/uaccess.h:406: error: `from' undeclared (first use in this function)
/usr/include/asm/uaccess.h: At top level:
/usr/include/asm/uaccess.h:437: error: parse error before '*' token
/usr/include/asm/uaccess.h: In function `__copy_from_user':
/usr/include/asm/uaccess.h:439: error: `n' undeclared (first use in this function)
/usr/include/asm/uaccess.h:444: error: `to' undeclared (first use in this function)
/usr/include/asm/uaccess.h:444: error: `from' undeclared (first use in this function)
/usr/include/asm/uaccess.h: At top level:
/usr/include/asm/uaccess.h:471: error: parse error before '*' token
/usr/include/asm/uaccess.h: In function `copy_to_user':
/usr/include/asm/uaccess.h:474: error: `to' undeclared (first use in this function)
/usr/include/asm/uaccess.h:474: error: `n' undeclared (first use in this function)
/usr/include/asm/uaccess.h:475: error: `from' undeclared (first use in this function)
/usr/include/asm/uaccess.h: At top level:
/usr/include/asm/uaccess.h:496: error: parse error before '*' token
/usr/include/asm/uaccess.h: In function `copy_from_user':
/usr/include/asm/uaccess.h:499: error: `from' undeclared (first use in this function)
/usr/include/asm/uaccess.h:499: error: `n' undeclared (first use in this function)
/usr/include/asm/uaccess.h:500: error: `to' undeclared (first use in this function)
/usr/include/asm/uaccess.h: At top level:
/usr/include/asm/uaccess.h:506: error: parse error before '*' token
/usr/include/asm/uaccess.h:507: error: parse error before '*' token
/usr/include/asm/uaccess.h:525: error: parse error before '*' token
/usr/include/asm/uaccess.h:526: error: parse error before '*' token
/usr/include/asm/uaccess.h:527: error: parse error before '*' token
zaptel.c:120: error: parse error before "config_must_be_included_before_module"
zaptel.c:120: warning: type defaults to `int' in declaration of `config_must_be_included_before_module'
zaptel.c:120: warning: data definition has no type or storage class
zaptel.c:121: error: parse error before "config_must_be_included_before_module"
zaptel.c:121: warning: type defaults to `int' in declaration of `config_must_be_included_before_module'
zaptel.c:121: warning: data definition has no type or storage class
zaptel.c:122: error: parse error before "config_must_be_included_before_module"
zaptel.c:122: warning: type defaults to `int' in declaration of `config_must_be_included_before_module'
zaptel.c:122: warning: data definition has no type or storage class
zaptel.c:123: error: parse error before "config_must_be_included_before_module"
zaptel.c:123: warning: type defaults to `int' in declaration of `config_must_be_included_before_module'
zaptel.c:123: warning: data definition has no type or storage class
zaptel.c:124: error: parse error before "config_must_be_included_before_module"
zaptel.c:124: warning: type defaults to `int' in declaration of `config_must_be_included_before_module'
zaptel.c:124: warning: data definition has no type or storage class
zaptel.c:125: error: parse error before "config_must_be_included_before_module"
zaptel.c:125: warning: type defaults to `int' in declaration of `config_must_be_included_before_module'
zaptel.c:125: warning: data definition has no type or storage class
zaptel.c:130: error: parse error before "config_must_be_included_before_module"
zaptel.c:130: warning: type defaults to `int' in declaration of `config_must_be_included_before_module'
zaptel.c:130: warning: data definition has no type or storage class
zaptel.c:131: error: parse error before "config_must_be_included_before_module"
zaptel.c:131: warning: type defaults to `int' in declaration of `config_must_be_included_before_module'
zaptel.c:131: warning: data definition has no type or storage class
zaptel.c:133: error: parse error before "config_must_be_included_before_module"
zaptel.c:133: warning: type defaults to `int' in declaration of `config_must_be_included_before_module'
zaptel.c:133: warning: data definition has no type or storage class
zaptel.c:134: error: parse error before "config_must_be_included_before_module"
zaptel.c:134: warning: type defaults to `int' in declaration of `config_must_be_included_before_module'
zaptel.c:134: warning: data definition has no type or storage class
zaptel.c:135: error: parse error before "config_must_be_included_before_module"
zaptel.c:135: warning: type defaults to `int' in declaration of `config_must_be_included_before_module'
zaptel.c:135: warning: data definition has no type or storage class
zaptel.c:136: error: parse error before "config_must_be_included_before_module"
zaptel.c:136: warning: type defaults to `int' in declaration of `config_must_be_included_before_module'
zaptel.c:136: warning: data definition has no type or storage class
zaptel.c:137: error: parse error before "config_must_be_included_before_module"
zaptel.c:137: warning: type defaults to `int' in declaration of `config_must_be_included_before_module'
zaptel.c:137: warning: data definition has no type or storage class
zaptel.c:138: error: parse error before "config_must_be_included_before_module"
zaptel.c:138: warning: type defaults to `int' in declaration of `config_must_be_included_before_module'
zaptel.c:138: warning: data definition has no type or storage class
zaptel.c:139: error: parse error before "config_must_be_included_before_module"
zaptel.c:139: warning: type defaults to `int' in declaration of `config_must_be_included_before_module'
zaptel.c:139: warning: data definition has no type or storage class
zaptel.c:140: error: parse error before "config_must_be_included_before_module"
zaptel.c:140: warning: type defaults to `int' in declaration of `config_must_be_included_before_module'
zaptel.c:140: warning: data definition has no type or storage class
zaptel.c:141: error: parse error before "config_must_be_included_before_module"
zaptel.c:141: warning: type defaults to `int' in declaration of `config_must_be_included_before_module'
zaptel.c:141: warning: data definition has no type or storage class
zaptel.c:142: error: parse error before "config_must_be_included_before_module"
zaptel.c:142: warning: type defaults to `int' in declaration of `config_must_be_included_before_module'
zaptel.c:142: warning: data definition has no type or storage class
zaptel.c:143: error: parse error before "config_must_be_included_before_module"
zaptel.c:143: warning: type defaults to `int' in declaration of `config_must_be_included_before_module'
zaptel.c:143: warning: data definition has no type or storage class
zaptel.c: In function `zt_qevent_lock':
zaptel.c:699: error: parse error before "unsigned"
zaptel.c: In function `zt_reallocbufs':
zaptel.c:795: error: parse error before "unsigned"
zaptel.c: In function `close_channel':
zaptel.c:991: error: parse error before "unsigned"
zaptel.c: In function `zt_chan_reg':
zaptel.c:1199: error: parse error before "unsigned"
zaptel.c: In function `zt_chan_unreg':
zaptel.c:1607: error: parse error before "unsigned"
zaptel.c: In function `zt_chan_read':
zaptel.c:1626: error: parse error before "unsigned"
zaptel.c:1632: error: parse error before "unsigned"
zaptel.c:1685: error: parse error before "unsigned"
zaptel.c: In function `zt_chan_write':
zaptel.c:1711: error: parse error before "unsigned"
zaptel.c:1715: error: parse error before "unsigned"
zaptel.c:1781: error: parse error before "unsigned"
zaptel.c: In function `initialize_channel':
zaptel.c:2125: error: parse error before "unsigned"
zaptel.c: In function `zt_timing_open':
zaptel.c:2151: error: parse error before "unsigned"
zaptel.c: In function `zt_timer_release':
zaptel.c:2176: error: parse error before "unsigned"
zaptel.c: In function `zt_alloc_pseudo':
zaptel.c:2263: error: parse error before "unsigned"
zaptel.c: In function `zt_free_pseudo':
zaptel.c:2273: error: parse error before "unsigned"
zaptel.c: In function `zt_timer_ioctl':
zaptel.c:2705: error: parse error before "unsigned"
zaptel.c:2713: error: parse error before "unsigned"
zaptel.c:2723: error: parse error before "unsigned"
zaptel.c:2730: error: parse error before "unsigned"
zaptel.c:2735: error: parse error before "unsigned"
zaptel.c: In function `zt_ctl_ioctl':
zaptel.c:3077: error: parse error before "unsigned"
zaptel.c:3131: error: parse error before "unsigned"
zaptel.c:3264: error: parse error before "unsigned"
zaptel.c:3277: error: parse error before "unsigned"
zaptel.c:3304: error: parse error before "unsigned"
zaptel.c:3368: error: parse error before "unsigned"
zaptel.c:3376: error: parse error before "unsigned"
zaptel.c:3386: error: parse error before "unsigned"
zaptel.c: In function `zt_chanandpseudo_ioctl':
zaptel.c:3423: error: parse error before "unsigned"
zaptel.c:3463: error: parse error before "unsigned"
zaptel.c:3542: error: parse error before "unsigned"
zaptel.c:3550: error: parse error before "unsigned"
zaptel.c:3592: error: parse error before "unsigned"
zaptel.c:3619: error: parse error before "unsigned"
zaptel.c:3627: error: parse error before "unsigned"
zaptel.c:3639: error: parse error before "unsigned"
zaptel.c:3647: error: parse error before "unsigned"
zaptel.c:3654: error: parse error before "unsigned"
zaptel.c:3696: error: parse error before "unsigned"
zaptel.c:3697: error: parse error before "unsigned"
zaptel.c:3727: error: parse error before "unsigned"
zaptel.c:3728: error: parse error before "unsigned"
zaptel.c:3747: error: parse error before "unsigned"
zaptel.c:3748: error: parse error before "unsigned"
zaptel.c:3798: error: parse error before "unsigned"
zaptel.c:3799: error: parse error before "unsigned"
zaptel.c: In function `zt_chan_ioctl':
zaptel.c:3951: error: parse error before "unsigned"
zaptel.c:3959: error: parse error before "unsigned"
zaptel.c:3970: error: parse error before "unsigned"
zaptel.c:4004: error: parse error before "unsigned"
zaptel.c:4122: error: parse error before "unsigned"
zaptel.c:4135: error: parse error before "unsigned"
zaptel.c:4149: error: parse error before "unsigned"
zaptel.c:4192: error: parse error before "unsigned"
zaptel.c:4198: error: parse error before "unsigned"
zaptel.c:4204: error: parse error before "unsigned"
zaptel.c:4208: error: parse error before "unsigned"
zaptel.c:4214: error: parse error before "unsigned"
zaptel.c:4224: error: parse error before "unsigned"
zaptel.c:4236: error: parse error before "unsigned"
zaptel.c:4240: error: parse error before "unsigned"
zaptel.c:4249: error: parse error before "unsigned"
zaptel.c:4253: error: parse error before "unsigned"
zaptel.c:4262: error: parse error before "unsigned"
zaptel.c: In function `zt_hooksig':
zaptel.c:5280: error: parse error before "unsigned"
zaptel.c: In function `zt_rbsbits':
zaptel.c:5336: error: parse error before "unsigned"
zaptel.c: In function `__zt_ec_chunk':
zaptel.c:5387: error: parse error before "unsigned"
zaptel.c: In function `process_timers':
zaptel.c:5942: error: parse error before "unsigned"
zaptel.c: In function `zt_timer_poll':
zaptel.c:5955: error: parse error before "unsigned"
zaptel.c: In function `zt_chan_poll':
zaptel.c:5987: error: parse error before "unsigned"
zaptel.c: In function `zt_transmit':
zaptel.c:6180: error: parse error before "unsigned"
zaptel.c: In function `zt_receive':
zaptel.c:6272: error: parse error before "unsigned"
zaptel.c:6294: error: parse error before "unsigned"
zaptel.c:6304: error: parse error before "unsigned"
zaptel.c:6330: error: parse error before "unsigned"
zaptel.c:6341: error: parse error before "unsigned"
zaptel.c:6344: error: parse error before "unsigned"
make: *** [zaptel.o] Error 1
peter:/usr/src/zaptel #