All pastes #262852 Raw Edit

ac97

public text v1 · immutable
#262852 ·published 2006-11-30 23:06 UTC
rendered paste body
circuit alsa-driver-0.9.6 # make
make[1]: Entering directory `/usr/src/soundmax/Linux/alsa-driver-0.9.6/support'
make[1]: Nothing to be done for `first_rule'.
make[1]: Leaving directory `/usr/src/soundmax/Linux/alsa-driver-0.9.6/support'
make[1]: Entering directory `/usr/src/soundmax/Linux/alsa-driver-0.9.6/acore'
gcc -D__KERNEL__ -DMODULE=1 -I/usr/src/soundmax/Linux/alsa-driver-0.9.6/include  -I/lib/modules/2.6.18-gentoo-r3/build/include -O2 -mpreferred-stack-boundary=2 -march=i686 -I/lib/modules/2.6.18-gentoo-r3/build/include/asm-i386/mach-default -D__SMP__ -DCONFIG_SMP -DLINUX -Wall -Wstrict-prototypes -fomit-frame-pointer -Wno-trigraphs -O2 -fno-strict-aliasing -fno-common -pipe -DALSA_BUILD   -DEXPORT_SYMTAB -c hwdep.c
In file included from /lib/modules/2.6.18-gentoo-r3/build/include/linux/rwsem.h:24,
                 from /lib/modules/2.6.18-gentoo-r3/build/include/asm/semaphore.h:42,
                 from /lib/modules/2.6.18-gentoo-r3/build/include/linux/sched.h:57,
                 from /lib/modules/2.6.18-gentoo-r3/build/include/linux/module.h:9,
                 from /usr/src/soundmax/Linux/alsa-driver-0.9.6/include/adriver.h:51,
                 from /usr/src/soundmax/Linux/alsa-driver-0.9.6/include/sound/driver.h:42,
                 from hwdep.c:22:
/lib/modules/2.6.18-gentoo-r3/build/include/asm/rwsem.h: In function '__down_read':
/lib/modules/2.6.18-gentoo-r3/build/include/asm/rwsem.h:104: error: expected ':' or ')' before 'KBUILD_BASENAME'
/lib/modules/2.6.18-gentoo-r3/build/include/asm/rwsem.h: In function '__down_write_nested':
/lib/modules/2.6.18-gentoo-r3/build/include/asm/rwsem.h:156: error: expected ':' or ')' before 'KBUILD_BASENAME'
/lib/modules/2.6.18-gentoo-r3/build/include/asm/rwsem.h: In function '__up_read':
/lib/modules/2.6.18-gentoo-r3/build/include/asm/rwsem.h:198: error: expected ':' or ')' before 'KBUILD_BASENAME'
/lib/modules/2.6.18-gentoo-r3/build/include/asm/rwsem.h:192: warning: unused variable 'tmp'
/lib/modules/2.6.18-gentoo-r3/build/include/asm/rwsem.h: In function '__up_write':
/lib/modules/2.6.18-gentoo-r3/build/include/asm/rwsem.h:224: error: expected ':' or ')' before 'KBUILD_BASENAME'
/lib/modules/2.6.18-gentoo-r3/build/include/asm/rwsem.h: In function '__downgrade_write':
/lib/modules/2.6.18-gentoo-r3/build/include/asm/rwsem.h:249: error: expected ':' or ')' before 'KBUILD_BASENAME'
In file included from /lib/modules/2.6.18-gentoo-r3/build/include/linux/sched.h:57,
                 from /lib/modules/2.6.18-gentoo-r3/build/include/linux/module.h:9,
                 from /usr/src/soundmax/Linux/alsa-driver-0.9.6/include/adriver.h:51,
                 from /usr/src/soundmax/Linux/alsa-driver-0.9.6/include/sound/driver.h:42,
                 from hwdep.c:22:
/lib/modules/2.6.18-gentoo-r3/build/include/asm/semaphore.h: In function 'down':
/lib/modules/2.6.18-gentoo-r3/build/include/asm/semaphore.h:105: error: expected ':' or ')' before 'KBUILD_BASENAME'
/lib/modules/2.6.18-gentoo-r3/build/include/asm/semaphore.h: In function 'down_interruptible':
/lib/modules/2.6.18-gentoo-r3/build/include/asm/semaphore.h:130: error: expected ':' or ')' before 'KBUILD_BASENAME'
/lib/modules/2.6.18-gentoo-r3/build/include/asm/semaphore.h: In function 'down_trylock':
/lib/modules/2.6.18-gentoo-r3/build/include/asm/semaphore.h:155: error: expected ':' or ')' before 'KBUILD_BASENAME'
/lib/modules/2.6.18-gentoo-r3/build/include/asm/semaphore.h: In function 'up':
/lib/modules/2.6.18-gentoo-r3/build/include/asm/semaphore.h:179: error: expected ':' or ')' before 'KBUILD_BASENAME'
hwdep.c: In function 'snd_hwdep_info':
hwdep.c:172: warning: pointer targets in passing argument 1 of 'snd_compat_strlcpy' differ in signedness
hwdep.c:173: warning: pointer targets in passing argument 1 of 'snd_compat_strlcpy' differ in signedness
hwdep.c: In function 'snd_hwdep_dsp_load':
hwdep.c:209: warning: implicit declaration of function 'verify_area'
make[1]: *** [hwdep.o] Error 1
make[1]: Leaving directory `/usr/src/soundmax/Linux/alsa-driver-0.9.6/acore'
make: *** [compile] Error 1
circuit alsa-driver-0.9.6 #