make[1]: Entering dir-b1/Module/rtmp.h:1598: error: syntax error before "pAdapter"
/home/niko/wlan/rt61-1.1.0-b1/Module/rtmp.h:1598: warning: function declaration isn't a prototype
/home/niko/wlan/rt61-1.1.0-b1/Module/rtmp.h:1606: error: syntax error before "pAdapter"
/home/niko/wlan/rt61-1.1.0-b1/Module/rtmp.h:1606: warning: function declaration isn't a prototype
/home/niko/wlan/rt61-1.1.0-b1/Module/rtmp.h:1609: error: syntax error before "pAdapter"
/home/niko/wlan/rt61-1.1.0-b1/Module/rtmp.h:1609: warning: function declaration isn't a prototype
/home/niko/wlan/rt61-1.1.0-b1/Module/rtmp.h:1612: error: syntax error before "pAd"
/home/niko/wlan/rt61-1.1.0-b1/Module/rtmp.h:1612: warning: function declaration isn't a prototype
/home/niko/wlan/rt61-1.1.0-b1/Module/rtmp.h:1615: error: syntax error before "pAd"
/home/niko/wlan/rt61-1.1.0-b1/Module/rtmp.h:1615: warning: function declaration isn't a prototype
/home/niko/wlan/rt61-1.1.0-b1/Module/rtmp.h:1618: error: syntax error before "pAdapter"
/home/niko/wlan/rt61-1.1.0-b1/Module/rtmp.h:1618: warning: function declaration isn't a prototype
/home/niko/wlan/rt61-1.1.0-b1/Module/rtmp.h:1621: error: syntax error before "pAdapter"
/home/niko/wlan/rt61-1.1.0-b1/Module/rtmp.h:1621: warning: function declaration isn't a prototype
/home/niko/wlan/rt61-1.1.0-b1/Module/rtmp.h:1624: error: syntax error before "pAdapter"
/home/niko/wlan/rt61-1.1.0-b1/Module/rtmp.h:1624: warning: function declaration isn't a prototype
/home/niko/wlan/rt61-1.1.0-b1/Module/rtmp.h:1627: error: syntax error before "pAd"
/home/niko/wlan/rt61-1.1.0-b1/Module/rtmp.h:1627: warning: function declaration isn't a prototype
/home/niko/wlan/rt61-1.1.0-b1/Module/rtmp.h:1630: error: syntax error before "pAdapter"
/home/niko/wlan/rt61-1.1.0-b1/Module/rtmp.h:1630: warning: function declaration isn't a prototype
/home/niko/wlan/rt61-1.1.0-b1/Module/rtmp.h:1633: error: syntax error before "pAdapter"
/home/niko/wlan/rt61-1.1.0-b1/Module/rtmp.h:1633: warning: function declaration isn't a prototype
/home/niko/wlan/rt61-1.1.0-b1/Module/rtmp.h:1645: error: syntax error before "pAd"
/home/niko/wlan/rt61-1.1.0-b1/Module/rtmp.h:1645: warning: function declaration isn't a prototype
/home/niko/wlan/rt61-1.1.0-b1/Module/rtmp.h:1648: error: syntax error before "pAd"
/home/niko/wlan/rt61-1.1.0-b1/Module/rtmp.h:1648: warning: function declaration isn't a prototype
/home/niko/wlan/rt61-1.1.0-b1/Module/rtmp.h:1651: error: syntax error before "pAdapter"
/home/niko/wlan/rt61-1.1.0-b1/Module/rtmp.h:1652: warning: function declaration isn't a prototype
/home/niko/wlan/rt61-1.1.0-b1/Module/rtmp.h:1655: error: syntax error before "pAd"
/home/niko/wlan/rt61-1.1.0-b1/Module/rtmp.h:1655: warning: function declaration isn't a prototype
/home/niko/wlan/rt61-1.1.0-b1/Module/rtmp.h:1670: error: syntax error before "pAd"
/home/niko/wlan/rt61-1.1.0-b1/Module/rtmp.h:1671: warning: function declaration isn't a prototype
/home/niko/wlan/rt61-1.1.0-b1/Module/rtmp.h:1674: error: syntax error before "pAd"
/home/niko/wlan/rt61-1.1.0-b1/Module/rtmp.h:1675: warning: function declaration isn't a prototype
/home/niko/wlan/rt61-1.1.0-b1/Module/rtmp.h:1683: error: syntax error before "pAd"
/home/niko/wlan/rt61-1.1.0-b1/Module/rtmp.h:1684: warning: function declaration isn't a prototype
/home/niko/wlan/rt61-1.1.0-b1/Module/rtmp.h:1687: error: syntax error before "pAd"
/home/niko/wlan/rt61-1.1.0-b1/Module/rtmp.h:1688: warning: function declaration isn't a prototype
/home/niko/wlan/rt61-1.1.0-b1/Module/rtmp.h:1691: error: syntax error before "pAd"
/home/niko/wlan/rt61-1.1.0-b1/Module/rtmp.h:1692: warning: function declaration isn't a prototype
/home/niko/wlan/rt61-1.1.0-b1/Module/rtmp.h:1695: error: syntax error before "pAd"
/home/niko/wlan/rt61-1.1.0-b1/Module/rtmp.h:1696: warning: function declaration isn't a prototype
/home/niko/wlan/rt61-1.1.0-b1/Module/rtmp.h:1702: error: syntax error before "pAd"
/home/niko/wlan/rt61-1.1.0-b1/Module/rtmp.h:1702: warning: function declaration isn't a prototype
/home/niko/wlan/rt61-1.1.0-b1/Module/rtmp.h:1705: error: syntax error before "pAd"
/home/niko/wlan/rt61-1.1.0-b1/Module/rtmp.h:1706: warning: function declaration isn't a prototype
/home/niko/wlan/rt61-1.1.0-b1/Module/rtmp.h:1709: error: syntax error before "pAd"
/home/niko/wlan/rt61-1.1.0-b1/Module/rtmp.h:1709: warning: function declaration isn't a prototype
/home/niko/wlan/rt61-1.1.0-b1/Module/rtmp.h:1712: error: syntax error before "pAd"
/home/niko/wlan/rt61-1.1.0-b1/Module/rtmp.h:1712: warning: function declaration isn't a prototype
/home/niko/wlan/rt61-1.1.0-b1/Module/rtmp.h:1715: error: syntax error before "pAd"
/home/niko/wlan/rt61-1.1.0-b1/Module/rtmp.h:1716: warning: function declaration isn't a prototype
/home/niko/wlan/rt61-1.1.0-b1/Module/rtmp.h:1719: error: syntax error before "pAd"
/home/niko/wlan/rt61-1.1.0-b1/Module/rtmp.h:1719: warning: function declaration isn't a prototype
/home/niko/wlan/rt61-1.1.0-b1/Module/rtmp.h:1722: error: syntax error before "pAd"
/home/niko/wlan/rt61-1.1.0-b1/Module/rtmp.h:1722: warning: function declaration isn't a prototype
/home/niko/wlan/rt61-1.1.0-b1/Module/rtmp.h:1725: error: syntax error before "pAd"
/home/niko/wlan/rt61-1.1.0-b1/Module/rtmp.h:1725: warning: function declaration isn't a prototype
/home/niko/wlan/rt61-1.1.0-b1/Module/rtmp.h:1728: error: syntax error before "pAd"
/home/niko/wlan/rt61-1.1.0-b1/Module/rtmp.h:1729: warning: function declaration isn't a prototype
/home/niko/wlan/rt61-1.1.0-b1/Module/rtmp.h:1732: error: syntax error before "pAd"
/home/niko/wlan/rt61-1.1.0-b1/Module/rtmp.h:1733: warning: function declaration isn't a prototype
/home/niko/wlan/rt61-1.1.0-b1/Module/rtmp.h:1736: error: syntax error before "pAd"
/home/niko/wlan/rt61-1.1.0-b1/Module/rtmp.h:1736: warning: function declaration isn't a prototype
/home/niko/wlan/rt61-1.1.0-b1/Module/rtmp.h:1739: error: syntax error before "pAd"
/home/niko/wlan/rt61-1.1.0-b1/Module/rtmp.h:1745: warning: function declaration isn't a prototype
/home/niko/wlan/rt61-1.1.0-b1/Module/rtmp.h:1748: error: syntax error before "pAd"
/home/niko/wlan/rt61-1.1.0-b1/Module/rtmp.h:1750: warning: function declaration isn't a prototype
/home/niko/wlan/rt61-1.1.0-b1/Module/rtmp.h:1753: error: syntax error before "pAd"
/home/niko/wlan/rt61-1.1.0-b1/Module/rtmp.h:1759: warning: function declaration isn't a prototype
/home/niko/wlan/rt61-1.1.0-b1/Module/rtmp.h:1762: error: syntax error before "pAd"
/home/niko/wlan/rt61-1.1.0-b1/Module/rtmp.h:1763: warning: function declaration isn't a prototype
/home/niko/wlan/rt61-1.1.0-b1/Module/rtmp.h:1766: error: syntax error before "pAd"
/home/niko/wlan/rt61-1.1.0-b1/Module/rtmp.h:1770: warning: function declaration isn't a prototype
/home/niko/wlan/rt61-1.1.0-b1/Module/rtmp.h:1773: error: syntax error before "pAd"
/home/niko/wlan/rt61-1.1.0-b1/Module/rtmp.h:1775: warning: function declaration isn't a prototype
/home/niko/wlan/rt61-1.1.0-b1/Module/rtmp.h:1778: error: syntax error before "pAd"
/home/niko/wlan/rt61-1.1.0-b1/Module/rtmp.h:1780: warning: function declaration isn't a prototype
/home/niko/wlan/rt61-1.1.0-b1/Module/rtmp.h:1783: error: syntax error before "pAd"
/home/niko/wlan/rt61-1.1.0-b1/Module/rtmp.h:1783: warning: function declaration isn't a prototype
/home/niko/wlan/rt61-1.1.0-b1/Module/rtmp.h:1792: error: syntax error before "pAd"
/home/niko/wlan/rt61-1.1.0-b1/Module/rtmp.h:1792: warning: function declaration isn't a prototype
/home/niko/wlan/rt61-1.1.0-b1/Module/rtmp.h:1795: error: syntax error before "pAd"
/home/niko/wlan/rt61-1.1.0-b1/Module/rtmp.h:1795: warning: function declaration isn't a prototype
/home/niko/wlan/rt61-1.1.0-b1/Module/rtmp.h:1798: error: syntax error before "pAd"
/home/niko/wlan/rt61-1.1.0-b1/Module/rtmp.h:1799: warning: function declaration isn't a prototype
/home/niko/wlan/rt61-1.1.0-b1/Module/rtmp.h:1802: error: syntax error before "pAd"
/home/niko/wlan/rt61-1.1.0-b1/Module/rtmp.h:1804: warning: function declaration isn't a prototype
/home/niko/wlan/rt61-1.1.0-b1/Module/rtmp.h:1834: error: syntax error before "pAd"
/home/niko/wlan/rt61-1.1.0-b1/Module/rtmp.h:1856: warning: function declaration isn't a prototype
/home/niko/wlan/rt61-1.1.0-b1/Module/rtmp.h:1859: error: syntax error before "pAd"
/home/niko/wlan/rt61-1.1.0-b1/Module/rtmp.h:1881: warning: function declaration isn't a prototype
/home/niko/wlan/rt61-1.1.0-b1/Module/rtmp.h:1884: error: syntax error before "pAd"
/home/niko/wlan/rt61-1.1.0-b1/Module/rtmp.h:1887: warning: function declaration isn't a prototype
/home/niko/wlan/rt61-1.1.0-b1/Module/rtmp.h:1896: error: syntax error before "pAd"
/home/niko/wlan/rt61-1.1.0-b1/Module/rtmp.h:1897: warning: function declaration isn't a prototype
/home/niko/wlan/rt61-1.1.0-b1/Module/rtmp.h:1900: error: syntax error before "pAd"
/home/niko/wlan/rt61-1.1.0-b1/Module/rtmp.h:1905: warning: function declaration isn't a prototype
/home/niko/wlan/rt61-1.1.0-b1/Module/rtmp.h:1915: error: syntax error before "pAd"
/home/niko/wlan/rt61-1.1.0-b1/Module/rtmp.h:1919: warning: function declaration isn't a prototype
/home/niko/wlan/rt61-1.1.0-b1/Module/rtmp.h:1922: error: syntax error before "pAd"
/home/niko/wlan/rt61-1.1.0-b1/Module/rtmp.h:1928: warning: function declaration isn't a prototype
/home/niko/wlan/rt61-1.1.0-b1/Module/rtmp.h:1935: error: syntax error before "pAd"
/home/niko/wlan/rt61-1.1.0-b1/Module/rtmp.h:1935: warning: function declaration isn't a prototype
/home/niko/wlan/rt61-1.1.0-b1/Module/rtmp.h:1947: error: syntax error before "pAd"
/home/niko/wlan/rt61-1.1.0-b1/Module/rtmp.h:1950: warning: function declaration isn't a prototype
/home/niko/wlan/rt61-1.1.0-b1/Module/rtmp.h:1968: error: syntax error before "pAd"
/home/niko/wlan/rt61-1.1.0-b1/Module/rtmp.h:1970: warning: function declaration isn't a prototype
/home/niko/wlan/rt61-1.1.0-b1/Module/rtmp.h:1973: error: syntax error before "pAd"
/home/niko/wlan/rt61-1.1.0-b1/Module/rtmp.h:1974: warning: function declaration isn't a prototype
/home/niko/wlan/rt61-1.1.0-b1/Module/rtmp.h:1977: error: syntax error before "pAd"
/home/niko/wlan/rt61-1.1.0-b1/Module/rtmp.h:1978: warning: function declaration isn't a prototype
/home/niko/wlan/rt61-1.1.0-b1/Module/rtmp.h:1981: error: syntax error before "pAd"
/home/niko/wlan/rt61-1.1.0-b1/Module/rtmp.h:1981: warning: function declaration isn't a prototype
/home/niko/wlan/rt61-1.1.0-b1/Module/rtmp.h:1984: error: syntax error before "pAd"
/home/niko/wlan/rt61-1.1.0-b1/Module/rtmp.h:1984: warning: function declaration isn't a prototype
/home/niko/wlan/rt61-1.1.0-b1/Module/rtmp.h:1987: error: syntax error before "pAd"
/home/niko/wlan/rt61-1.1.0-b1/Module/rtmp.h:1987: warning: function declaration isn't a prototype
/home/niko/wlan/rt61-1.1.0-b1/Module/rtmp.h:1990: error: syntax error before "pAd"
/home/niko/wlan/rt61-1.1.0-b1/Module/rtmp.h:1990: warning: function declaration isn't a prototype
/home/niko/wlan/rt61-1.1.0-b1/Module/rtmp.h:1996: error: syntax error before "pAd"
/home/niko/wlan/rt61-1.1.0-b1/Module/rtmp.h:1996: warning: function declaration isn't a prototype
/home/niko/wlan/rt61-1.1.0-b1/Module/rtmp.h:2002: error: syntax error before "pAd"
/home/niko/wlan/rt61-1.1.0-b1/Module/rtmp.h:2002: warning: function declaration isn't a prototype
/home/niko/wlan/rt61-1.1.0-b1/Module/rtmp.h:2005: error: syntax error before "pAd"
/home/niko/wlan/rt61-1.1.0-b1/Module/rtmp.h:2005: warning: function declaration isn't a prototype
/home/niko/wlan/rt61-1.1.0-b1/Module/rtmp.h:2008: error: syntax error before "pAd"
/home/niko/wlan/rt61-1.1.0-b1/Module/rtmp.h:2008: warning: function declaration isn't a prototype
/home/niko/wlan/rt61-1.1.0-b1/Module/rtmp.h:2015: error: syntax error before "pAd"
/home/niko/wlan/rt61-1.1.0-b1/Module/rtmp.h:2016: warning: function declaration isn't a prototype
/home/niko/wlan/rt61-1.1.0-b1/Module/rtmp.h:2019: error: syntax error before "pAd"
/home/niko/wlan/rt61-1.1.0-b1/Module/rtmp.h:2020: warning: function declaration isn't a prototype
/home/niko/wlan/rt61-1.1.0-b1/Module/rtmp.h:2023: error: syntax error before "pAd"
/home/niko/wlan/rt61-1.1.0-b1/Module/rtmp.h:2024: warning: function declaration isn't a prototype
/home/niko/wlan/rt61-1.1.0-b1/Module/rtmp.h:2027: error: syntax error before "pAd"
/home/niko/wlan/rt61-1.1.0-b1/Module/rtmp.h:2027: warning: function declaration isn't a prototype
/home/niko/wlan/rt61-1.1.0-b1/Module/rtmp.h:2030: error: syntax error before "pAd"
/home/niko/wlan/rt61-1.1.0-b1/Module/rtmp.h:2031: warning: function declaration isn't a prototype
/home/niko/wlan/rt61-1.1.0-b1/Module/rtmp.h:2034: error: syntax error before "pAd"
/home/niko/wlan/rt61-1.1.0-b1/Module/rtmp.h:2035: warning: function declaration isn't a prototype
/home/niko/wlan/rt61-1.1.0-b1/Module/rtmp.h:2038: error: syntax error before "pAd"
/home/niko/wlan/rt61-1.1.0-b1/Module/rtmp.h:2039: warning: function declaration isn't a prototype
/home/niko/wlan/rt61-1.1.0-b1/Module/rtmp.h:2042: error: syntax error before "pAd"
/home/niko/wlan/rt61-1.1.0-b1/Module/rtmp.h:2043: warning: function declaration isn't a prototype
/home/niko/wlan/rt61-1.1.0-b1/Module/rtmp.h:2046: error: syntax error before "pAd"
/home/niko/wlan/rt61-1.1.0-b1/Module/rtmp.h:2046: warning: function declaration isn't a prototype
/home/niko/wlan/rt61-1.1.0-b1/Module/rtmp.h:2049: error: syntax error before "pAd"
/home/niko/wlan/rt61-1.1.0-b1/Module/rtmp.h:2049: warning: function declaration isn't a prototype
/home/niko/wlan/rt61-1.1.0-b1/Module/rtmp.h:2052: error: syntax error before "pAd"
/home/niko/wlan/rt61-1.1.0-b1/Module/rtmp.h:2054: warning: function declaration isn't a prototype
/home/niko/wlan/rt61-1.1.0-b1/Module/rtmp.h:2066: error: syntax error before "pAd"
/home/niko/wlan/rt61-1.1.0-b1/Module/rtmp.h:2067: warning: function declaration isn't a prototype
/home/niko/wlan/rt61-1.1.0-b1/Module/rtmp.h:2070: error: syntax error before "pAd"
/home/niko/wlan/rt61-1.1.0-b1/Module/rtmp.h:2071: warning: function declaration isn't a prototype
/home/niko/wlan/rt61-1.1.0-b1/Module/rtmp.h:2074: error: syntax error before "pAd"
/home/niko/wlan/rt61-1.1.0-b1/Module/rtmp.h:2075: warning: function declaration isn't a prototype
/home/niko/wlan/rt61-1.1.0-b1/Module/rtmp.h:2078: error: syntax error before "pAd"
/home/niko/wlan/rt61-1.1.0-b1/Module/rtmp.h:2079: warning: function declaration isn't a prototype
/home/niko/wlan/rt61-1.1.0-b1/Module/rtmp.h:2082: error: syntax error before "pAd"
/home/niko/wlan/rt61-1.1.0-b1/Module/rtmp.h:2083: warning: function declaration isn't a prototype
/home/niko/wlan/rt61-1.1.0-b1/Module/rtmp.h:2086: error: syntax error before "pAd"
/home/niko/wlan/rt61-1.1.0-b1/Module/rtmp.h:2094: warning: function declaration isn't a prototype
/home/niko/wlan/rt61-1.1.0-b1/Module/rtmp.h:2097: error: syntax error before "pAd"
/home/niko/wlan/rt61-1.1.0-b1/Module/rtmp.h:2098: warning: function declaration isn't a prototype
/home/niko/wlan/rt61-1.1.0-b1/Module/rtmp.h:2101: error: syntax error before "pAd"
/home/niko/wlan/rt61-1.1.0-b1/Module/rtmp.h:2102: warning: function declaration isn't a prototype
/home/niko/wlan/rt61-1.1.0-b1/Module/rtmp.h:2105: error: syntax error before "pAd"
/home/niko/wlan/rt61-1.1.0-b1/Module/rtmp.h:2106: warning: function declaration isn't a prototype
/home/niko/wlan/rt61-1.1.0-b1/Module/rtmp.h:2109: error: syntax error before "pAd"
/home/niko/wlan/rt61-1.1.0-b1/Module/rtmp.h:2110: warning: function declaration isn't a prototype
/home/niko/wlan/rt61-1.1.0-b1/Module/rtmp.h:2113: error: syntax error before "pAd"
/home/niko/wlan/rt61-1.1.0-b1/Module/rtmp.h:2114: warning: function declaration isn't a prototype
/home/niko/wlan/rt61-1.1.0-b1/Module/rtmp.h:2117: error: syntax error before "pAd"
/home/niko/wlan/rt61-1.1.0-b1/Module/rtmp.h:2118: warning: function declaration isn't a prototype
/home/niko/wlan/rt61-1.1.0-b1/Module/rtmp.h:2121: error: syntax error before "pAd"
/home/niko/wlan/rt61-1.1.0-b1/Module/rtmp.h:2122: warning: function declaration isn't a prototype
/home/niko/wlan/rt61-1.1.0-b1/Module/rtmp.h:2125: error: syntax error before "pAd"
/home/niko/wlan/rt61-1.1.0-b1/Module/rtmp.h:2126: warning: function declaration isn't a prototype
/home/niko/wlan/rt61-1.1.0-b1/Module/rtmp.h:2129: error: syntax error before "pAd"
/home/niko/wlan/rt61-1.1.0-b1/Module/rtmp.h:2131: warning: function declaration isn't a prototype
/home/niko/wlan/rt61-1.1.0-b1/Module/rtmp.h:2137: error: syntax error before "pAd"
/home/niko/wlan/rt61-1.1.0-b1/Module/rtmp.h:2138: warning: function declaration isn't a prototype
/home/niko/wlan/rt61-1.1.0-b1/Module/rtmp.h:2141: error: syntax error before "pAd"
/home/niko/wlan/rt61-1.1.0-b1/Module/rtmp.h:2142: warning: function declaration isn't a prototype
/home/niko/wlan/rt61-1.1.0-b1/Module/rtmp.h:2145: error: syntax error before "pAd"
/home/niko/wlan/rt61-1.1.0-b1/Module/rtmp.h:2146: warning: function declaration isn't a prototype
/home/niko/wlan/rt61-1.1.0-b1/Module/rtmp.h:2149: error: syntax error before "pAd"
/home/niko/wlan/rt61-1.1.0-b1/Module/rtmp.h:2150: warning: function declaration isn't a prototype
/home/niko/wlan/rt61-1.1.0-b1/Module/rtmp.h:2153: error: syntax error before "pAd"
/home/niko/wlan/rt61-1.1.0-b1/Module/rtmp.h:2154: warning: function declaration isn't a prototype
/home/niko/wlan/rt61-1.1.0-b1/Module/rtmp.h:2157: error: syntax error before "pAd"
/home/niko/wlan/rt61-1.1.0-b1/Module/rtmp.h:2158: warning: function declaration isn't a prototype
/home/niko/wlan/rt61-1.1.0-b1/Module/rtmp.h:2161: error: syntax error before "pAd"
/home/niko/wlan/rt61-1.1.0-b1/Module/rtmp.h:2162: warning: function declaration isn't a prototype
/home/niko/wlan/rt61-1.1.0-b1/Module/rtmp.h:2165: error: syntax error before "pAd"
/home/niko/wlan/rt61-1.1.0-b1/Module/rtmp.h:2167: warning: function declaration isn't a prototype
/home/niko/wlan/rt61-1.1.0-b1/Module/rtmp.h:2170: error: syntax error before "pAd"
/home/niko/wlan/rt61-1.1.0-b1/Module/rtmp.h:2175: warning: function declaration isn't a prototype
/home/niko/wlan/rt61-1.1.0-b1/Module/rtmp.h:2178: error: syntax error before "pAd"
/home/niko/wlan/rt61-1.1.0-b1/Module/rtmp.h:2179: warning: function declaration isn't a prototype
/home/niko/wlan/rt61-1.1.0-b1/Module/rtmp.h:2182: error: syntax error before "pAd"
/home/niko/wlan/rt61-1.1.0-b1/Module/rtmp.h:2184: warning: function declaration isn't a prototype
/home/niko/wlan/rt61-1.1.0-b1/Module/rtmp.h:2187: error: syntax error before "pAd"
/home/niko/wlan/rt61-1.1.0-b1/Module/rtmp.h:2189: warning: function declaration isn't a prototype
/home/niko/wlan/rt61-1.1.0-b1/Module/rtmp.h:2192: error: syntax error before "pAd"
/home/niko/wlan/rt61-1.1.0-b1/Module/rtmp.h:2193: warning: function declaration isn't a prototype
/home/niko/wlan/rt61-1.1.0-b1/Module/rtmp.h:2196: error: syntax error before "pAd"
/home/niko/wlan/rt61-1.1.0-b1/Module/rtmp.h:2197: warning: function declaration isn't a prototype
/home/niko/wlan/rt61-1.1.0-b1/Module/rtmp.h:2200: error: syntax error before "pAd"
/home/niko/wlan/rt61-1.1.0-b1/Module/rtmp.h:2201: warning: function declaration isn't a prototype
/home/niko/wlan/rt61-1.1.0-b1/Module/rtmp.h:2204: error: syntax error before "pAd"
/home/niko/wlan/rt61-1.1.0-b1/Module/rtmp.h:2205: warning: function declaration isn't a prototype
/home/niko/wlan/rt61-1.1.0-b1/Module/rtmp.h:2208: error: syntax error before "pAd"
/home/niko/wlan/rt61-1.1.0-b1/Module/rtmp.h:2209: warning: function declaration isn't a prototype
/home/niko/wlan/rt61-1.1.0-b1/Module/rtmp.h:2212: error: syntax error before "pAd"
/home/niko/wlan/rt61-1.1.0-b1/Module/rtmp.h:2213: warning: function declaration isn't a prototype
/home/niko/wlan/rt61-1.1.0-b1/Module/rtmp.h:2216: error: syntax error before "pAd"
/home/niko/wlan/rt61-1.1.0-b1/Module/rtmp.h:2217: warning: function declaration isn't a prototype
/home/niko/wlan/rt61-1.1.0-b1/Module/rtmp.h:2220: error: syntax error before "pAd"
/home/niko/wlan/rt61-1.1.0-b1/Module/rtmp.h:2221: warning: function declaration isn't a prototype
/home/niko/wlan/rt61-1.1.0-b1/Module/rtmp.h:2224: error: syntax error before "pAd"
/home/niko/wlan/rt61-1.1.0-b1/Module/rtmp.h:2225: warning: function declaration isn't a prototype
/home/niko/wlan/rt61-1.1.0-b1/Module/rtmp.h:2228: error: syntax error before "pAd"
/home/niko/wlan/rt61-1.1.0-b1/Module/rtmp.h:2229: warning: function declaration isn't a prototype
/home/niko/wlan/rt61-1.1.0-b1/Module/rtmp.h:2232: error: syntax error before "pAd"
/home/niko/wlan/rt61-1.1.0-b1/Module/rtmp.h:2233: warning: function declaration isn't a prototype
/home/niko/wlan/rt61-1.1.0-b1/Module/rtmp.h:2236: error: syntax error before "pAd"
/home/niko/wlan/rt61-1.1.0-b1/Module/rtmp.h:2237: warning: function declaration isn't a prototype
/home/niko/wlan/rt61-1.1.0-b1/Module/rtmp.h:2240: error: syntax error before "pAd"
/home/niko/wlan/rt61-1.1.0-b1/Module/rtmp.h:2241: warning: function declaration isn't a prototype
/home/niko/wlan/rt61-1.1.0-b1/Module/rtmp.h:2244: error: syntax error before "pAd"
/home/niko/wlan/rt61-1.1.0-b1/Module/rtmp.h:2245: warning: function declaration isn't a prototype
/home/niko/wlan/rt61-1.1.0-b1/Module/rtmp.h:2248: error: syntax error before "pAd"
/home/niko/wlan/rt61-1.1.0-b1/Module/rtmp.h:2248: warning: function declaration isn't a prototype
/home/niko/wlan/rt61-1.1.0-b1/Module/rtmp.h:2251: error: syntax error before "pAd"
/home/niko/wlan/rt61-1.1.0-b1/Module/rtmp.h:2251: warning: function declaration isn't a prototype
/home/niko/wlan/rt61-1.1.0-b1/Module/rtmp.h:2254: error: syntax error before "pAd"
/home/niko/wlan/rt61-1.1.0-b1/Module/rtmp.h:2256: warning: function declaration isn't a prototype
/home/niko/wlan/rt61-1.1.0-b1/Module/rtmp.h:2259: error: syntax error before "pAd"
/home/niko/wlan/rt61-1.1.0-b1/Module/rtmp.h:2264: warning: function declaration isn't a prototype
/home/niko/wlan/rt61-1.1.0-b1/Module/rtmp.h:2267: error: syntax error before "pAd"
/home/niko/wlan/rt61-1.1.0-b1/Module/rtmp.h:2272: warning: function declaration isn't a prototype
/home/niko/wlan/rt61-1.1.0-b1/Module/rtmp.h:2275: error: syntax error before "pAd"
/home/niko/wlan/rt61-1.1.0-b1/Module/rtmp.h:2278: warning: function declaration isn't a prototype
/home/niko/wlan/rt61-1.1.0-b1/Module/rtmp.h:2281: error: syntax error before "pAd"
/home/niko/wlan/rt61-1.1.0-b1/Module/rtmp.h:2284: warning: function declaration isn't a prototype
/home/niko/wlan/rt61-1.1.0-b1/Module/rtmp.h:2287: error: syntax error before "pAd"
/home/niko/wlan/rt61-1.1.0-b1/Module/rtmp.h:2290: warning: function declaration isn't a prototype
/home/niko/wlan/rt61-1.1.0-b1/Module/rtmp.h:2293: error: syntax error before "pAd"
/home/niko/wlan/rt61-1.1.0-b1/Module/rtmp.h:2293: warning: function declaration isn't a prototype
/home/niko/wlan/rt61-1.1.0-b1/Module/rtmp.h:2296: error: syntax error before "pAd"
/home/niko/wlan/rt61-1.1.0-b1/Module/rtmp.h:2296: warning: function declaration isn't a prototype
/home/niko/wlan/rt61-1.1.0-b1/Module/rtmp.h:2299: error: syntax error before "pAd"
/home/niko/wlan/rt61-1.1.0-b1/Module/rtmp.h:2299: warning: function declaration isn't a prototype
/home/niko/wlan/rt61-1.1.0-b1/Module/rtmp.h:2305: error: syntax error before "pAd"
/home/niko/wlan/rt61-1.1.0-b1/Module/rtmp.h:2307: warning: function declaration isn't a prototype
/home/niko/wlan/rt61-1.1.0-b1/Module/rtmp.h:2316: error: syntax error before "pAd"
/home/niko/wlan/rt61-1.1.0-b1/Module/rtmp.h:2317: warning: function declaration isn't a prototype
/home/niko/wlan/rt61-1.1.0-b1/Module/rtmp.h:2320: error: syntax error before "pAd"
/home/niko/wlan/rt61-1.1.0-b1/Module/rtmp.h:2321: warning: function declaration isn't a prototype
/home/niko/wlan/rt61-1.1.0-b1/Module/rtmp.h:2324: error: syntax error before "pAd"
/home/niko/wlan/rt61-1.1.0-b1/Module/rtmp.h:2325: warning: function declaration isn't a prototype
/home/niko/wlan/rt61-1.1.0-b1/Module/rtmp.h:2328: error: syntax error before "pAd"
/home/niko/wlan/rt61-1.1.0-b1/Module/rtmp.h:2329: warning: function declaration isn't a prototype
/home/niko/wlan/rt61-1.1.0-b1/Module/rtmp.h:2332: error: syntax error before "pAd"
/home/niko/wlan/rt61-1.1.0-b1/Module/rtmp.h:2333: warning: function declaration isn't a prototype
/home/niko/wlan/rt61-1.1.0-b1/Module/rtmp.h:2336: error: syntax error before "pAd"
/home/niko/wlan/rt61-1.1.0-b1/Module/rtmp.h:2337: warning: function declaration isn't a prototype
/home/niko/wlan/rt61-1.1.0-b1/Module/rtmp.h:2340: error: syntax error before "pAd"
/home/niko/wlan/rt61-1.1.0-b1/Module/rtmp.h:2341: warning: function declaration isn't a prototype
/home/niko/wlan/rt61-1.1.0-b1/Module/rtmp.h:2344: error: syntax error before "pAd"
/home/niko/wlan/rt61-1.1.0-b1/Module/rtmp.h:2345: warning: function declaration isn't a prototype
/home/niko/wlan/rt61-1.1.0-b1/Module/rtmp.h:2348: error: syntax error before "pAd"
/home/niko/wlan/rt61-1.1.0-b1/Module/rtmp.h:2349: warning: function declaration isn't a prototype
/home/niko/wlan/rt61-1.1.0-b1/Module/rtmp.h:2352: error: syntax error before "pAd"
/home/niko/wlan/rt61-1.1.0-b1/Module/rtmp.h:2352: warning: function declaration isn't a prototype
/home/niko/wlan/rt61-1.1.0-b1/Module/rtmp.h:2355: error: syntax error before "pAd"
/home/niko/wlan/rt61-1.1.0-b1/Module/rtmp.h:2356: warning: function declaration isn't a prototype
/home/niko/wlan/rt61-1.1.0-b1/Module/rtmp.h:2359: error: syntax error before "pAd"
/home/niko/wlan/rt61-1.1.0-b1/Module/rtmp.h:2360: warning: function declaration isn't a prototype
/home/niko/wlan/rt61-1.1.0-b1/Module/rtmp.h:2363: error: syntax error before "pAd"
/home/niko/wlan/rt61-1.1.0-b1/Module/rtmp.h:2364: warning: function declaration isn't a prototype
/home/niko/wlan/rt61-1.1.0-b1/Module/rtmp.h:2367: error: syntax error before "pAd"
/home/niko/wlan/rt61-1.1.0-b1/Module/rtmp.h:2367: warning: function declaration isn't a prototype
/home/niko/wlan/rt61-1.1.0-b1/Module/rtmp.h:2370: error: syntax error before "pAd"
/home/niko/wlan/rt61-1.1.0-b1/Module/rtmp.h:2370: warning: function declaration isn't a prototype
/home/niko/wlan/rt61-1.1.0-b1/Module/rtmp.h:2373: error: syntax error before "pAd"
/home/niko/wlan/rt61-1.1.0-b1/Module/rtmp.h:2373: warning: function declaration isn't a prototype
/home/niko/wlan/rt61-1.1.0-b1/Module/rtmp.h:2376: error: syntax error before "pAd"
/home/niko/wlan/rt61-1.1.0-b1/Module/rtmp.h:2376: warning: function declaration isn't a prototype
/home/niko/wlan/rt61-1.1.0-b1/Module/rtmp.h:2379: error: syntax error before "pAd"
/home/niko/wlan/rt61-1.1.0-b1/Module/rtmp.h:2380: warning: function declaration isn't a prototype
/home/niko/wlan/rt61-1.1.0-b1/Module/rtmp.h:2383: error: syntax error before "pAd"
/home/niko/wlan/rt61-1.1.0-b1/Module/rtmp.h:2383: warning: function declaration isn't a prototype
/home/niko/wlan/rt61-1.1.0-b1/Module/rtmp.h:2386: error: syntax error before "pAd"
/home/niko/wlan/rt61-1.1.0-b1/Module/rtmp.h:2388: warning: function declaration isn't a prototype
/home/niko/wlan/rt61-1.1.0-b1/Module/rtmp.h:2394: error: syntax error before "pAd"
/home/niko/wlan/rt61-1.1.0-b1/Module/rtmp.h:2400: warning: function declaration isn't a prototype
/home/niko/wlan/rt61-1.1.0-b1/Module/rtmp.h:2403: error: syntax error before "pAd"
/home/niko/wlan/rt61-1.1.0-b1/Module/rtmp.h:2407: warning: function declaration isn't a prototype
/home/niko/wlan/rt61-1.1.0-b1/Module/rtmp.h:2410: error: syntax error before "pAd"
/home/niko/wlan/rt61-1.1.0-b1/Module/rtmp.h:2416: warning: function declaration isn't a prototype
/home/niko/wlan/rt61-1.1.0-b1/Module/rtmp.h:2419: error: syntax error before "pAd"
/home/niko/wlan/rt61-1.1.0-b1/Module/rtmp.h:2424: warning: function declaration isn't a prototype
/home/niko/wlan/rt61-1.1.0-b1/Module/rtmp.h:2427: error: syntax error before "pAd"
/home/niko/wlan/rt61-1.1.0-b1/Module/rtmp.h:2438: warning: function declaration isn't a prototype
/home/niko/wlan/rt61-1.1.0-b1/Module/rtmp.h:2441: error: syntax error before "pAd"
/home/niko/wlan/rt61-1.1.0-b1/Module/rtmp.h:2445: warning: function declaration isn't a prototype
/home/niko/wlan/rt61-1.1.0-b1/Module/rtmp.h:2448: error: syntax error before "pAd"
/home/niko/wlan/rt61-1.1.0-b1/Module/rtmp.h:2452: warning: function declaration isn't a prototype
/home/niko/wlan/rt61-1.1.0-b1/Module/rtmp.h:2455: error: syntax error before "pAd"
/home/niko/wlan/rt61-1.1.0-b1/Module/rtmp.h:2462: warning: function declaration isn't a prototype
/home/niko/wlan/rt61-1.1.0-b1/Module/rtmp.h:2465: error: syntax error before "pAd"
/home/niko/wlan/rt61-1.1.0-b1/Module/rtmp.h:2470: warning: function declaration isn't a prototype
/home/niko/wlan/rt61-1.1.0-b1/Module/rtmp.h:2473: error: syntax error before "pAd"
/home/niko/wlan/rt61-1.1.0-b1/Module/rtmp.h:2504: warning: function declaration isn't a prototype
/home/niko/wlan/rt61-1.1.0-b1/Module/rtmp.h:2516: error: syntax error before "pAd"
/home/niko/wlan/rt61-1.1.0-b1/Module/rtmp.h:2517: warning: function declaration isn't a prototype
/home/niko/wlan/rt61-1.1.0-b1/Module/rtmp.h:2523: error: syntax error before "pAd"
/home/niko/wlan/rt61-1.1.0-b1/Module/rtmp.h:2524: warning: function declaration isn't a prototype
/home/niko/wlan/rt61-1.1.0-b1/Module/rtmp.h:2530: error: syntax error before "pAd"
/home/niko/wlan/rt61-1.1.0-b1/Module/rtmp.h:2531: warning: function declaration isn't a prototype
/home/niko/wlan/rt61-1.1.0-b1/Module/rtmp.h:2534: error: syntax error before "pAd"
/home/niko/wlan/rt61-1.1.0-b1/Module/rtmp.h:2535: warning: function declaration isn't a prototype
/home/niko/wlan/rt61-1.1.0-b1/Module/rtmp.h:2538: error: syntax error before "pAd"
/home/niko/wlan/rt61-1.1.0-b1/Module/rtmp.h:2538: warning: function declaration isn't a prototype
/home/niko/wlan/rt61-1.1.0-b1/Module/rtmp.h:2541: error: syntax error before "pAd"
/home/niko/wlan/rt61-1.1.0-b1/Module/rtmp.h:2543: warning: function declaration isn't a prototype
/home/niko/wlan/rt61-1.1.0-b1/Module/rtmp.h:2546: error: syntax error before "pAd"
/home/niko/wlan/rt61-1.1.0-b1/Module/rtmp.h:2546: warning: function declaration isn't a prototype
/home/niko/wlan/rt61-1.1.0-b1/Module/rtmp.h:2549: error: syntax error before "pAd"
/home/niko/wlan/rt61-1.1.0-b1/Module/rtmp.h:2549: warning: function declaration isn't a prototype
/home/niko/wlan/rt61-1.1.0-b1/Module/rtmp.h:2552: error: syntax error before "pAd"
/home/niko/wlan/rt61-1.1.0-b1/Module/rtmp.h:2552: warning: function declaration isn't a prototype
/home/niko/wlan/rt61-1.1.0-b1/Module/rtmp.h:2555: error: syntax error before "pAd"
/home/niko/wlan/rt61-1.1.0-b1/Module/rtmp.h:2556: warning: function declaration isn't a prototype
/home/niko/wlan/rt61-1.1.0-b1/Module/rtmp.h:2559: error: syntax error before "pAd"
/home/niko/wlan/rt61-1.1.0-b1/Module/rtmp.h:2561: warning: function declaration isn't a prototype
/home/niko/wlan/rt61-1.1.0-b1/Module/rtmp.h:2567: error: syntax error before "pAd"
/home/niko/wlan/rt61-1.1.0-b1/Module/rtmp.h:2571: warning: function declaration isn't a prototype
/home/niko/wlan/rt61-1.1.0-b1/Module/rtmp.h:2574: error: syntax error before "pAd"
/home/niko/wlan/rt61-1.1.0-b1/Module/rtmp.h:2578: warning: function declaration isn't a prototype
/home/niko/wlan/rt61-1.1.0-b1/Module/rtmp.h:2581: error: syntax error before "pAd"
/home/niko/wlan/rt61-1.1.0-b1/Module/rtmp.h:2586: warning: function declaration isn't a prototype
/home/niko/wlan/rt61-1.1.0-b1/Module/rtmp.h:2589: error: syntax error before "pAd"
/home/niko/wlan/rt61-1.1.0-b1/Module/rtmp.h:2589: warning: function declaration isn't a prototype
/home/niko/wlan/rt61-1.1.0-b1/Module/rtmp.h:2592: error: syntax error before "pAd"
/home/niko/wlan/rt61-1.1.0-b1/Module/rtmp.h:2592: warning: function declaration isn't a prototype
/home/niko/wlan/rt61-1.1.0-b1/Module/rtmp.h:2595: error: syntax error before "pAdapter"
/home/niko/wlan/rt61-1.1.0-b1/Module/rtmp.h:2596: warning: function declaration isn't a prototype
/home/niko/wlan/rt61-1.1.0-b1/Module/rtmp.h:2599: error: syntax error before "pAdapter"
/home/niko/wlan/rt61-1.1.0-b1/Module/rtmp.h:2599: warning: function declaration isn't a prototype
/home/niko/wlan/rt61-1.1.0-b1/Module/rtmp.h:2602: error: syntax error before "pAd"
/home/niko/wlan/rt61-1.1.0-b1/Module/rtmp.h:2602: warning: function declaration isn't a prototype
/home/niko/wlan/rt61-1.1.0-b1/Module/rtmp.h:2605: error: syntax error before "pAd"
/home/niko/wlan/rt61-1.1.0-b1/Module/rtmp.h:2605: warning: function declaration isn't a prototype
/home/niko/wlan/rt61-1.1.0-b1/Module/rtmp.h:2608: error: syntax error before "pAdapter"
/home/niko/wlan/rt61-1.1.0-b1/Module/rtmp.h:2610: warning: function declaration isn't a prototype
/home/niko/wlan/rt61-1.1.0-b1/Module/rtmp.h:2613: error: syntax error before "pAdapter"
/home/niko/wlan/rt61-1.1.0-b1/Module/rtmp.h:2614: warning: function declaration isn't a prototype
/home/niko/wlan/rt61-1.1.0-b1/Module/rtmp.h:2617: error: syntax error before "pAd"
/home/niko/wlan/rt61-1.1.0-b1/Module/rtmp.h:2619: warning: function declaration isn't a prototype
/home/niko/wlan/rt61-1.1.0-b1/Module/rtmp.h:2628: error: syntax error before "pAdapter"
/home/niko/wlan/rt61-1.1.0-b1/Module/rtmp.h:2629: warning: function declaration isn't a prototype
/home/niko/wlan/rt61-1.1.0-b1/Module/rtmp.h:2632: error: syntax error before "pAd"
/home/niko/wlan/rt61-1.1.0-b1/Module/rtmp.h:2633: warning: function declaration isn't a prototype
/home/niko/wlan/rt61-1.1.0-b1/Module/rtmp.h:2636: error: syntax error before "pAdapter"
/home/niko/wlan/rt61-1.1.0-b1/Module/rtmp.h:2639: warning: function declaration isn't a prototype
/home/niko/wlan/rt61-1.1.0-b1/Module/rtmp.h:2642: error: syntax error before "pAd"
/home/niko/wlan/rt61-1.1.0-b1/Module/rtmp.h:2645: warning: function declaration isn't a prototype
/home/niko/wlan/rt61-1.1.0-b1/Module/rtmp.h:2648: error: syntax error before "pAd"
/home/niko/wlan/rt61-1.1.0-b1/Module/rtmp.h:2653: warning: function declaration isn't a prototype
/home/niko/wlan/rt61-1.1.0-b1/Module/rtmp.h:2657: error: syntax error before "pAd"
/home/niko/wlan/rt61-1.1.0-b1/Module/rtmp.h:2659: warning: function declaration isn't a prototype
/home/niko/wlan/rt61-1.1.0-b1/Module/rtmp.h:2663: error: syntax error before "pAdapter"
/home/niko/wlan/rt61-1.1.0-b1/Module/rtmp.h:2665: warning: function declaration isn't a prototype
/home/niko/wlan/rt61-1.1.0-b1/Module/rtmp.h:2668: error: syntax error before "pAd"
/home/niko/wlan/rt61-1.1.0-b1/Module/rtmp.h:2683: warning: function declaration isn't a prototype
/home/niko/wlan/rt61-1.1.0-b1/Module/rtmp.h:2686: error: syntax error before "pAdapter"
/home/niko/wlan/rt61-1.1.0-b1/Module/rtmp.h:2687: warning: function declaration isn't a prototype
/home/niko/wlan/rt61-1.1.0-b1/Module/rtmp.h:2690: error: syntax error before "pAdapter"
/home/niko/wlan/rt61-1.1.0-b1/Module/rtmp.h:2691: warning: function declaration isn't a prototype
/home/niko/wlan/rt61-1.1.0-b1/Module/rtmp.h:2694: error: syntax error before "pAd"
/home/niko/wlan/rt61-1.1.0-b1/Module/rtmp.h:2694: warning: function declaration isn't a prototype
/home/niko/wlan/rt61-1.1.0-b1/Module/rtmp.h:2697: error: syntax error before "pAd"
/home/niko/wlan/rt61-1.1.0-b1/Module/rtmp.h:2697: warning: function declaration isn't a prototype
/home/niko/wlan/rt61-1.1.0-b1/Module/rtmp.h:2700: error: syntax error before "pAd"
/home/niko/wlan/rt61-1.1.0-b1/Module/rtmp.h:2702: warning: function declaration isn't a prototype
/home/niko/wlan/rt61-1.1.0-b1/Module/rtmp.h:2705: error: syntax error before "pAd"
/home/niko/wlan/rt61-1.1.0-b1/Module/rtmp.h:2707: warning: function declaration isn't a prototype
/home/niko/wlan/rt61-1.1.0-b1/Module/rtmp.h:2710: error: syntax error before "pAdapter"
/home/niko/wlan/rt61-1.1.0-b1/Module/rtmp.h:2711: warning: function declaration isn't a prototype
/home/niko/wlan/rt61-1.1.0-b1/Module/rtmp.h:2714: error: syntax error before "pAd"
/home/niko/wlan/rt61-1.1.0-b1/Module/rtmp.h:2715: warning: function declaration isn't a prototype
/home/niko/wlan/rt61-1.1.0-b1/Module/rtmp.h:2718: error: syntax error before "pAdapter"
/home/niko/wlan/rt61-1.1.0-b1/Module/rtmp.h:2720: warning: function declaration isn't a prototype
/home/niko/wlan/rt61-1.1.0-b1/Module/rtmp.h:2723: error: syntax error before "pAdapter"
/home/niko/wlan/rt61-1.1.0-b1/Module/rtmp.h:2726: warning: function declaration isn't a prototype
/home/niko/wlan/rt61-1.1.0-b1/Module/rtmp.h:2729: error: syntax error before "pAdapter"
/home/niko/wlan/rt61-1.1.0-b1/Module/rtmp.h:2730: warning: function declaration isn't a prototype
/home/niko/wlan/rt61-1.1.0-b1/Module/rtmp.h:2733: error: syntax error before "pAd"
/home/niko/wlan/rt61-1.1.0-b1/Module/rtmp.h:2735: warning: function declaration isn't a prototype
/home/niko/wlan/rt61-1.1.0-b1/Module/rtmp.h:2738: error: syntax error before "pAd"
/home/niko/wlan/rt61-1.1.0-b1/Module/rtmp.h:2739: warning: function declaration isn't a prototype
/home/niko/wlan/rt61-1.1.0-b1/Module/rtmp.h:2742: error: syntax error before "pAd"
/home/niko/wlan/rt61-1.1.0-b1/Module/rtmp.h:2743: warning: function declaration isn't a prototype
/home/niko/wlan/rt61-1.1.0-b1/Module/rtmp.h:2750: error: syntax error before "pAdapter"
/home/niko/wlan/rt61-1.1.0-b1/Module/rtmp.h:2754: warning: function declaration isn't a prototype
/home/niko/wlan/rt61-1.1.0-b1/Module/rtmp.h:2757: error: syntax error before "pAdapter"
/home/niko/wlan/rt61-1.1.0-b1/Module/rtmp.h:2760: warning: function declaration isn't a prototype
/home/niko/wlan/rt61-1.1.0-b1/Module/rtmp.h:2788: error: syntax error before "pAdapter"
/home/niko/wlan/rt61-1.1.0-b1/Module/rtmp.h:2789: warning: function declaration isn't a prototype
/home/niko/wlan/rt61-1.1.0-b1/Module/rtmp.h:2795: error: syntax error before "pAdapter"
/home/niko/wlan/rt61-1.1.0-b1/Module/rtmp.h:2802: warning: function declaration isn't a prototype
/home/niko/wlan/rt61-1.1.0-b1/Module/rtmp.h:2805: error: syntax error before "pAdapter"
/home/niko/wlan/rt61-1.1.0-b1/Module/rtmp.h:2810: warning: function declaration isn't a prototype
/home/niko/wlan/rt61-1.1.0-b1/Module/rtmp.h:2813: error: syntax error before "pAdapter"
/home/niko/wlan/rt61-1.1.0-b1/Module/rtmp.h:2818: warning: function declaration isn't a prototype
/home/niko/wlan/rt61-1.1.0-b1/Module/rtmp.h:2821: error: syntax error before "pAdapter"
/home/niko/wlan/rt61-1.1.0-b1/Module/rtmp.h:2824: warning: function declaration isn't a prototype
/home/niko/wlan/rt61-1.1.0-b1/Module/rtmp.h:2827: error: syntax error before "pAdapter"
/home/niko/wlan/rt61-1.1.0-b1/Module/rtmp.h:2833: warning: function declaration isn't a prototype
/home/niko/wlan/rt61-1.1.0-b1/Module/rtmp.h:2851: error: syntax error before "pAd"
/home/niko/wlan/rt61-1.1.0-b1/Module/rtmp.h:2853: warning: function declaration isn't a prototype
/home/niko/wlan/rt61-1.1.0-b1/Module/rtmp.h:2856: error: syntax error before "pAd"
/home/niko/wlan/rt61-1.1.0-b1/Module/rtmp.h:2857: warning: function declaration isn't a prototype
/home/niko/wlan/rt61-1.1.0-b1/Module/rtmp.h:2860: error: syntax error before "pAd"
/home/niko/wlan/rt61-1.1.0-b1/Module/rtmp.h:2861: warning: function declaration isn't a prototype
/home/niko/wlan/rt61-1.1.0-b1/Module/rtmp.h:2864: error: syntax error before "pAd"
/home/niko/wlan/rt61-1.1.0-b1/Module/rtmp.h:2865: warning: function declaration isn't a prototype
/home/niko/wlan/rt61-1.1.0-b1/Module/rtmp.h:2868: error: syntax error before "pAd"
/home/niko/wlan/rt61-1.1.0-b1/Module/rtmp.h:2869: warning: function declaration isn't a prototype
/home/niko/wlan/rt61-1.1.0-b1/Module/rtmp.h:2872: error: syntax error before "pAd"
/home/niko/wlan/rt61-1.1.0-b1/Module/rtmp.h:2875: warning: function declaration isn't a prototype
/home/niko/wlan/rt61-1.1.0-b1/Module/rtmp.h:2878: error: syntax error before "pAd"
/home/niko/wlan/rt61-1.1.0-b1/Module/rtmp.h:2879: warning: function declaration isn't a prototype
/home/niko/wlan/rt61-1.1.0-b1/Module/rtmp.h:2882: error: syntax error before "pAd"
/home/niko/wlan/rt61-1.1.0-b1/Module/rtmp.h:2883: warning: function declaration isn't a prototype
/home/niko/wlan/rt61-1.1.0-b1/Module/rtmp.h:2886: error: syntax error before "pAd"
/home/niko/wlan/rt61-1.1.0-b1/Module/rtmp.h:2888: warning: function declaration isn't a prototype
/home/niko/wlan/rt61-1.1.0-b1/Module/rtmp.h:2891: error: syntax error before "pAd"
/home/niko/wlan/rt61-1.1.0-b1/Module/rtmp.h:2893: warning: function declaration isn't a prototype
/home/niko/wlan/rt61-1.1.0-b1/Module/rtmp.h:2896: error: syntax error before "pAd"
/home/niko/wlan/rt61-1.1.0-b1/Module/rtmp.h:2898: warning: function declaration isn't a prototype
/home/niko/wlan/rt61-1.1.0-b1/Module/rtmp.h:2927: error: syntax error before "pAd"
/home/niko/wlan/rt61-1.1.0-b1/Module/rtmp.h:2928: warning: function declaration isn't a prototype
/home/niko/wlan/rt61-1.1.0-b1/Module/rtmp.h:2938: error: syntax error before "pAd"
/home/niko/wlan/rt61-1.1.0-b1/Module/rtmp.h:2941: warning: function declaration isn't a prototype
/home/niko/wlan/rt61-1.1.0-b1/Module/rtmp.h:2948: error: syntax error before "pAdapter"
/home/niko/wlan/rt61-1.1.0-b1/Module/rtmp.h:2950: warning: function declaration isn't a prototype
/home/niko/wlan/rt61-1.1.0-b1/Module/rtmp.h:2953: error: syntax error before "pAdapter"
/home/niko/wlan/rt61-1.1.0-b1/Module/rtmp.h:2955: warning: function declaration isn't a prototype
/home/niko/wlan/rt61-1.1.0-b1/Module/rtmp.h:2958: error: syntax error before "pAd"
/home/niko/wlan/rt61-1.1.0-b1/Module/rtmp.h:2959: warning: function declaration isn't a prototype
/home/niko/wlan/rt61-1.1.0-b1/Module/rtmp.h:2962: error: syntax error before "pAd"
/home/niko/wlan/rt61-1.1.0-b1/Module/rtmp.h:2963: warning: function declaration isn't a prototype
/home/niko/wlan/rt61-1.1.0-b1/Module/rtmp.h:2966: error: syntax error before "pAd"
/home/niko/wlan/rt61-1.1.0-b1/Module/rtmp.h:2966: warning: function declaration isn't a prototype
/home/niko/wlan/rt61-1.1.0-b1/Module/rtmp.h:2969: error: syntax error before "pAd"
/home/niko/wlan/rt61-1.1.0-b1/Module/rtmp.h:2969: warning: function declaration isn't a prototype
/home/niko/wlan/rt61-1.1.0-b1/Module/rtmp.h:2972: error: syntax error before "pAd"
/home/niko/wlan/rt61-1.1.0-b1/Module/rtmp.h:2973: warning: function declaration isn't a prototype
/home/niko/wlan/rt61-1.1.0-b1/Module/rtmp.h:2976: error: syntax error before "pAdapter"
/home/niko/wlan/rt61-1.1.0-b1/Module/rtmp.h:2977: warning: function declaration isn't a prototype
/home/niko/wlan/rt61-1.1.0-b1/Module/rtmp.h:2980: error: syntax error before "pAd"
/home/niko/wlan/rt61-1.1.0-b1/Module/rtmp.h:2981: warning: function declaration isn't a prototype
/home/niko/wlan/rt61-1.1.0-b1/Module/rtmp.h:2984: error: syntax error before "pAd"
/home/niko/wlan/rt61-1.1.0-b1/Module/rtmp.h:2985: warning: function declaration isn't a prototype
/home/niko/wlan/rt61-1.1.0-b1/Module/rtmp.h:2988: error: syntax error before "pAd"
/home/niko/wlan/rt61-1.1.0-b1/Module/rtmp.h:2989: warning: function declaration isn't a prototype
/home/niko/wlan/rt61-1.1.0-b1/Module/rtmp.h:2992: error: syntax error before "pAdapter"
/home/niko/wlan/rt61-1.1.0-b1/Module/rtmp.h:2993: warning: function declaration isn't a prototype
/home/niko/wlan/rt61-1.1.0-b1/Module/rtmp.h:2996: error: syntax error before "pAdapter"
/home/niko/wlan/rt61-1.1.0-b1/Module/rtmp.h:2997: warning: function declaration isn't a prototype
/home/niko/wlan/rt61-1.1.0-b1/Module/rtmp.h:3000: error: syntax error before "pAdapter"
/home/niko/wlan/rt61-1.1.0-b1/Module/rtmp.h:3001: warning: function declaration isn't a prototype
/home/niko/wlan/rt61-1.1.0-b1/Module/rtmp.h:3004: error: syntax error before "pAdapter"
/home/niko/wlan/rt61-1.1.0-b1/Module/rtmp.h:3005: warning: function declaration isn't a prototype
/home/niko/wlan/rt61-1.1.0-b1/Module/rtmp.h:3008: error: syntax error before "pAdapter"
/home/niko/wlan/rt61-1.1.0-b1/Module/rtmp.h:3009: warning: function declaration isn't a prototype
/home/niko/wlan/rt61-1.1.0-b1/Module/rtmp.h:3012: error: syntax error before "pAdapter"
/home/niko/wlan/rt61-1.1.0-b1/Module/rtmp.h:3013: warning: function declaration isn't a prototype
/home/niko/wlan/rt61-1.1.0-b1/Module/rtmp.h:3016: error: syntax error before "pAdapter"
/home/niko/wlan/rt61-1.1.0-b1/Module/rtmp.h:3017: warning: function declaration isn't a prototype
/home/niko/wlan/rt61-1.1.0-b1/Module/rtmp.h:3020: error: syntax error before "pAdapter"
/home/niko/wlan/rt61-1.1.0-b1/Module/rtmp.h:3021: warning: function declaration isn't a prototype
/home/niko/wlan/rt61-1.1.0-b1/Module/rtmp.h:3024: error: syntax error before "pAdapter"
/home/niko/wlan/rt61-1.1.0-b1/Module/rtmp.h:3025: warning: function declaration isn't a prototype
/home/niko/wlan/rt61-1.1.0-b1/Module/rtmp.h:3028: error: syntax error before "pAdapter"
/home/niko/wlan/rt61-1.1.0-b1/Module/rtmp.h:3029: warning: function declaration isn't a prototype
/home/niko/wlan/rt61-1.1.0-b1/Module/rtmp.h:3032: error: syntax error before "pAdapter"
/home/niko/wlan/rt61-1.1.0-b1/Module/rtmp.h:3033: warning: function declaration isn't a prototype
/home/niko/wlan/rt61-1.1.0-b1/Module/rtmp.h:3037: error: syntax error before "pAd"
/home/niko/wlan/rt61-1.1.0-b1/Module/rtmp.h:3038: warning: function declaration isn't a prototype
/home/niko/wlan/rt61-1.1.0-b1/Module/rtmp.h:3042: error: syntax error before "pAdapter"
/home/niko/wlan/rt61-1.1.0-b1/Module/rtmp.h:3043: warning: function declaration isn't a prototype
/home/niko/wlan/rt61-1.1.0-b1/Module/rtmp.h:3047: error: syntax error before "pAd"
/home/niko/wlan/rt61-1.1.0-b1/Module/rtmp.h:3048: warning: function declaration isn't a prototype
/home/niko/wlan/rt61-1.1.0-b1/Module/rtmp.h:3052: error: syntax error before "pAdapter"
/home/niko/wlan/rt61-1.1.0-b1/Module/rtmp.h:3053: warning: function declaration isn't a prototype
/home/niko/wlan/rt61-1.1.0-b1/Module/rtmp.h:3056: error: syntax error before "pAd"
/home/niko/wlan/rt61-1.1.0-b1/Module/rtmp.h:3057: warning: function declaration isn't a prototype
/home/niko/wlan/rt61-1.1.0-b1/Module/rtmp.h:3060: error: syntax error before "pAdapter"
/home/niko/wlan/rt61-1.1.0-b1/Module/rtmp.h:3061: warning: function declaration isn't a prototype
/home/niko/wlan/rt61-1.1.0-b1/Module/rtmp.h:3064: error: syntax error before "pAdapter"
/home/niko/wlan/rt61-1.1.0-b1/Module/rtmp.h:3065: warning: function declaration isn't a prototype
/home/niko/wlan/rt61-1.1.0-b1/Module/rtmp.h:3068: error: syntax error before "pAdapter"
/home/niko/wlan/rt61-1.1.0-b1/Module/rtmp.h:3069: warning: function declaration isn't a prototype
/home/niko/wlan/rt61-1.1.0-b1/Module/rtmp.h:3072: error: syntax error before "pAdapter"
/home/niko/wlan/rt61-1.1.0-b1/Module/rtmp.h:3073: warning: function declaration isn't a prototype
/home/niko/wlan/rt61-1.1.0-b1/Module/rtmp.h:3076: error: syntax error before "pAdapter"
/home/niko/wlan/rt61-1.1.0-b1/Module/rtmp.h:3077: warning: function declaration isn't a prototype
/home/niko/wlan/rt61-1.1.0-b1/Module/rtmp.h:3080: error: syntax error before "pAdapter"
/home/niko/wlan/rt61-1.1.0-b1/Module/rtmp.h:3081: warning: function declaration isn't a prototype
/home/niko/wlan/rt61-1.1.0-b1/Module/rtmp.h:3084: error: syntax error before "pAdapter"
/home/niko/wlan/rt61-1.1.0-b1/Module/rtmp.h:3085: warning: function declaration isn't a prototype
/home/niko/wlan/rt61-1.1.0-b1/Module/rtmp.h:3088: error: syntax error before "pAdapter"
/home/niko/wlan/rt61-1.1.0-b1/Module/rtmp.h:3089: warning: function declaration isn't a prototype
/home/niko/wlan/rt61-1.1.0-b1/Module/rtmp.h:3092: error: syntax error before "pAdapter"
/home/niko/wlan/rt61-1.1.0-b1/Module/rtmp.h:3093: warning: function declaration isn't a prototype
/home/niko/wlan/rt61-1.1.0-b1/Module/rtmp.h:3096: error: syntax error before "pAd"
/home/niko/wlan/rt61-1.1.0-b1/Module/rtmp.h:3097: warning: function declaration isn't a prototype
/home/niko/wlan/rt61-1.1.0-b1/Module/rtmp.h:3100: error: syntax error before "pAdapter"
/home/niko/wlan/rt61-1.1.0-b1/Module/rtmp.h:3101: warning: function declaration isn't a prototype
/home/niko/wlan/rt61-1.1.0-b1/Module/rtmp.h:3121: error: syntax error before "pAd"
/home/niko/wlan/rt61-1.1.0-b1/Module/rtmp.h:3122: warning: function declaration isn't a prototype
/home/niko/wlan/rt61-1.1.0-b1/Module/rtmp.h:3127: error: syntax error before "pAdapter"
/home/niko/wlan/rt61-1.1.0-b1/Module/rtmp.h:3128: warning: function declaration isn't a prototype
/home/niko/wlan/rt61-1.1.0-b1/Module/rtmp.h:3131: error: syntax error before "pAdapter"
/home/niko/wlan/rt61-1.1.0-b1/Module/rtmp.h:3132: warning: function declaration isn't a prototype
/home/niko/wlan/rt61-1.1.0-b1/Module/rtmp.h:3135: error: syntax error before "pAd"
/home/niko/wlan/rt61-1.1.0-b1/Module/rtmp.h:3136: warning: function declaration isn't a prototype
/home/niko/wlan/rt61-1.1.0-b1/Module/rtmp.h:3194: error: syntax error before "pAd"
/home/niko/wlan/rt61-1.1.0-b1/Module/rtmp.h:3197: warning: function declaration isn't a prototype
/home/niko/wlan/rt61-1.1.0-b1/Module/rtmp.h: In function `RTMPWriteTXRXCsr0':
/home/niko/wlan/rt61-1.1.0-b1/Module/rtmp.h:3200: error: `pAd' undeclared (first use in this function)
/home/niko/wlan/rt61-1.1.0-b1/Module/rtmp.h:3200: error: (Each undeclared identifier is reported only once
/home/niko/wlan/rt61-1.1.0-b1/Module/rtmp.h:3200: error: for each function it appears in.)
/home/niko/wlan/rt61-1.1.0-b1/Module/rtmp.h:3209: error: `disableRx' undeclared (first use in this function)
/home/niko/wlan/rt61-1.1.0-b1/Module/rtmp.h:3214: error: `dropControl' undeclared (first use in this function)
/home/niko/wlan/rt61-1.1.0-b1/Module/rtmp.h: At top level:
/home/niko/wlan/rt61-1.1.0-b1/Module/rtmp.h:3378: error: syntax error before "pAdapter"
/home/niko/wlan/rt61-1.1.0-b1/Module/rtmp.h:3379: warning: function declaration isn't a prototype
/home/niko/wlan/rt61-1.1.0-b1/Module/rtmp.h:3382: error: syntax error before "pAd"
/home/niko/wlan/rt61-1.1.0-b1/Module/rtmp.h:3385: warning: function declaration isn't a prototype
/home/niko/wlan/rt61-1.1.0-b1/Module/rtmp_main.c: In function `rt2x00_get_drvinfo':
/home/niko/wlan/rt61-1.1.0-b1/Module/rtmp_main.c:74: error: syntax error before "pAd"
/home/niko/wlan/rt61-1.1.0-b1/Module/rtmp_main.c:78: error: `pAd' undeclared (first use in this function)
/home/niko/wlan/rt61-1.1.0-b1/Module/rtmp_main.c: In function `rt2x00_get_regs':
/home/niko/wlan/rt61-1.1.0-b1/Module/rtmp_main.c:91: error: syntax error before "pAd"
/home/niko/wlan/rt61-1.1.0-b1/Module/rtmp_main.c:97: error: `pAd' undeclared (first use in this function)
/home/niko/wlan/rt61-1.1.0-b1/Module/rtmp_main.c: In function `rt2x00_get_eeprom':
/home/niko/wlan/rt61-1.1.0-b1/Module/rtmp_main.c:112: error: syntax error before "pAd"
/home/niko/wlan/rt61-1.1.0-b1/Module/rtmp_main.c:116: error: `pAd' undeclared (first use in this function)
/home/niko/wlan/rt61-1.1.0-b1/Module/rtmp_main.c: In function `RT61_probe':
/home/niko/wlan/rt61-1.1.0-b1/Module/rtmp_main.c:176: error: `pAd' undeclared (first use in this function)
/home/niko/wlan/rt61-1.1.0-b1/Module/rtmp_main.c:179: error: syntax error before '*' token
/home/niko/wlan/rt61-1.1.0-b1/Module/rtmp_main.c:224: error: `csr_addr' undeclared (first use in this function)
/home/niko/wlan/rt61-1.1.0-b1/Module/rtmp_main.c: In function `RT61_open':
/home/niko/wlan/rt61-1.1.0-b1/Module/rtmp_main.c:319: error: syntax error before "pAd"
/home/niko/wlan/rt61-1.1.0-b1/Module/rtmp_main.c:340: error: `pAd' undeclared (first use in this function)
/home/niko/wlan/rt61-1.1.0-b1/Module/rtmp_main.c: In function `RTMPSendPackets':
/home/niko/wlan/rt61-1.1.0-b1/Module/rtmp_main.c:520: error: syntax error before "pAdapter"
/home/niko/wlan/rt61-1.1.0-b1/Module/rtmp_main.c:532: error: `pAdapter' undeclared (first use in this function)
/home/niko/wlan/rt61-1.1.0-b1/Module/rtmp_main.c: In function `RTMPIsr':
/home/niko/wlan/rt61-1.1.0-b1/Module/rtmp_main.c:606: error: syntax error before "pAdapter"
/home/niko/wlan/rt61-1.1.0-b1/Module/rtmp_main.c:619: error: `pAdapter' undeclared (first use in this function)
/home/niko/wlan/rt61-1.1.0-b1/Module/rtmp_main.c:605: warning: unused variable `net_dev'
/home/niko/wlan/rt61-1.1.0-b1/Module/rtmp_main.c: In function `rt61_set_mac_address':
/home/niko/wlan/rt61-1.1.0-b1/Module/rtmp_main.c:704: error: `pAd' undeclared (first use in this function)
/home/niko/wlan/rt61-1.1.0-b1/Module/rtmp_main.c: In function `RT61_get_wireless_stats':
/home/niko/wlan/rt61-1.1.0-b1/Module/rtmp_main.c:760: error: `pAd' undeclared (first use in this function)
/home/niko/wlan/rt61-1.1.0-b1/Module/rtmp_main.c: In function `RT61_get_ether_stats':
/home/niko/wlan/rt61-1.1.0-b1/Module/rtmp_main.c:806: error: `pAd' undeclared (first use in this function)
/home/niko/wlan/rt61-1.1.0-b1/Module/rtmp_main.c: In function `RT61_set_rx_mode':
/home/niko/wlan/rt61-1.1.0-b1/Module/rtmp_main.c:865: error: `pAd' undeclared (first use in this function)
/home/niko/wlan/rt61-1.1.0-b1/Module/rtmp_main.c: In function `RT61_close':
/home/niko/wlan/rt61-1.1.0-b1/Module/rtmp_main.c:886: error: `pAd' undeclared (first use in this function)
/home/niko/wlan/rt61-1.1.0-b1/Module/rtmp_main.c: In function `RT61_remove_one':
/home/niko/wlan/rt61-1.1.0-b1/Module/rtmp_main.c:936: error: `pAd' undeclared (first use in this function)
/home/niko/wlan/rt61-1.1.0-b1/Module/rtmp_main.c: In function `rt61_suspend':
/home/niko/wlan/rt61-1.1.0-b1/Module/rtmp_main.c:984: error: syntax error before "pAdapter"
/home/niko/wlan/rt61-1.1.0-b1/Module/rtmp_main.c:994: error: `pAdapter' undeclared (first use in this function)
/home/niko/wlan/rt61-1.1.0-b1/Module/rtmp_main.c: In function `rt61_resume':
/home/niko/wlan/rt61-1.1.0-b1/Module/rtmp_main.c:1010: error: syntax error before "pAdapter"
/home/niko/wlan/rt61-1.1.0-b1/Module/rtmp_main.c:1019: error: `pAdapter' undeclared (first use in this function)
make[2]: *** [/home/niko/wlan/rt61-1.1.0-b1/Module/rmake[1]: Entering directory `/usr/src/kernel-headers-2.6.8-3-686'
CC [M] /home/niko/wlan/rt61-1.1.0-b1/Module/rtmp_main.o
In file included from /home/niko/wlan/rt61-1.1.0-b1/Module/rt_config.h:158,
from /home/niko/wlan/rt61-1.1.0-b1/Module/rtmp_main.c:45:
/home/niko/wlan/rt61-1.1.0-b1/Module/rtmp.h:1261: error: variable or field `__iomem' declared void
/home/niko/wlan/rt61-1.1.0-b1/Module/rtmp.h:1261: warning: no semicolon at end of struct or union
/home/niko/wlan/rt61-1.1.0-b1/Module/rtmp.h:1261: error: syntax error before '*' token
/home/niko/wlan/rt61-1.1.0-b1/Module/rtmp.h:1427: error: syntax error before '}' token
/home/niko/wlan/rt61-1.1.0-b1/Module/rtmp.h:1427: warning: type defaults to `int' in declaration of `RTMP_ADAPTER'
/home/niko/wlan/rt61-1.1.0-b1/Module/rtmp.h:1427: warning: type defaults to `int' in declaration of `PRTMP_ADAPTER'
/home/niko/wlan/rt61-1.1.0-b1/Module/rtmp.h:1427: warning: data definition has no type or storage class
/home/niko/wlan/rt61-1.1.0-b1/Module/rtmp.h:1582: error: syntax error before "pAdapter"
/home/niko/wlan/rt61-1.1.0-b1/Module/rtmp.h:1582: warning: function declaration isn't a prototype
/home/niko/wlan/rt61-1.1.0-b1/Module/rtmp.h:1585: error: syntax error before "pAdapter"
/home/niko/wlan/rt61-1.1.0-b1/Module/rtmp.h:1585: warning: function declaration isn't a prototype
/home/niko/wlan/rt61-1.1.0-b1/Module/rtmp.h:1588: error: syntax error before "pAdapter"
/home/niko/wlan/rt61-1.1.0-b1/Module/rtmp.h:1588: warning: function declaration isn't a prototype
/home/niko/wlan/rt61-1.1.0-b1/Module/rtmp.h:1598: error: syntax error before "pAdapter"
/home/niko/wlan/rt61-1.1.0-b1/Module/rtmp.h:1598: warning: function declaration isn't a prototype
/home/niko/wlan/rt61-1.1.0-b1/Module/rtmp.h:1606: error: syntax error before "pAdapter"
/home/niko/wlan/rt61-1.1.0-b1/Module/rtmp.h:1606: warning: function declaration isn't a prototype
/home/niko/wlan/rt61-1.1.0-b1/Module/rtmp.h:1609: error: syntax error before "pAdapter"
/home/niko/wlan/rt61-1.1.0-b1/Module/rtmp.h:1609: warning: function declaration isn't a prototype
/home/niko/wlan/rt61-1.1.0-b1/Module/rtmp.h:1612: error: syntax error before "pAd"
/home/niko/wlan/rt61-1.1.0-b1/Module/rtmp.h:1612: warning: function declaration isn't a prototype
/home/niko/wlan/rt61-1.1.0-b1/Module/rtmp.h:1615: error: syntax error before "pAd"
/home/niko/wlan/rt61-1.1.0-b1/Module/rtmp.h:1615: warning: function declaration isn't a prototype
/home/niko/wlan/rt61-1.1.0-b1/Module/rtmp.h:1618: error: syntax error before "pAdapter"
/home/niko/wlan/rt61-1.1.0-b1/Module/rtmp.h:1618: warning: function declaration isn't a prototype
/home/niko/wlan/rt61-1.1.0-b1/Module/rtmp.h:1621: error: syntax error before "pAdapter"
/home/niko/wlan/rt61-1.1.0-b1/Module/rtmp.h:1621: warning: function declaration isn't a prototype
/home/niko/wlan/rt61-1.1.0-b1/Module/rtmp.h:1624: error: syntax error before "pAdapter"
/home/niko/wlan/rt61-1.1.0-b1/Module/rtmp.h:1624: warning: function declaration isn't a prototype
/home/niko/wlan/rt61-1.1.0-b1/Module/rtmp.h:1627: error: syntax error before "pAd"
/home/niko/wlan/rt61-1.1.0-b1/Module/rtmp.h:1627: warning: function declaration isn't a prototype
/home/niko/wlan/rt61-1.1.0-b1/Module/rtmp.h:1630: error: syntax error before "pAdapter"
/home/niko/wlan/rt61-1.1.0-b1/Module/rtmp.h:1630: warning: function declaration isn't a prototype
/home/niko/wlan/rt61-1.1.0-b1/Module/rtmp.h:1633: error: syntax error before "pAdapter"
/home/niko/wlan/rt61-1.1.0-b1/Module/rtmp.h:1633: warning: function declaration isn't a prototype
/home/niko/wlan/rt61-1.1.0-b1/Module/rtmp.h:1645: error: syntax error before "pAd"
/home/niko/wlan/rt61-1.1.0-b1/Module/rtmp.h:1645: warning: function declaration isn't a prototype
/home/niko/wlan/rt61-1.1.0-b1/Module/rtmp.h:1648: error: syntax error before "pAd"
/home/niko/wlan/rt61-1.1.0-b1/Module/rtmp.h:1648: warning: function declaration isn't a prototype
/home/niko/wlan/rt61-1.1.0-b1/Module/rtmp.h:1651: error: syntax error before "pAdapter"
/home/niko/wlan/rt61-1.1.0-b1/Module/rtmp.h:1652: warning: function declaration isn't a prototype
/home/niko/wlan/rt61-1.1.0-b1/Module/rtmp.h:1655: error: syntax error before "pAd"
/home/niko/wlan/rt61-1.1.0-b1/Module/rtmp.h:1655: warning: function declaration isn't a prototype
/home/niko/wlan/rt61-1.1.0-b1/Module/rtmp.h:1670: error: syntax error before "pAd"
/home/niko/wlan/rt61-1.1.0-b1/Module/rtmp.h:1671: warning: function declaration isn't a prototype
/home/niko/wlan/rt61-1.1.0-b1/Module/rtmp.h:1674: error: syntax error before "pAd"
/home/niko/wlan/rt61-1.1.0-b1/Module/rtmp.h:1675: warning: function declaration isn't a prototype
/home/niko/wlan/rt61-1.1.0-b1/Module/rtmp.h:1683: error: syntax error before "pAd"
/home/niko/wlan/rt61-1.1.0-b1/Module/rtmp.h:1684: warning: function declaration isn't a prototype
/home/niko/wlan/rt61-1.1.0-b1/Module/rtmp.h:1687: error: syntax error before "pAd"
/home/niko/wlan/rt61-1.1.0-b1/Module/rtmp.h:1688: warning: function declaration isn't a prototype
/home/niko/wlan/rt61-1.1.0-b1/Module/rtmp.h:1691: error: syntax error before "pAd"
/home/niko/wlan/rt61-1.1.0-b1/Module/rtmp.h:1692: warning: function declaration isn't a prototype
/home/niko/wlan/rt61-1.1.0-b1/Module/rtmp.h:1695: error: syntax error before "pAd"
/home/niko/wlan/rt61-1.1.0-b1/Module/rtmp.h:1696: warning: function declaration isn't a prototype
/home/niko/wlan/rt61-1.1.0-b1/Module/rtmp.h:1702: error: syntax error before "pAd"
/home/niko/wlan/rt61-1.1.0-b1/Module/rtmp.h:1702: warning: function declaration isn't a prototype
/home/niko/wlan/rt61-1.1.0-b1/Module/rtmp.h:1705: error: syntax error before "pAd"
/home/niko/wlan/rt61-1.1.0-b1/Module/rtmp.h:1706: warning: function declaration isn't a prototype
/home/niko/wlan/rt61-1.1.0-b1/Module/rtmp.h:1709: error: syntax error before "pAd"
/home/niko/wlan/rt61-1.1.0-b1/Module/rtmp.h:1709: warning: function declaration isn't a prototype
/home/niko/wlan/rt61-1.1.0-b1/Module/rtmp.h:1712: error: syntax error before "pAd"
/home/niko/wlan/rt61-1.1.0-b1/Module/rtmp.h:1712: warning: function declaration isn't a prototype
/home/niko/wlan/rt61-1.1.0-b1/Module/rtmp.h:1715: error: syntax error before "pAd"
/home/niko/wlan/rt61-1.1.0-b1/Module/rtmp.h:1716: warning: function declaration isn't a prototype
/home/niko/wlan/rt61-1.1.0-b1/Module/rtmp.h:1719: error: syntax error before "pAd"
/home/niko/wlan/rt61-1.1.0-b1/Module/rtmp.h:1719: warning: function declaration isn't a prototype
/home/niko/wlan/rt61-1.1.0-b1/Module/rtmp.h:1722: error: syntax error before "pAd"
/home/niko/wlan/rt61-1.1.0-b1/Module/rtmp.h:1722: warning: function declaration isn't a prototype
/home/niko/wlan/rt61-1.1.0-b1/Module/rtmp.h:1725: error: syntax error before "pAd"
/home/niko/wlan/rt61-1.1.0-b1/Module/rtmp.h:1725: warning: function declaration isn't a prototype
/home/niko/wlan/rt61-1.1.0-b1/Module/rtmp.h:1728: error: syntax error before "pAd"
/home/niko/wlan/rt61-1.1.0-b1/Module/rtmp.h:1729: warning: function declaration isn't a prototype
/home/niko/wlan/rt61-1.1.0-b1/Module/rtmp.h:1732: error: syntax error before "pAd"
/home/niko/wlan/rt61-1.1.0-b1/Module/rtmp.h:1733: warning: function declaration isn't a prototype
/home/niko/wlan/rt61-1.1.0-b1/Module/rtmp.h:1736: error: syntax error before "pAd"
/home/niko/wlan/rt61-1.1.0-b1/Module/rtmp.h:1736: warning: function declaration isn't a prototype
/home/niko/wlan/rt61-1.1.0-b1/Module/rtmp.h:1739: error: syntax error before "pAd"
/home/niko/wlan/rt61-1.1.0-b1/Module/rtmp.h:1745: warning: function declaration isn't a prototype
/home/niko/wlan/rt61-1.1.0-b1/Module/rtmp.h:1748: error: syntax error before "pAd"
/home/niko/wlan/rt61-1.1.0-b1/Module/rtmp.h:1750: warning: function declaration isn't a prototype
/home/niko/wlan/rt61-1.1.0-b1/Module/rtmp.h:1753: error: syntax error before "pAd"
/home/niko/wlan/rt61-1.1.0-b1/Module/rtmp.h:1759: warning: function declaration isn't a prototype
/home/niko/wlan/rt61-1.1.0-b1/Module/rtmp.h:1762: error: syntax error before "pAd"
/home/niko/wlan/rt61-1.1.0-b1/Module/rtmp.h:1763: warning: function declaration isn't a prototype
/home/niko/wlan/rt61-1.1.0-b1/Module/rtmp.h:1766: error: syntax error before "pAd"
/home/niko/wlan/rt61-1.1.0-b1/Module/rtmp.h:1770: warning: function declaration isn't a prototype
/home/niko/wlan/rt61-1.1.0-b1/Module/rtmp.h:1773: error: syntax error before "pAd"
/home/niko/wlan/rt61-1.1.0-b1/Module/rtmp.h:1775: warning: function declaration isn't a prototype
/home/niko/wlan/rt61-1.1.0-b1/Module/rtmp.h:1778: error: syntax error before "pAd"
/home/niko/wlan/rt61-1.1.0-b1/Module/rtmp.h:1780: warning: function declaration isn't a prototype
/home/niko/wlan/rt61-1.1.0-b1/Module/rtmp.h:1783: error: syntax error before "pAd"
/home/niko/wlan/rt61-1.1.0-b1/Module/rtmp.h:1783: warning: function declaration isn't a prototype
/home/niko/wlan/rt61-1.1.0-b1/Module/rtmp.h:1792: error: syntax error before "pAd"
/home/niko/wlan/rt61-1.1.0-b1/Module/rtmp.h:1792: warning: function declaration isn't a prototype
/home/niko/wlan/rt61-1.1.0-b1/Module/rtmp.h:1795: error: syntax error before "pAd"
/home/niko/wlan/rt61-1.1.0-b1/Module/rtmp.h:1795: warning: function declaration isn't a prototype
/home/niko/wlan/rt61-1.1.0-b1/Module/rtmp.h:1798: error: syntax error before "pAd"
/home/niko/wlan/rt61-1.1.0-b1/Module/rtmp.h:1799: warning: function declaration isn't a prototype
/home/niko/wlan/rt61-1.1.0-b1/Module/rtmp.h:1802: error: syntax error before "pAd"
/home/niko/wlan/rt61-1.1.0-b1/Module/rtmp.h:1804: warning: function declaration isn't a prototype
/home/niko/wlan/rt61-1.1.0-b1/Module/rtmp.h:1834: error: syntax error before "pAd"
/home/niko/wlan/rt61-1.1.0-b1/Module/rtmp.h:1856: warning: function declaration isn't a prototype
/home/niko/wlan/rt61-1.1.0-b1/Module/rtmp.h:1859: error: syntax error before "pAd"
/home/niko/wlan/rt61-1.1.0-b1/Module/rtmp.h:1881: warning: function declaration isn't a prototype
/home/niko/wlan/rt61-1.1.0-b1/Module/rtmp.h:1884: error: syntax error before "pAd"
/home/niko/wlan/rt61-1.1.0-b1/Module/rtmp.h:1887: warning: function declaration isn't a prototype
/home/niko/wlan/rt61-1.1.0-b1/Module/rtmp.h:1896: error: syntax error before "pAd"
/home/niko/wlan/rt61-1.1.0-b1/Module/rtmp.h:1897: warning: function declaration isn't a prototype
/home/niko/wlan/rt61-1.1.0-b1/Module/rtmp.h:1900: error: syntax error before "pAd"
/home/niko/wlan/rt61-1.1.0-b1/Module/rtmp.h:1905: warning: function declaration isn't a prototype
/home/niko/wlan/rt61-1.1.0-b1/Module/rtmp.h:1915: error: syntax error before "pAd"
/home/niko/wlan/rt61-1.1.0-b1/Module/rtmp.h:1919: warning: function declaration isn't a prototype
/home/niko/wlan/rt61-1.1.0-b1/Module/rtmp.h:1922: error: syntax error before "pAd"
/home/niko/wlan/rt61-1.1.0-b1/Module/rtmp.h:1928: warning: function declaration isn't a prototype
/home/niko/wlan/rt61-1.1.0-b1/Module/rtmp.h:1935: error: syntax error before "pAd"
/home/niko/wlan/rt61-1.1.0-b1/Module/rtmp.h:1935: warning: function declaration isn't a prototype
/home/niko/wlan/rt61-1.1.0-b1/Module/rtmp.h:1947: error: syntax error before "pAd"
/home/niko/wlan/rt61-1.1.0-b1/Module/rtmp.h:1950: warning: function declaration isn't a prototype
/home/niko/wlan/rt61-1.1.0-b1/Module/rtmp.h:1968: error: syntax error before "pAd"
/home/niko/wlan/rt61-1.1.0-b1/Module/rtmp.h:1970: warning: function declaration isn't a prototype
/home/niko/wlan/rt61-1.1.0-b1/Module/rtmp.h:1973: error: syntax error before "pAd"
/home/niko/wlan/rt61-1.1.0-b1/Module/rtmp.h:1974: warning: function declaration isn't a prototype
/home/niko/wlan/rt61-1.1.0-b1/Module/rtmp.h:1977: error: syntax error before "pAd"
/home/niko/wlan/rt61-1.1.0-b1/Module/rtmp.h:1978: warning: function declaration isn't a prototype
/home/niko/wlan/rt61-1.1.0-b1/Module/rtmp.h:1981: error: syntax error before "pAd"
/home/niko/wlan/rt61-1.1.0-b1/Module/rtmp.h:1981: warning: function declaration isn't a prototype
/home/niko/wlan/rt61-1.1.0-b1/Module/rtmp.h:1984: error: syntax error before "pAd"
/home/niko/wlan/rt61-1.1.0-b1/Module/rtmp.h:1984: warning: function declaration isn't a prototype
/home/niko/wlan/rt61-1.1.0-b1/Module/rtmp.h:1987: error: syntax error before "pAd"
/home/niko/wlan/rt61-1.1.0-b1/Module/rtmp.h:1987: warning: function declaration isn't a prototype
/home/niko/wlan/rt61-1.1.0-b1/Module/rtmp.h:1990: error: syntax error before "pAd"
/home/niko/wlan/rt61-1.1.0-b1/Module/rtmp.h:1990: warning: function declaration isn't a prototype
/home/niko/wlan/rt61-1.1.0-b1/Module/rtmp.h:1996: error: syntax error before "pAd"
/home/niko/wlan/rt61-1.1.0-b1/Module/rtmp.h:1996: warning: function declaration isn't a prototype
/home/niko/wlan/rt61-1.1.0-b1/Module/rtmp.h:2002: error: syntax error before "pAd"
/home/niko/wlan/rt61-1.1.0-b1/Module/rtmp.h:2002: warning: function declaration isn't a prototype
/home/niko/wlan/rt61-1.1.0-b1/Module/rtmp.h:2005: error: syntax error before "pAd"
/home/niko/wlan/rt61-1.1.0-b1/Module/rtmp.h:2005: warning: function declaration isn't a prototype
/home/niko/wlan/rt61-1.1.0-b1/Module/rtmp.h:2008: error: syntax error before "pAd"
/home/niko/wlan/rt61-1.1.0-b1/Module/rtmp.h:2008: warning: function declaration isn't a prototype
/home/niko/wlan/rt61-1.1.0-b1/Module/rtmp.h:2015: error: syntax error before "pAd"
/home/niko/wlan/rt61-1.1.0-b1/Module/rtmp.h:2016: warning: function declaration isn't a prototype
/home/niko/wlan/rt61-1.1.0-b1/Module/rtmp.h:2019: error: syntax error before "pAd"
/home/niko/wlan/rt61-1.1.0-b1/Module/rtmp.h:2020: warning: function declaration isn't a prototype
/home/niko/wlan/rt61-1.1.0-b1/Module/rtmp.h:2023: error: syntax error before "pAd"
/home/niko/wlan/rt61-1.1.0-b1/Module/rtmp.h:2024: warning: function declaration isn't a prototype
/home/niko/wlan/rt61-1.1.0-b1/Module/rtmp.h:2027: error: syntax error before "pAd"
/home/niko/wlan/rt61-1.1.0-b1/Module/rtmp.h:2027: warning: function declaration isn't a prototype
/home/niko/wlan/rt61-1.1.0-b1/Module/rtmp.h:2030: error: syntax error before "pAd"
/home/niko/wlan/rt61-1.1.0-b1/Module/rtmp.h:2031: warning: function declaration isn't a prototype
/home/niko/wlan/rt61-1.1.0-b1/Module/rtmp.h:2034: error: syntax error before "pAd"
/home/niko/wlan/rt61-1.1.0-b1/Module/rtmp.h:2035: warning: function declaration isn't a prototype
/home/niko/wlan/rt61-1.1.0-b1/Module/rtmp.h:2038: error: syntax error before "pAd"
/home/niko/wlan/rt61-1.1.0-b1/Module/rtmp.h:2039: warning: function declaration isn't a prototype
/home/niko/wlan/rt61-1.1.0-b1/Module/rtmp.h:2042: error: syntax error before "pAd"
/home/niko/wlan/rt61-1.1.0-b1/Module/rtmp.h:2043: warning: function declaration isn't a prototype
/home/niko/wlan/rt61-1.1.0-b1/Module/rtmp.h:2046: error: syntax error before "pAd"
/home/niko/wlan/rt61-1.1.0-b1/Module/rtmp.h:2046: warning: function declaration isn't a prototype
/home/niko/wlan/rt61-1.1.0-b1/Module/rtmp.h:2049: error: syntax error before "pAd"
/home/niko/wlan/rt61-1.1.0-b1/Module/rtmp.h:2049: warning: function declaration isn't a prototype
/home/niko/wlan/rt61-1.1.0-b1/Module/rtmp.h:2052: error: syntax error before "pAd"
/home/niko/wlan/rt61-1.1.0-b1/Module/rtmp.h:2054: warning: function declaration isn't a prototype
/home/niko/wlan/rt61-1.1.0-b1/Module/rtmp.h:2066: error: syntax error before "pAd"
/home/niko/wlan/rt61-1.1.0-b1/Module/rtmp.h:2067: warning: function declaration isn't a prototype
/home/niko/wlan/rt61-1.1.0-b1/Module/rtmp.h:2070: error: syntax error before "pAd"
/home/niko/wlan/rt61-1.1.0-b1/Module/rtmp.h:2071: warning: function declaration isn't a prototype
/home/niko/wlan/rt61-1.1.0-b1/Module/rtmp.h:2074: error: syntax error before "pAd"
/home/niko/wlan/rt61-1.1.0-b1/Module/rtmp.h:2075: warning: function declaration isn't a prototype
/home/niko/wlan/rt61-1.1.0-b1/Module/rtmp.h:2078: error: syntax error before "pAd"
/home/niko/wlan/rt61-1.1.0-b1/Module/rtmp.h:2079: warning: function declaration isn't a prototype
/home/niko/wlan/rt61-1.1.0-b1/Module/rtmp.h:2082: error: syntax error before "pAd"
/home/niko/wlan/rt61-1.1.0-b1/Module/rtmp.h:2083: warning: function declaration isn't a prototype
/home/niko/wlan/rt61-1.1.0-b1/Module/rtmp.h:2086: error: syntax error before "pAd"
/home/niko/wlan/rt61-1.1.0-b1/Module/rtmp.h:2094: warning: function declaration isn't a prototype
/home/niko/wlan/rt61-1.1.0-b1/Module/rtmp.h:2097: error: syntax error before "pAd"
/home/niko/wlan/rt61-1.1.0-b1/Module/rtmp.h:2098: warning: function declaration isn't a prototype
/home/niko/wlan/rt61-1.1.0-b1/Module/rtmp.h:2101: error: syntax error before "pAd"
/home/niko/wlan/rt61-1.1.0-b1/Module/rtmp.h:2102: warning: function declaration isn't a prototype
/home/niko/wlan/rt61-1.1.0-b1/Module/rtmp.h:2105: error: syntax error before "pAd"
/home/niko/wlan/rt61-1.1.0-b1/Module/rtmp.h:2106: warning: function declaration isn't a prototype
/home/niko/wlan/rt61-1.1.0-b1/Module/rtmp.h:2109: error: syntax error before "pAd"
/home/niko/wlan/rt61-1.1.0-b1/Module/rtmp.h:2110: warning: function declaration isn't a prototype
/home/niko/wlan/rt61-1.1.0-b1/Module/rtmp.h:2113: error: syntax error before "pAd"
/home/niko/wlan/rt61-1.1.0-b1/Module/rtmp.h:2114: warning: function declaration isn't a prototype
/home/niko/wlan/rt61-1.1.0-b1/Module/rtmp.h:2117: error: syntax error before "pAd"
/home/niko/wlan/rt61-1.1.0-b1/Module/rtmp.h:2118: warning: function declaration isn't a prototype
/home/niko/wlan/rt61-1.1.0-b1/Module/rtmp.h:2121: error: syntax error before "pAd"
/home/niko/wlan/rt61-1.1.0-b1/Module/rtmp.h:2122: warning: function declaration isn't a prototype
/home/niko/wlan/rt61-1.1.0-b1/Module/rtmp.h:2125: error: syntax error before "pAd"
/home/niko/wlan/rt61-1.1.0-b1/Module/rtmp.h:2126: warning: function declaration isn't a prototype
/home/niko/wlan/rt61-1.1.0-b1/Module/rtmp.h:2129: error: syntax error before "pAd"
/home/niko/wlan/rt61-1.1.0-b1/Module/rtmp.h:2131: warning: function declaration isn't a prototype
/home/niko/wlan/rt61-1.1.0-b1/Module/rtmp.h:2137: error: syntax error before "pAd"
/home/niko/wlan/rt61-1.1.0-b1/Module/rtmp.h:2138: warning: function declaration isn't a prototype
/home/niko/wlan/rt61-1.1.0-b1/Module/rtmp.h:2141: error: syntax error before "pAd"
/home/niko/wlan/rt61-1.1.0-b1/Module/rtmp.h:2142: warning: function declaration isn't a prototype
/home/niko/wlan/rt61-1.1.0-b1/Module/rtmp.h:2145: error: syntax error before "pAd"
/home/niko/wlan/rt61-1.1.0-b1/Module/rtmp.h:2146: warning: function declaration isn't a prototype
/home/niko/wlan/rt61-1.1.0-b1/Module/rtmp.h:2149: error: syntax error before "pAd"
/home/niko/wlan/rt61-1.1.0-b1/Module/rtmp.h:2150: warning: function declaration isn't a prototype
/home/niko/wlan/rt61-1.1.0-b1/Module/rtmp.h:2153: error: syntax error before "pAd"
/home/niko/wlan/rt61-1.1.0-b1/Module/rtmp.h:2154: warning: function declaration isn't a prototype
/home/niko/wlan/rt61-1.1.0-b1/Module/rtmp.h:2157: error: syntax error before "pAd"
/home/niko/wlan/rt61-1.1.0-b1/Module/rtmp.h:2158: warning: function declaration isn't a prototype
/home/niko/wlan/rt61-1.1.0-b1/Module/rtmp.h:2161: error: syntax error before "pAd"
/home/niko/wlan/rt61-1.1.0-b1/Module/rtmp.h:2162: warning: function declaration isn't a prototype
/home/niko/wlan/rt61-1.1.0-b1/Module/rtmp.h:2165: error: syntax error before "pAd"
/home/niko/wlan/rt61-1.1.0-b1/Module/rtmp.h:2167: warning: function declaration isn't a prototype
/home/niko/wlan/rt61-1.1.0-b1/Module/rtmp.h:2170: error: syntax error before "pAd"
/home/niko/wlan/rt61-1.1.0-b1/Module/rtmp.h:2175: warning: function declaration isn't a prototype
/home/niko/wlan/rt61-1.1.0-b1/Module/rtmp.h:2178: error: syntax error before "pAd"
/home/niko/wlan/rt61-1.1.0-b1/Module/rtmp.h:2179: warning: function declaration isn't a prototype
/home/niko/wlan/rt61-1.1.0-b1/Module/rtmp.h:2182: error: syntax error before "pAd"
/home/niko/wlan/rt61-1.1.0-b1/Module/rtmp.h:2184: warning: function declaration isn't a prototype
/home/niko/wlan/rt61-1.1.0-b1/Module/rtmp.h:2187: error: syntax error before "pAd"
/home/niko/wlan/rt61-1.1.0-b1/Module/rtmp.h:2189: warning: function declaration isn't a prototype
/home/niko/wlan/rt61-1.1.0-b1/Module/rtmp.h:2192: error: syntax error before "pAd"
/home/niko/wlan/rt61-1.1.0-b1/Module/rtmp.h:2193: warning: function declaration isn't a prototype
/home/niko/wlan/rt61-1.1.0-b1/Module/rtmp.h:2196: error: syntax error before "pAd"
/home/niko/wlan/rt61-1.1.0-b1/Module/rtmp.h:2197: warning: function declaration isn't a prototype
/home/niko/wlan/rt61-1.1.0-b1/Module/rtmp.h:2200: error: syntax error before "pAd"
/home/niko/wlan/rt61-1.1.0-b1/Module/rtmp.h:2201: warning: function declaration isn't a prototype
/home/niko/wlan/rt61-1.1.0-b1/Module/rtmp.h:2204: error: syntax error before "pAd"
/home/niko/wlan/rt61-1.1.0-b1/Module/rtmp.h:2205: warning: function declaration isn't a prototype
/home/niko/wlan/rt61-1.1.0-b1/Module/rtmp.h:2208: error: syntax error before "pAd"
/home/niko/wlan/rt61-1.1.0-b1/Module/rtmp.h:2209: warning: function declaration isn't a prototype
/home/niko/wlan/rt61-1.1.0-b1/Module/rtmp.h:2212: error: syntax error before "pAd"
/home/niko/wlan/rt61-1.1.0-b1/Module/rtmp.h:2213: warning: function declaration isn't a prototype
/home/niko/wlan/rt61-1.1.0-b1/Module/rtmp.h:2216: error: syntax error before "pAd"
/home/niko/wlan/rt61-1.1.0-b1/Module/rtmp.h:2217: warning: function declaration isn't a prototype
/home/niko/wlan/rt61-1.1.0-b1/Module/rtmp.h:2220: error: syntax error before "pAd"
/home/niko/wlan/rt61-1.1.0-b1/Module/rtmp.h:2221: warning: function declaration isn't a prototype
/home/niko/wlan/rt61-1.1.0-b1/Module/rtmp.h:2224: error: syntax error before "pAd"
/home/niko/wlan/rt61-1.1.0-b1/Module/rtmp.h:2225: warning: function declaration isn't a prototype
/home/niko/wlan/rt61-1.1.0-b1/Module/rtmp.h:2228: error: syntax error before "pAd"
/home/niko/wlan/rt61-1.1.0-b1/Module/rtmp.h:2229: warning: function declaration isn't a prototype
/home/niko/wlan/rt61-1.1.0-b1/Module/rtmp.h:2232: error: syntax error before "pAd"
/home/niko/wlan/rt61-1.1.0-b1/Module/rtmp.h:2233: warning: function declaration isn't a prototype
/home/niko/wlan/rt61-1.1.0-b1/Module/rtmp.h:2236: error: syntax error before "pAd"
/home/niko/wlan/rt61-1.1.0-b1/Module/rtmp.h:2237: warning: function declaration isn't a prototype
/home/niko/wlan/rt61-1.1.0-b1/Module/rtmp.h:2240: error: syntax error before "pAd"
/home/niko/wlan/rt61-1.1.0-b1/Module/rtmp.h:2241: warning: function declaration isn't a prototype
/home/niko/wlan/rt61-1.1.0-b1/Module/rtmp.h:2244: error: syntax error before "pAd"
/home/niko/wlan/rt61-1.1.0-b1/Module/rtmp.h:2245: warning: function declaration isn't a prototype
/home/niko/wlan/rt61-1.1.0-b1/Module/rtmp.h:2248: error: syntax error before "pAd"
/home/niko/wlan/rt61-1.1.0-b1/Module/rtmp.h:2248: warning: function declaration isn't a prototype
/home/niko/wlan/rt61-1.1.0-b1/Module/rtmp.h:2251: error: syntax error before "pAd"
/home/niko/wlan/rt61-1.1.0-b1/Module/rtmp.h:2251: warning: function declaration isn't a prototype
/home/niko/wlan/rt61-1.1.0-b1/Module/rtmp.h:2254: error: syntax error before "pAd"
/home/niko/wlan/rt61-1.1.0-b1/Module/rtmp.h:2256: warning: function declaration isn't a prototype
/home/niko/wlan/rt61-1.1.0-b1/Module/rtmp.h:2259: error: syntax error before "pAd"
/home/niko/wlan/rt61-1.1.0-b1/Module/rtmp.h:2264: warning: function declaration isn't a prototype
/home/niko/wlan/rt61-1.1.0-b1/Module/rtmp.h:2267: error: syntax error before "pAd"
/home/niko/wlan/rt61-1.1.0-b1/Module/rtmp.h:2272: warning: function declaration isn't a prototype
/home/niko/wlan/rt61-1.1.0-b1/Module/rtmp.h:2275: error: syntax error before "pAd"
/home/niko/wlan/rt61-1.1.0-b1/Module/rtmp.h:2278: warning: function declaration isn't a prototype
/home/niko/wlan/rt61-1.1.0-b1/Module/rtmp.h:2281: error: syntax error before "pAd"
/home/niko/wlan/rt61-1.1.0-b1/Module/rtmp.h:2284: warning: function declaration isn't a prototype
/home/niko/wlan/rt61-1.1.0-b1/Module/rtmp.h:2287: error: syntax error before "pAd"
/home/niko/wlan/rt61-1.1.0-b1/Module/rtmp.h:2290: warning: function declaration isn't a prototype
/home/niko/wlan/rt61-1.1.0-b1/Module/rtmp.h:2293: error: syntax error before "pAd"
/home/niko/wlan/rt61-1.1.0-b1/Module/rtmp.h:2293: warning: function declaration isn't a prototype
/home/niko/wlan/rt61-1.1.0-b1/Module/rtmp.h:2296: error: syntax error before "pAd"
/home/niko/wlan/rt61-1.1.0-b1/Module/rtmp.h:2296: warning: function declaration isn't a prototype
/home/niko/wlan/rt61-1.1.0-b1/Module/rtmp.h:2299: error: syntax error before "pAd"
/home/niko/wlan/rt61-1.1.0-b1/Module/rtmp.h:2299: warning: function declaration isn't a prototype
/home/niko/wlan/rt61-1.1.0-b1/Module/rtmp.h:2305: error: syntax error before "pAd"
/home/niko/wlan/rt61-1.1.0-b1/Module/rtmp.h:2307: warning: function declaration isn't a prototype
/home/niko/wlan/rt61-1.1.0-b1/Module/rtmp.h:2316: error: syntax error before "pAd"
/home/niko/wlan/rt61-1.1.0-b1/Module/rtmp.h:2317: warning: function declaration isn't a prototype
/home/niko/wlan/rt61-1.1.0-b1/Module/rtmp.h:2320: error: syntax error before "pAd"
/home/niko/wlan/rt61-1.1.0-b1/Module/rtmp.h:2321: warning: function declaration isn't a prototype
/home/niko/wlan/rt61-1.1.0-b1/Module/rtmp.h:2324: error: syntax error before "pAd"
/home/niko/wlan/rt61-1.1.0-b1/Module/rtmp.h:2325: warning: function declaration isn't a prototype
/home/niko/wlan/rt61-1.1.0-b1/Module/rtmp.h:2328: error: syntax error before "pAd"
/home/niko/wlan/rt61-1.1.0-b1/Module/rtmp.h:2329: warning: function declaration isn't a prototype
/home/niko/wlan/rt61-1.1.0-b1/Module/rtmp.h:2332: error: syntax error before "pAd"
/home/niko/wlan/rt61-1.1.0-b1/Module/rtmp.h:2333: warning: function declaration isn't a prototype
/home/niko/wlan/rt61-1.1.0-b1/Module/rtmp.h:2336: error: syntax error before "pAd"
/home/niko/wlan/rt61-1.1.0-b1/Module/rtmp.h:2337: warning: function declaration isn't a prototype
/home/niko/wlan/rt61-1.1.0-b1/Module/rtmp.h:2340: error: syntax error before "pAd"
/home/niko/wlan/rt61-1.1.0-b1/Module/rtmp.h:2341: warning: function declaration isn't a prototype
/home/niko/wlan/rt61-1.1.0-b1/Module/rtmp.h:2344: error: syntax error before "pAd"
/home/niko/wlan/rt61-1.1.0-b1/Module/rtmp.h:2345: warning: function declaration isn't a prototype
/home/niko/wlan/rt61-1.1.0-b1/Module/rtmp.h:2348: error: syntax error before "pAd"
/home/niko/wlan/rt61-1.1.0-b1/Module/rtmp.h:2349: warning: function declaration isn't a prototype
/home/niko/wlan/rt61-1.1.0-b1/Module/rtmp.h:2352: error: syntax error before "pAd"
/home/niko/wlan/rt61-1.1.0-b1/Module/rtmp.h:2352: warning: function declaration isn't a prototype
/home/niko/wlan/rt61-1.1.0-b1/Module/rtmp.h:2355: error: syntax error before "pAd"
/home/niko/wlan/rt61-1.1.0-b1/Module/rtmp.h:2356: warning: function declaration isn't a prototype
/home/niko/wlan/rt61-1.1.0-b1/Module/rtmp.h:2359: error: syntax error before "pAd"
/home/niko/wlan/rt61-1.1.0-b1/Module/rtmp.h:2360: warning: function declaration isn't a prototype
/home/niko/wlan/rt61-1.1.0-b1/Module/rtmp.h:2363: error: syntax error before "pAd"
/home/niko/wlan/rt61-1.1.0-b1/Module/rtmp.h:2364: warning: function declaration isn't a prototype
/home/niko/wlan/rt61-1.1.0-b1/Module/rtmp.h:2367: error: syntax error before "pAd"
/home/niko/wlan/rt61-1.1.0-b1/Module/rtmp.h:2367: warning: function declaration isn't a prototype
/home/niko/wlan/rt61-1.1.0-b1/Module/rtmp.h:2370: error: syntax error before "pAd"
/home/niko/wlan/rt61-1.1.0-b1/Module/rtmp.h:2370: warning: function declaration isn't a prototype
/home/niko/wlan/rt61-1.1.0-b1/Module/rtmp.h:2373: error: syntax error before "pAd"
/home/niko/wlan/rt61-1.1.0-b1/Module/rtmp.h:2373: warning: function declaration isn't a prototype
/home/niko/wlan/rt61-1.1.0-b1/Module/rtmp.h:2376: error: syntax error before "pAd"
/home/niko/wlan/rt61-1.1.0-b1/Module/rtmp.h:2376: warning: function declaration isn't a prototype
/home/niko/wlan/rt61-1.1.0-b1/Module/rtmp.h:2379: error: syntax error before "pAd"
/home/niko/wlan/rt61-1.1.0-b1/Module/rtmp.h:2380: warning: function declaration isn't a prototype
/home/niko/wlan/rt61-1.1.0-b1/Module/rtmp.h:2383: error: syntax error before "pAd"
/home/niko/wlan/rt61-1.1.0-b1/Module/rtmp.h:2383: warning: function declaration isn't a prototype
/home/niko/wlan/rt61-1.1.0-b1/Module/rtmp.h:2386: error: syntax error before "pAd"
/home/niko/wlan/rt61-1.1.0-b1/Module/rtmp.h:2388: warning: function declaration isn't a prototype
/home/niko/wlan/rt61-1.1.0-b1/Module/rtmp.h:2394: error: syntax error before "pAd"
/home/niko/wlan/rt61-1.1.0-b1/Module/rtmp.h:2400: warning: function declaration isn't a prototype
/home/niko/wlan/rt61-1.1.0-b1/Module/rtmp.h:2403: error: syntax error before "pAd"
/home/niko/wlan/rt61-1.1.0-b1/Module/rtmp.h:2407: warning: function declaration isn't a prototype
/home/niko/wlan/rt61-1.1.0-b1/Module/rtmp.h:2410: error: syntax error before "pAd"
/home/niko/wlan/rt61-1.1.0-b1/Module/rtmp.h:2416: warning: function declaration isn't a prototype
/home/niko/wlan/rt61-1.1.0-b1/Module/rtmp.h:2419: error: syntax error before "pAd"
/home/niko/wlan/rt61-1.1.0-b1/Module/rtmp.h:2424: warning: function declaration isn't a prototype
/home/niko/wlan/rt61-1.1.0-b1/Module/rtmp.h:2427: error: syntax error before "pAd"
/home/niko/wlan/rt61-1.1.0-b1/Module/rtmp.h:2438: warning: function declaration isn't a prototype
/home/niko/wlan/rt61-1.1.0-b1/Module/rtmp.h:2441: error: syntax error before "pAd"
/home/niko/wlan/rt61-1.1.0-b1/Module/rtmp.h:2445: warning: function declaration isn't a prototype
/home/niko/wlan/rt61-1.1.0-b1/Module/rtmp.h:2448: error: syntax error before "pAd"
/home/niko/wlan/rt61-1.1.0-b1/Module/rtmp.h:2452: warning: function declaration isn't a prototype
/home/niko/wlan/rt61-1.1.0-b1/Module/rtmp.h:2455: error: syntax error before "pAd"
/home/niko/wlan/rt61-1.1.0-b1/Module/rtmp.h:2462: warning: function declaration isn't a prototype
/home/niko/wlan/rt61-1.1.0-b1/Module/rtmp.h:2465: error: syntax error before "pAd"
/home/niko/wlan/rt61-1.1.0-b1/Module/rtmp.h:2470: warning: function declaration isn't a prototype
/home/niko/wlan/rt61-1.1.0-b1/Module/rtmp.h:2473: error: syntax error before "pAd"
/home/niko/wlan/rt61-1.1.0-b1/Module/rtmp.h:2504: warning: function declaration isn't a prototype
/home/niko/wlan/rt61-1.1.0-b1/Module/rtmp.h:2516: error: syntax error before "pAd"
/home/niko/wlan/rt61-1.1.0-b1/Module/rtmp.h:2517: warning: function declaration isn't a prototype
/home/niko/wlan/rt61-1.1.0-b1/Module/rtmp.h:2523: error: syntax error before "pAd"
/home/niko/wlan/rt61-1.1.0-b1/Module/rtmp.h:2524: warning: function declaration isn't a prototype
/home/niko/wlan/rt61-1.1.0-b1/Module/rtmp.h:2530: error: syntax error before "pAd"
/home/niko/wlan/rt61-1.1.0-b1/Module/rtmp.h:2531: warning: function declaration isn't a prototype
/home/niko/wlan/rt61-1.1.0-b1/Module/rtmp.h:2534: error: syntax error before "pAd"
/home/niko/wlan/rt61-1.1.0-b1/Module/rtmp.h:2535: warning: function declaration isn't a prototype
/home/niko/wlan/rt61-1.1.0-b1/Module/rtmp.h:2538: error: syntax error before "pAd"
/home/niko/wlan/rt61-1.1.0-b1/Module/rtmp.h:2538: warning: function declaration isn't a prototype
/home/niko/wlan/rt61-1.1.0-b1/Module/rtmp.h:2541: error: syntax error before "pAd"
/home/niko/wlan/rt61-1.1.0-b1/Module/rtmp.h:2543: warning: function declaration isn't a prototype
/home/niko/wlan/rt61-1.1.0-b1/Module/rtmp.h:2546: error: syntax error before "pAd"
/home/niko/wlan/rt61-1.1.0-b1/Module/rtmp.h:2546: warning: function declaration isn't a prototype
/home/niko/wlan/rt61-1.1.0-b1/Module/rtmp.h:2549: error: syntax error before "pAd"
/home/niko/wlan/rt61-1.1.0-b1/Module/rtmp.h:2549: warning: function declaration isn't a prototype
/home/niko/wlan/rt61-1.1.0-b1/Module/rtmp.h:2552: error: syntax error before "pAd"
/home/niko/wlan/rt61-1.1.0-b1/Module/rtmp.h:2552: warning: function declaration isn't a prototype
/home/niko/wlan/rt61-1.1.0-b1/Module/rtmp.h:2555: error: syntax error before "pAd"
/home/niko/wlan/rt61-1.1.0-b1/Module/rtmp.h:2556: warning: function declaration isn't a prototype
/home/niko/wlan/rt61-1.1.0-b1/Module/rtmp.h:2559: error: syntax error before "pAd"
/home/niko/wlan/rt61-1.1.0-b1/Module/rtmp.h:2561: warning: function declaration isn't a prototype
/home/niko/wlan/rt61-1.1.0-b1/Module/rtmp.h:2567: error: syntax error before "pAd"
/home/niko/wlan/rt61-1.1.0-b1/Module/rtmp.h:2571: warning: function declaration isn't a prototype
/home/niko/wlan/rt61-1.1.0-b1/Module/rtmp.h:2574: error: syntax error before "pAd"
/home/niko/wlan/rt61-1.1.0-b1/Module/rtmp.h:2578: warning: function declaration isn't a prototype
/home/niko/wlan/rt61-1.1.0-b1/Module/rtmp.h:2581: error: syntax error before "pAd"
/home/niko/wlan/rt61-1.1.0-b1/Module/rtmp.h:2586: warning: function declaration isn't a prototype
/home/niko/wlan/rt61-1.1.0-b1/Module/rtmp.h:2589: error: syntax error before "pAd"
/home/niko/wlan/rt61-1.1.0-b1/Module/rtmp.h:2589: warning: function declaration isn't a prototype
/home/niko/wlan/rt61-1.1.0-b1/Module/rtmp.h:2592: error: syntax error before "pAd"
/home/niko/wlan/rt61-1.1.0-b1/Module/rtmp.h:2592: warning: function declaration isn't a prototype
/home/niko/wlan/rt61-1.1.0-b1/Module/rtmp.h:2595: error: syntax error before "pAdapter"
/home/niko/wlan/rt61-1.1.0-b1/Module/rtmp.h:2596: warning: function declaration isn't a prototype
/home/niko/wlan/rt61-1.1.0-b1/Module/rtmp.h:2599: error: syntax error before "pAdapter"
/home/niko/wlan/rt61-1.1.0-b1/Module/rtmp.h:2599: warning: function declaration isn't a prototype
/home/niko/wlan/rt61-1.1.0-b1/Module/rtmp.h:2602: error: syntax error before "pAd"
/home/niko/wlan/rt61-1.1.0-b1/Module/rtmp.h:2602: warning: function declaration isn't a prototype
/home/niko/wlan/rt61-1.1.0-b1/Module/rtmp.h:2605: error: syntax error before "pAd"
/home/niko/wlan/rt61-1.1.0-b1/Module/rtmp.h:2605: warning: function declaration isn't a prototype
/home/niko/wlan/rt61-1.1.0-b1/Module/rtmp.h:2608: error: syntax error before "pAdapter"
/home/niko/wlan/rt61-1.1.0-b1/Module/rtmp.h:2610: warning: function declaration isn't a prototype
/home/niko/wlan/rt61-1.1.0-b1/Module/rtmp.h:2613: error: syntax error before "pAdapter"
/home/niko/wlan/rt61-1.1.0-b1/Module/rtmp.h:2614: warning: function declaration isn't a prototype
/home/niko/wlan/rt61-1.1.0-b1/Module/rtmp.h:2617: error: syntax error before "pAd"
/home/niko/wlan/rt61-1.1.0-b1/Module/rtmp.h:2619: warning: function declaration isn't a prototype
/home/niko/wlan/rt61-1.1.0-b1/Module/rtmp.h:2628: error: syntax error before "pAdapter"
/home/niko/wlan/rt61-1.1.0-b1/Module/rtmp.h:2629: warning: function declaration isn't a prototype
/home/niko/wlan/rt61-1.1.0-b1/Module/rtmp.h:2632: error: syntax error before "pAd"
/home/niko/wlan/rt61-1.1.0-b1/Module/rtmp.h:2633: warning: function declaration isn't a prototype
/home/niko/wlan/rt61-1.1.0-b1/Module/rtmp.h:2636: error: syntax error before "pAdapter"
/home/niko/wlan/rt61-1.1.0-b1/Module/rtmp.h:2639: warning: function declaration isn't a prototype
/home/niko/wlan/rt61-1.1.0-b1/Module/rtmp.h:2642: error: syntax error before "pAd"
/home/niko/wlan/rt61-1.1.0-b1/Module/rtmp.h:2645: warning: function declaration isn't a prototype
/home/niko/wlan/rt61-1.1.0-b1/Module/rtmp.h:2648: error: syntax error before "pAd"
/home/niko/wlan/rt61-1.1.0-b1/Module/rtmp.h:2653: warning: function declaration isn't a prototype
/home/niko/wlan/rt61-1.1.0-b1/Module/rtmp.h:2657: error: syntax error before "pAd"
/home/niko/wlan/rt61-1.1.0-b1/Module/rtmp.h:2659: warning: function declaration isn't a prototype
/home/niko/wlan/rt61-1.1.0-b1/Module/rtmp.h:2663: error: syntax error before "pAdapter"
/home/niko/wlan/rt61-1.1.0-b1/Module/rtmp.h:2665: warning: function declaration isn't a prototype
/home/niko/wlan/rt61-1.1.0-b1/Module/rtmp.h:2668: error: syntax error before "pAd"
/home/niko/wlan/rt61-1.1.0-b1/Module/rtmp.h:2683: warning: function declaration isn't a prototype
/home/niko/wlan/rt61-1.1.0-b1/Module/rtmp.h:2686: error: syntax error before "pAdapter"
/home/niko/wlan/rt61-1.1.0-b1/Module/rtmp.h:2687: warning: function declaration isn't a prototype
/home/niko/wlan/rt61-1.1.0-b1/Module/rtmp.h:2690: error: syntax error before "pAdapter"
/home/niko/wlan/rt61-1.1.0-b1/Module/rtmp.h:2691: warning: function declaration isn't a prototype
/home/niko/wlan/rt61-1.1.0-b1/Module/rtmp.h:2694: error: syntax error before "pAd"
/home/niko/wlan/rt61-1.1.0-b1/Module/rtmp.h:2694: warning: function declaration isn't a prototype
/home/niko/wlan/rt61-1.1.0-b1/Module/rtmp.h:2697: error: syntax error before "pAd"
/home/niko/wlan/rt61-1.1.0-b1/Module/rtmp.h:2697: warning: function declaration isn't a prototype
/home/niko/wlan/rt61-1.1.0-b1/Module/rtmp.h:2700: error: syntax error before "pAd"
/home/niko/wlan/rt61-1.1.0-b1/Module/rtmp.h:2702: warning: function declaration isn't a prototype
/home/niko/wlan/rt61-1.1.0-b1/Module/rtmp.h:2705: error: syntax error before "pAd"
/home/niko/wlan/rt61-1.1.0-b1/Module/rtmp.h:2707: warning: function declaration isn't a prototype
/home/niko/wlan/rt61-1.1.0-b1/Module/rtmp.h:2710: error: syntax error before "pAdapter"
/home/niko/wlan/rt61-1.1.0-b1/Module/rtmp.h:2711: warning: function declaration isn't a prototype
/home/niko/wlan/rt61-1.1.0-b1/Module/rtmp.h:2714: error: syntax error before "pAd"
/home/niko/wlan/rt61-1.1.0-b1/Module/rtmp.h:2715: warning: function declaration isn't a prototype
/home/niko/wlan/rt61-1.1.0-b1/Module/rtmp.h:2718: error: syntax error before "pAdapter"
/home/niko/wlan/rt61-1.1.0-b1/Module/rtmp.h:2720: warning: function declaration isn't a prototype
/home/niko/wlan/rt61-1.1.0-b1/Module/rtmp.h:2723: error: syntax error before "pAdapter"
/home/niko/wlan/rt61-1.1.0-b1/Module/rtmp.h:2726: warning: function declaration isn't a prototype
/home/niko/wlan/rt61-1.1.0-b1/Module/rtmp.h:2729: error: syntax error before "pAdapter"
/home/niko/wlan/rt61-1.1.0-b1/Module/rtmp.h:2730: warning: function declaration isn't a prototype
/home/niko/wlan/rt61-1.1.0-b1/Module/rtmp.h:2733: error: syntax error before "pAd"
/home/niko/wlan/rt61-1.1.0-b1/Module/rtmp.h:2735: warning: function declaration isn't a prototype
/home/niko/wlan/rt61-1.1.0-b1/Module/rtmp.h:2738: error: syntax error before "pAd"
/home/niko/wlan/rt61-1.1.0-b1/Module/rtmp.h:2739: warning: function declaration isn't a prototype
/home/niko/wlan/rt61-1.1.0-b1/Module/rtmp.h:2742: error: syntax error before "pAd"
/home/niko/wlan/rt61-1.1.0-b1/Module/rtmp.h:2743: warning: function declaration isn't a prototype
/home/niko/wlan/rt61-1.1.0-b1/Module/rtmp.h:2750: error: syntax error before "pAdapter"
/home/niko/wlan/rt61-1.1.0-b1/Module/rtmp.h:2754: warning: function declaration isn't a prototype
/home/niko/wlan/rt61-1.1.0-b1/Module/rtmp.h:2757: error: syntax error before "pAdapter"
/home/niko/wlan/rt61-1.1.0-b1/Module/rtmp.h:2760: warning: function declaration isn't a prototype
/home/niko/wlan/rt61-1.1.0-b1/Module/rtmp.h:2788: error: syntax error before "pAdapter"
/home/niko/wlan/rt61-1.1.0-b1/Module/rtmp.h:2789: warning: function declaration isn't a prototype
/home/niko/wlan/rt61-1.1.0-b1/Module/rtmp.h:2795: error: syntax error before "pAdapter"
/home/niko/wlan/rt61-1.1.0-b1/Module/rtmp.h:2802: warning: function declaration isn't a prototype
/home/niko/wlan/rt61-1.1.0-b1/Module/rtmp.h:2805: error: syntax error before "pAdapter"
/home/niko/wlan/rt61-1.1.0-b1/Module/rtmp.h:2810: warning: function declaration isn't a prototype
/home/niko/wlan/rt61-1.1.0-b1/Module/rtmp.h:2813: error: syntax error before "pAdapter"
/home/niko/wlan/rt61-1.1.0-b1/Module/rtmp.h:2818: warning: function declaration isn't a prototype
/home/niko/wlan/rt61-1.1.0-b1/Module/rtmp.h:2821: error: syntax error before "pAdapter"
/home/niko/wlan/rt61-1.1.0-b1/Module/rtmp.h:2824: warning: function declaration isn't a prototype
/home/niko/wlan/rt61-1.1.0-b1/Module/rtmp.h:2827: error: syntax error before "pAdapter"
/home/niko/wlan/rt61-1.1.0-b1/Module/rtmp.h:2833: warning: function declaration isn't a prototype
/home/niko/wlan/rt61-1.1.0-b1/Module/rtmp.h:2851: error: syntax error before "pAd"
/home/niko/wlan/rt61-1.1.0-b1/Module/rtmp.h:2853: warning: function declaration isn't a prototype
/home/niko/wlan/rt61-1.1.0-b1/Module/rtmp.h:2856: error: syntax error before "pAd"
/home/niko/wlan/rt61-1.1.0-b1/Module/rtmp.h:2857: warning: function declaration isn't a prototype
/home/niko/wlan/rt61-1.1.0-b1/Module/rtmp.h:2860: error: syntax error before "pAd"
/home/niko/wlan/rt61-1.1.0-b1/Module/rtmp.h:2861: warning: function declaration isn't a prototype
/home/niko/wlan/rt61-1.1.0-b1/Module/rtmp.h:2864: error: syntax error before "pAd"
/home/niko/wlan/rt61-1.1.0-b1/Module/rtmp.h:2865: warning: function declaration isn't a prototype
/home/niko/wlan/rt61-1.1.0-b1/Module/rtmp.h:2868: error: syntax error before "pAd"
/home/niko/wlan/rt61-1.1.0-b1/Module/rtmp.h:2869: warning: function declaration isn't a prototype
/home/niko/wlan/rt61-1.1.0-b1/Module/rtmp.h:2872: error: syntax error before "pAd"
/home/niko/wlan/rt61-1.1.0-b1/Module/rtmp.h:2875: warning: function declaration isn't a prototype
/home/niko/wlan/rt61-1.1.0-b1/Module/rtmp.h:2878: error: syntax error before "pAd"
/home/niko/wlan/rt61-1.1.0-b1/Module/rtmp.h:2879: warning: function declaration isn't a prototype
/home/niko/wlan/rt61-1.1.0-b1/Module/rtmp.h:2882: error: syntax error before "pAd"
/home/niko/wlan/rt61-1.1.0-b1/Module/rtmp.h:2883: warning: function declaration isn't a prototype
/home/niko/wlan/rt61-1.1.0-b1/Module/rtmp.h:2886: error: syntax error before "pAd"
/home/niko/wlan/rt61-1.1.0-b1/Module/rtmp.h:2888: warning: function declaration isn't a prototype
/home/niko/wlan/rt61-1.1.0-b1/Module/rtmp.h:2891: error: syntax error before "pAd"
/home/niko/wlan/rt61-1.1.0-b1/Module/rtmp.h:2893: warning: function declaration isn't a prototype
/home/niko/wlan/rt61-1.1.0-b1/Module/rtmp.h:2896: error: syntax error before "pAd"
/home/niko/wlan/rt61-1.1.0-b1/Module/rtmp.h:2898: warning: function declaration isn't a prototype
/home/niko/wlan/rt61-1.1.0-b1/Module/rtmp.h:2927: error: syntax error before "pAd"
/home/niko/wlan/rt61-1.1.0-b1/Module/rtmp.h:2928: warning: function declaration isn't a prototype
/home/niko/wlan/rt61-1.1.0-b1/Module/rtmp.h:2938: error: syntax error before "pAd"
/home/niko/wlan/rt61-1.1.0-b1/Module/rtmp.h:2941: warning: function declaration isn't a prototype
/home/niko/wlan/rt61-1.1.0-b1/Module/rtmp.h:2948: error: syntax error before "pAdapter"
/home/niko/wlan/rt61-1.1.0-b1/Module/rtmp.h:2950: warning: function declaration isn't a prototype
/home/niko/wlan/rt61-1.1.0-b1/Module/rtmp.h:2953: error: syntax error before "pAdapter"
/home/niko/wlan/rt61-1.1.0-b1/Module/rtmp.h:2955: warning: function declaration isn't a prototype
/home/niko/wlan/rt61-1.1.0-b1/Module/rtmp.h:2958: error: syntax error before "pAd"
/home/niko/wlan/rt61-1.1.0-b1/Module/rtmp.h:2959: warning: function declaration isn't a prototype
/home/niko/wlan/rt61-1.1.0-b1/Module/rtmp.h:2962: error: syntax error before "pAd"
/home/niko/wlan/rt61-1.1.0-b1/Module/rtmp.h:2963: warning: function declaration isn't a prototype
/home/niko/wlan/rt61-1.1.0-b1/Module/rtmp.h:2966: error: syntax error before "pAd"
/home/niko/wlan/rt61-1.1.0-b1/Module/rtmp.h:2966: warning: function declaration isn't a prototype
/home/niko/wlan/rt61-1.1.0-b1/Module/rtmp.h:2969: error: syntax error before "pAd"
/home/niko/wlan/rt61-1.1.0-b1/Module/rtmp.h:2969: warning: function declaration isn't a prototype
/home/niko/wlan/rt61-1.1.0-b1/Module/rtmp.h:2972: error: syntax error before "pAd"
/home/niko/wlan/rt61-1.1.0-b1/Module/rtmp.h:2973: warning: function declaration isn't a prototype
/home/niko/wlan/rt61-1.1.0-b1/Module/rtmp.h:2976: error: syntax error before "pAdapter"
/home/niko/wlan/rt61-1.1.0-b1/Module/rtmp.h:2977: warning: function declaration isn't a prototype
/home/niko/wlan/rt61-1.1.0-b1/Module/rtmp.h:2980: error: syntax error before "pAd"
/home/niko/wlan/rt61-1.1.0-b1/Module/rtmp.h:2981: warning: function declaration isn't a prototype
/home/niko/wlan/rt61-1.1.0-b1/Module/rtmp.h:2984: error: syntax error before "pAd"
/home/niko/wlan/rt61-1.1.0-b1/Module/rtmp.h:2985: warning: function declaration isn't a prototype
/home/niko/wlan/rt61-1.1.0-b1/Module/rtmp.h:2988: error: syntax error before "pAd"
/home/niko/wlan/rt61-1.1.0-b1/Module/rtmp.h:2989: warning: function declaration isn't a prototype
/home/niko/wlan/rt61-1.1.0-b1/Module/rtmp.h:2992: error: syntax error before "pAdapter"
/home/niko/wlan/rt61-1.1.0-b1/Module/rtmp.h:2993: warning: function declaration isn't a prototype
/home/niko/wlan/rt61-1.1.0-b1/Module/rtmp.h:2996: error: syntax error before "pAdapter"
/home/niko/wlan/rt61-1.1.0-b1/Module/rtmp.h:2997: warning: function declaration isn't a prototype
/home/niko/wlan/rt61-1.1.0-b1/Module/rtmp.h:3000: error: syntax error before "pAdapter"
/home/niko/wlan/rt61-1.1.0-b1/Module/rtmp.h:3001: warning: function declaration isn't a prototype
/home/niko/wlan/rt61-1.1.0-b1/Module/rtmp.h:3004: error: syntax error before "pAdapter"
/home/niko/wlan/rt61-1.1.0-b1/Module/rtmp.h:3005: warning: function declaration isn't a prototype
/home/niko/wlan/rt61-1.1.0-b1/Module/rtmp.h:3008: error: syntax error before "pAdapter"
/home/niko/wlan/rt61-1.1.0-b1/Module/rtmp.h:3009: warning: function declaration isn't a prototype
/home/niko/wlan/rt61-1.1.0-b1/Module/rtmp.h:3012: error: syntax error before "pAdapter"
/home/niko/wlan/rt61-1.1.0-b1/Module/rtmp.h:3013: warning: function declaration isn't a prototype
/home/niko/wlan/rt61-1.1.0-b1/Module/rtmp.h:3016: error: syntax error before "pAdapter"
/home/niko/wlan/rt61-1.1.0-b1/Module/rtmp.h:3017: warning: function declaration isn't a prototype
/home/niko/wlan/rt61-1.1.0-b1/Module/rtmp.h:3020: error: syntax error before "pAdapter"
/home/niko/wlan/rt61-1.1.0-b1/Module/rtmp.h:3021: warning: function declaration isn't a prototype
/home/niko/wlan/rt61-1.1.0-b1/Module/rtmp.h:3024: error: syntax error before "pAdapter"
/home/niko/wlan/rt61-1.1.0-b1/Module/rtmp.h:3025: warning: function declaration isn't a prototype
/home/niko/wlan/rt61-1.1.0-b1/Module/rtmp.h:3028: error: syntax error before "pAdapter"
/home/niko/wlan/rt61-1.1.0-b1/Module/rtmp.h:3029: warning: function declaration isn't a prototype
/home/niko/wlan/rt61-1.1.0-b1/Module/rtmp.h:3032: error: syntax error before "pAdapter"
/home/niko/wlan/rt61-1.1.0-b1/Module/rtmp.h:3033: warning: function declaration isn't a prototype
/home/niko/wlan/rt61-1.1.0-b1/Module/rtmp.h:3037: error: syntax error before "pAd"
/home/niko/wlan/rt61-1.1.0-b1/Module/rtmp.h:3038: warning: function declaration isn't a prototype
/home/niko/wlan/rt61-1.1.0-b1/Module/rtmp.h:3042: error: syntax error before "pAdapter"
/home/niko/wlan/rt61-1.1.0-b1/Module/rtmp.h:3043: warning: function declaration isn't a prototype
/home/niko/wlan/rt61-1.1.0-b1/Module/rtmp.h:3047: error: syntax error before "pAd"
/home/niko/wlan/rt61-1.1.0-b1/Module/rtmp.h:3048: warning: function declaration isn't a prototype
/home/niko/wlan/rt61-1.1.0-b1/Module/rtmp.h:3052: error: syntax error before "pAdapter"
/home/niko/wlan/rt61-1.1.0-b1/Module/rtmp.h:3053: warning: function declaration isn't a prototype
/home/niko/wlan/rt61-1.1.0-b1/Module/rtmp.h:3056: error: syntax error before "pAd"
/home/niko/wlan/rt61-1.1.0-b1/Module/rtmp.h:3057: warning: function declaration isn't a prototype
/home/niko/wlan/rt61-1.1.0-b1/Module/rtmp.h:3060: error: syntax error before "pAdapter"
/home/niko/wlan/rt61-1.1.0-b1/Module/rtmp.h:3061: warning: function declaration isn't a prototype
/home/niko/wlan/rt61-1.1.0-b1/Module/rtmp.h:3064: error: syntax error before "pAdapter"
/home/niko/wlan/rt61-1.1.0-b1/Module/rtmp.h:3065: warning: function declaration isn't a prototype
/home/niko/wlan/rt61-1.1.0-b1/Module/rtmp.h:3068: error: syntax error before "pAdapter"
/home/niko/wlan/rt61-1.1.0-b1/Module/rtmp.h:3069: warning: function declaration isn't a prototype
/home/niko/wlan/rt61-1.1.0-b1/Module/rtmp.h:3072: error: syntax error before "pAdapter"
/home/niko/wlan/rt61-1.1.0-b1/Module/rtmp.h:3073: warning: function declaration isn't a prototype
/home/niko/wlan/rt61-1.1.0-b1/Module/rtmp.h:3076: error: syntax error before "pAdapter"
/home/niko/wlan/rt61-1.1.0-b1/Module/rtmp.h:3077: warning: function declaration isn't a prototype
/home/niko/wlan/rt61-1.1.0-b1/Module/rtmp.h:3080: error: syntax error before "pAdapter"
/home/niko/wlan/rt61-1.1.0-b1/Module/rtmp.h:3081: warning: function declaration isn't a prototype
/home/niko/wlan/rt61-1.1.0-b1/Module/rtmp.h:3084: error: syntax error before "pAdapter"
/home/niko/wlan/rt61-1.1.0-b1/Module/rtmp.h:3085: warning: function declaration isn't a prototype
/home/niko/wlan/rt61-1.1.0-b1/Module/rtmp.h:3088: error: syntax error before "pAdapter"
/home/niko/wlan/rt61-1.1.0-b1/Module/rtmp.h:3089: warning: function declaration isn't a prototype
/home/niko/wlan/rt61-1.1.0-b1/Module/rtmp.h:3092: error: syntax error before "pAdapter"
/home/niko/wlan/rt61-1.1.0-b1/Module/rtmp.h:3093: warning: function declaration isn't a prototype
/home/niko/wlan/rt61-1.1.0-b1/Module/rtmp.h:3096: error: syntax error before "pAd"
/home/niko/wlan/rt61-1.1.0-b1/Module/rtmp.h:3097: warning: function declaration isn't a prototype
/home/niko/wlan/rt61-1.1.0-b1/Module/rtmp.h:3100: error: syntax error before "pAdapter"
/home/niko/wlan/rt61-1.1.0-b1/Module/rtmp.h:3101: warning: function declaration isn't a prototype
/home/niko/wlan/rt61-1.1.0-b1/Module/rtmp.h:3121: error: syntax error before "pAd"
/home/niko/wlan/rt61-1.1.0-b1/Module/rtmp.h:3122: warning: function declaration isn't a prototype
/home/niko/wlan/rt61-1.1.0-b1/Module/rtmp.h:3127: error: syntax error before "pAdapter"
/home/niko/wlan/rt61-1.1.0-b1/Module/rtmp.h:3128: warning: function declaration isn't a prototype
/home/niko/wlan/rt61-1.1.0-b1/Module/rtmp.h:3131: error: syntax error before "pAdapter"
/home/niko/wlan/rt61-1.1.0-b1/Module/rtmp.h:3132: warning: function declaration isn't a prototype
/home/niko/wlan/rt61-1.1.0-b1/Module/rtmp.h:3135: error: syntax error before "pAd"
/home/niko/wlan/rt61-1.1.0-b1/Module/rtmp.h:3136: warning: function declaration isn't a prototype
/home/niko/wlan/rt61-1.1.0-b1/Module/rtmp.h:3194: error: syntax error before "pAd"
/home/niko/wlan/rt61-1.1.0-b1/Module/rtmp.h:3197: warning: function declaration isn't a prototype
/home/niko/wlan/rt61-1.1.0-b1/Module/rtmp.h: In function `RTMPWriteTXRXCsr0':
/home/niko/wlan/rt61-1.1.0-b1/Module/rtmp.h:3200: error: `pAd' undeclared (first use in this function)
/home/niko/wlan/rt61-1.1.0-b1/Module/rtmp.h:3200: error: (Each undeclared identifier is reported only once
/home/niko/wlan/rt61-1.1.0-b1/Module/rtmp.h:3200: error: for each function it appears in.)
/home/niko/wlan/rt61-1.1.0-b1/Module/rtmp.h:3209: error: `disableRx' undeclared (first use in this function)
/home/niko/wlan/rt61-1.1.0-b1/Module/rtmp.h:3214: error: `dropControl' undeclared (first use in this function)
/home/niko/wlan/rt61-1.1.0-b1/Module/rtmp.h: At top level:
/home/niko/wlan/rt61-1.1.0-b1/Module/rtmp.h:3378: error: syntax error before "pAdapter"
/home/niko/wlan/rt61-1.1.0-b1/Module/rtmp.h:3379: warning: function declaration isn't a prototype
/home/niko/wlan/rt61-1.1.0-b1/Module/rtmp.h:3382: error: syntax error before "pAd"
/home/niko/wlan/rt61-1.1.0-b1/Module/rtmp.h:3385: warning: function declaration isn't a prototype
/home/niko/wlan/rt61-1.1.0-b1/Module/rtmp_main.c: In function `rt2x00_get_drvinfo':
/home/niko/wlan/rt61-1.1.0-b1/Module/rtmp_main.c:74: error: syntax error before "pAd"
/home/niko/wlan/rt61-1.1.0-b1/Module/rtmp_main.c:78: error: `pAd' undeclared (first use in this function)
/home/niko/wlan/rt61-1.1.0-b1/Module/rtmp_main.c: In function `rt2x00_get_regs':
/home/niko/wlan/rt61-1.1.0-b1/Module/rtmp_main.c:91: error: syntax error before "pAd"
/home/niko/wlan/rt61-1.1.0-b1/Module/rtmp_main.c:97: error: `pAd' undeclared (first use in this function)
/home/niko/wlan/rt61-1.1.0-b1/Module/rtmp_main.c: In function `rt2x00_get_eeprom':
/home/niko/wlan/rt61-1.1.0-b1/Module/rtmp_main.c:112: error: syntax error before "pAd"
/home/niko/wlan/rt61-1.1.0-b1/Module/rtmp_main.c:116: error: `pAd' undeclared (first use in this function)
/home/niko/wlan/rt61-1.1.0-b1/Module/rtmp_main.c: In function `RT61_probe':
/home/niko/wlan/rt61-1.1.0-b1/Module/rtmp_main.c:176: error: `pAd' undeclared (first use in this function)
/home/niko/wlan/rt61-1.1.0-b1/Module/rtmp_main.c:179: error: syntax error before '*' token
/home/niko/wlan/rt61-1.1.0-b1/Module/rtmp_main.c:224: error: `csr_addr' undeclared (first use in this function)
/home/niko/wlan/rt61-1.1.0-b1/Module/rtmp_main.c: In function `RT61_open':
/home/niko/wlan/rt61-1.1.0-b1/Module/rtmp_main.c:319: error: syntax error before "pAd"
/home/niko/wlan/rt61-1.1.0-b1/Module/rtmp_main.c:340: error: `pAd' undeclared (first use in this function)
/home/niko/wlan/rt61-1.1.0-b1/Module/rtmp_main.c: In function `RTMPSendPackets':
/home/niko/wlan/rt61-1.1.0-b1/Module/rtmp_main.c:520: error: syntax error before "pAdapter"
/home/niko/wlan/rt61-1.1.0-b1/Module/rtmp_main.c:532: error: `pAdapter' undeclared (first use in this function)
/home/niko/wlan/rt61-1.1.0-b1/Module/rtmp_main.c: In function `RTMPIsr':
/home/niko/wlan/rt61-1.1.0-b1/Module/rtmp_main.c:606: error: syntax error before "pAdapter"
/home/niko/wlan/rt61-1.1.0-b1/Module/rtmp_main.c:619: error: `pAdapter' undeclared (first use in this function)
/home/niko/wlan/rt61-1.1.0-b1/Module/rtmp_main.c:605: warning: unused variable `net_dev'
/home/niko/wlan/rt61-1.1.0-b1/Module/rtmp_main.c: In function `rt61_set_mac_address':
/home/niko/wlan/rt61-1.1.0-b1/Module/rtmp_main.c:704: error: `pAd' undeclared (first use in this function)
/home/niko/wlan/rt61-1.1.0-b1/Module/rtmp_main.c: In function `RT61_get_wireless_stats':
/home/niko/wlan/rt61-1.1.0-b1/Module/rtmp_main.c:760: error: `pAd' undeclared (first use in this function)
/home/niko/wlan/rt61-1.1.0-b1/Module/rtmp_main.c: In function `RT61_get_ether_stats':
/home/niko/wlan/rt61-1.1.0-b1/Module/rtmp_main.c:806: error: `pAd' undeclared (first use in this function)
/home/niko/wlan/rt61-1.1.0-b1/Module/rtmp_main.c: In function `RT61_set_rx_mode':
/home/niko/wlan/rt61-1.1.0-b1/Module/rtmp_main.c:865: error: `pAd' undeclared (first use in this function)
/home/niko/wlan/rt61-1.1.0-b1/Module/rtmp_main.c: In function `RT61_close':
/home/niko/wlan/rt61-1.1.0-b1/Module/rtmp_main.c:886: error: `pAd' undeclared (first use in this function)
/home/niko/wlan/rt61-1.1.0-b1/Module/rtmp_main.c: In function `RT61_remove_one':
/home/niko/wlan/rt61-1.1.0-b1/Module/rtmp_main.c:936: error: `pAd' undeclared (first use in this function)
/home/niko/wlan/rt61-1.1.0-b1/Module/rtmp_main.c: In function `rt61_suspend':
/home/niko/wlan/rt61-1.1.0-b1/Module/rtmp_main.c:984: error: syntax error before "pAdapter"
/home/niko/wlan/rt61-1.1.0-b1/Module/rtmp_main.c:994: error: `pAdapter' undeclared (first use in this function)
/home/niko/wlan/rt61-1.1.0-b1/Module/rtmp_main.c: In function `rt61_resume':
/home/niko/wlan/rt61-1.1.0-b1/Module/rtmp_main.c:1010: error: syntax error before "pAdapter"
/home/niko/wlan/rt61-1.1.0-b1/Module/rtmp_main.c:1019: error: `pAdapter' undeclared (first use in this function)
make[2]: *** [/home/niko/wlan/rt61-1.1.0-b1/Module/rtmp_main.o] Error 1
make[1]: *** [_module_/home/niko/wlan/rt61-1.1.0-b1/Module] Error 2
make[1]: Leaving directory `/usr/src/kernel-headers-2.6.8-3-686'
rt61.ko failed to build!
make: *** [module] Error 1
tmp_main.o] Error 1
make[1]: *** [_module_/home/niko/wlan/rt61-1.1.0-b1/Module] Error 2
make[1]: Leaving directory `/usr/src/kernel-headers-2.6.8-3-686'
rt61.ko failed to build!
make: *** [module] Error 1