All pastes #262369 Raw Edit

Untitled

public text v1 · immutable
#262369 ·published 2006-11-30 13:29 UTC
rendered paste body
ointer   -I./include -I/var/tmp/portage/pam-0.78-r3/work/Linux-PAM-0.78/libpam/include -I/var/tmp/portage/pam-0.78-r3/work/Linux-PAM-0.78 -I/var/tmp/portage/pam-0.78-r3/work/Linux-PAM-0.78/libpamc/include  -fPIC  -D"USE_LCKPWDF"  -DCRACKLIB_DICTS=\"/usr/lib/cracklib_dict\" -DCHKPWD_HELPER=\"/usr/sbin/unix_chkpwd\" -I../pammodutil/include -DWITH_SELINUX -DPAM_DYNAMIC   -c pam_unix_passwd.c -o dynamic/pam_unix_passwd.o
pam_unix_passwd.c: In function '_unix_run_shadow_binary':
pam_unix_passwd.c:278: error: invalid lvalue in assignment
pam_unix_passwd.c: In function 'save_old_password':
pam_unix_passwd.c:392: error: invalid lvalue in assignment
pam_unix_passwd.c:504: error: invalid lvalue in assignment
pam_unix_passwd.c: In function '_update_passwd':
pam_unix_passwd.c:532: error: invalid lvalue in assignment
pam_unix_passwd.c:618: error: invalid lvalue in assignment
pam_unix_passwd.c: In function '_update_shadow':
pam_unix_passwd.c:650: error: invalid lvalue in assignment
pam_unix_passwd.c:735: error: invalid lvalue in assignment
pam_unix_passwd.c: In function '_do_setpass':
pam_unix_passwd.c:776: error: invalid lvalue in assignment
pam_unix_passwd.c: In function '_unix_verify_shadow':
pam_unix_passwd.c:880: error: invalid lvalue in assignment
pam_unix_passwd.c: In function '_pam_unix_approve_pass':
pam_unix_passwd.c:955: warning: dereferencing type-punned pointer will break strict-aliasing rules
pam_unix_passwd.c: In function 'pam_sm_chauthtok':
pam_unix_passwd.c:1163: warning: dereferencing type-punned pointer will break strict-aliasing rules
pam_unix_passwd.c:1166: warning: dereferencing type-punned pointer will break strict-aliasing rules
make[2]: *** [dynamic/pam_unix_passwd.o] Error 1
make[2]: Leaving directory `/var/tmp/portage/pam-0.78-r3/work/Linux-PAM-0.78/modules/pam_unix'
make[1]: *** [all] Error 1
make[1]: Leaving directory `/var/tmp/portage/pam-0.78-r3/work/Linux-PAM-0.78/modules'
make: *** [modules] Error 2

!!! ERROR: sys-libs/pam-0.78-r3 failed.
Call stack:
  ebuild.sh, line 1546:   Called dyn_compile
  ebuild.sh, line 937:   Called src_compile
  pam-0.78-r3.ebuild, line 275:   Called die

!!! PAM build failed
!!! If you need support, post the topmost build error, and the call stack if relevant.




<emerge info output>
=================================================================
System uname: 2.6.17-hardened-r1 i686 AMD Athlon(tm) 64 Processor 3200+
Gentoo Base System version 1.12.6
Last Sync: Fri, 24 Nov 2006 21:00:01 +0000
ccache version 2.3 [disabled]
app-admin/eselect-compiler: [Not Present]
dev-java/java-config: [Not Present]
dev-lang/python:     2.4.3-r4
dev-python/pycrypto: 2.0.1-r5
dev-util/ccache:     2.3
dev-util/confcache:  [Not Present]
sys-apps/sandbox:    1.2.17
sys-devel/autoconf:  2.13, 2.60
sys-devel/automake:  1.4_p6, 1.5, 1.6.3, 1.7.9-r1, 1.8.5-r3, 1.9.6-r2
sys-devel/binutils:  2.16.1-r3
sys-devel/gcc-config: 1.3.13-r4
sys-devel/libtool:   1.5.22
virtual/os-headers:  2.6.17-r1
ACCEPT_KEYWORDS="x86"
AUTOCLEAN="yes"
CBUILD="i686-pc-linux-gnu"
CFLAGS="-O2 -pipe -march=athlon-xp -mtune=athlon-xp -fomit-frame-pointer"
CHOST="i686-pc-linux-gnu"
CONFIG_PROTECT="/etc"
CONFIG_PROTECT_MASK="/etc/env.d /etc/gconf /etc/revdep-rebuild /etc/terminfo"
CXXFLAGS="-O2 -pipe -march=athlon-xp -mtune=athlon-xp -fomit-frame-pointer"
DISTDIR="/usr/portage/distfiles"
FEATURES="autoconfig distlocks metadata-transfer sandbox selinux sesandbox sfperms strict"
GENTOO_MIRRORS="http://distfiles.gentoo.org http://distro.ibiblio.org/pub/linux/distributions/gentoo"
MAKEOPTS="-j2"
PKGDIR="/usr/portage/packages"
PORTAGE_RSYNC_OPTS="--recursive --links --safe-links --perms --times --compress --force --whole-file --delete --delete-after --stats --timeout=180 --exclude='/distfiles' --exclude='/local' --exclude='/packages'"
PORTAGE_TMPDIR="/var/tmp"
PORTDIR="/usr/portage"
SYNC="rsync://rsync.gentoo.org/gentoo-portage"
USE="berkdb crypt elibc_glibc input_devices_keyboard input_devices_mouse kernel_linux ncurses nls nptl nptlonly pam python readline selinux ssl unicode userland_GNU x86 zlib"
Unset:  CTARGET, EMERGE_DEFAULT_OPTS, INSTALL_MASK, LANG, LC_ALL, LDFLAGS, LINGUAS, PORTAGE_RSYNC_EXTRA_OPTS, PORTDIR_OVERLAY