All pastes #261520 Raw Edit

Mine

public text v1 · immutable
#261520 ·published 2006-11-29 16:11 UTC
rendered paste body
gcc -c   -O -DENABLE_CHECKING -DENABLE_ASSERT_CHECKING -DIN_GCC   -W -Wall -Wwrite-strings -Wstrict-prototypes -Wmissing-prototypes -pedantic -Wno-long-long -Wno-variadic-macros -Wold-style-definition -Wmissing-format-attribute    -DHAVE_CONFIG_H -I. -I. -I/var/tmp/portage/sys-devel/gcc-4.1.1-r3/work/gcc-4.1.1/gcc -I/var/tmp/portage/sys-devel/gcc-4.1.1-r3/work/gcc-4.1.1/gcc/. -I/var/tmp/portage/sys-devel/gcc-4.1.1-r3/work/gcc-4.1.1/gcc/../include -I/var/tmp/portage/sys-devel/gcc-4.1.1-r3/work/gcc-4.1.1/gcc/../libcpp/include     /var/tmp/portage/sys-devel/gcc-4.1.1-r3/work/gcc-4.1.1/gcc/tree-cfg.c -o tree-cfg.o
/var/tmp/portage/sys-devel/gcc-4.1.1-r3/work/gcc-4.1.1/gcc/tree-cfg.c: In function 'tree_verify_flow_info':
/var/tmp/portage/sys-devel/gcc-4.1.1-r3/work/gcc-4.1.1/gcc/tree-cfg.c:3582: internal compiler error: Segmentation fault
Please submit a full bug report,
with preprocessed source if appropriate.
See <URL:http://bugs.gentoo.org/> for instructions.
The bug is not reproducible, so it is likely a hardware or OS problem.
make[2]: *** [tree-cfg.o] Error 1
make[2]: Leaving directory `/var/tmp/portage/sys-devel/gcc-4.1.1-r3/work/build/gcc'
make[1]: *** [stage1_build] Error 2
make[1]: Leaving directory `/var/tmp/portage/sys-devel/gcc-4.1.1-r3/work/build/gcc'
make: *** [profiledbootstrap] Error 2

!!! ERROR: sys-devel/gcc-4.1.1-r3 failed.
Call stack:
  ebuild.sh, line 1568:   Called dyn_compile
  ebuild.sh, line 937:   Called src_compile
  ebuild.sh, line 1261:   Called toolchain_src_compile
  toolchain.eclass, line 24:   Called gcc_src_compile
  toolchain.eclass, line 1536:   Called gcc_do_make
  toolchain.eclass, line 1410:   Called die

!!! emake failed with profiledbootstrap
!!! If you need support, post the topmost build error, and the call stack if relevant.