g++ -DUSE_EMBEDDED_CRYPTO -W -Wall -g -ggdb -fno-inline -D__DEBUG__ -fmessage-length=0 -O2 -lpthread -o amuled amuled-AICHSyncThread.o amuled-AddFileThread.o amuled-amule.o amuled-amuled.o amuled-BaseClient.o amuled-CFile.o amuled-ClientCredits.o amuled-ClientList.o amuled-ClientUDPSocket.o amuled-DeadSourceList.o amuled-DownloadClient.o amuled-DownloadQueue.o amuled-ECSocket.o amuled-ECPacket.o amuled-ECSpecialTags.o amuled-ED2KLink.o amuled-EMSocket.o amuled-ExternalConn.o amuled-filefn.o amuled-Format.o amuled-Friend.o amuled-FriendList.o amuled-HTTPDownload.o amuled-IPFilter.o amuled-KnownFile.o amuled-KnownFileList.o amuled-ListenSocket.o amuled-Logger.o amuled-MD5Sum.o amuled-MemFile.o amuled-NetworkFunctions.o amuled-OtherFunctions.o amuled-Packet.o amuled-PartFile.o amuled-Preferences.o amuled-Proxy.o amuled-SafeFile.o amuled-SearchList.o amuled-Server.o amuled-ServerConnect.o amuled-ServerList.o amuled-ServerSocket.o amuled-ServerUDPSocket.o amuled-SHA.o amuled-SHAHashSet.o amuled-SharedFileList.o amuled-StateMachine.o amuled-Statistics.o amuled-StringFunctions.o amuled-Timer.o amuled-UploadClient.o amuled-UploadQueue.o amuled-ByteIO.o amuled-DataIO.o amuled-FileIO.o amuled-IOException.o amuled-UInt128.o amuled-CryptoPP.o -L/home/jaramir/amule/wxbase-2.6.2/lib -pthread -lwx_base-2.6 -lwx_base_net-2.6 -lz -lbfd -liberty
if g++ -DHAVE_CONFIG_H -I. -I. -I.. -DUSE_WX_TRAY -I/home/jaramir/amule/wxbase-2.6.2/lib/wx/include/base-ansi-release-2.6 -I/home/jaramir/amule/wxbase-2.6.2/include/wx-2.6 -DwxUSE_GUI=0 -D_FILE_OFFSET_BITS=64 -D_LARGE_FILES -D_LARGEFILE_SOURCE=1 -DHAVE_BFD -DUSE_EMBEDDED_CRYPTO -W -Wall -g -ggdb -fno-inline -D__DEBUG__ -fmessage-length=0 -O2 -MT amule-AddFriend.o -MD -MP -MF ".deps/amule-AddFriend.Tpo" -c -o amule-AddFriend.o `test -f 'AddFriend.cpp' || echo './'`AddFriend.cpp; \
then mv -f ".deps/amule-AddFriend.Tpo" ".deps/amule-AddFriend.Po"; else rm -f ".deps/amule-AddFriend.Tpo"; exit 1; fi
In file included from AddFriend.cpp:33:
AddFriend.h:33:55: wx/dialog.h: No such file or directory
In file included from AddFriend.cpp:33:
AddFriend.h:36: error: syntax error before `{' token
AddFriend.h:39: error: destructors must be member functions
AddFriend.h:41: error: syntax error before `protected'
AddFriend.h:46: error: `wxCommandEvent' was not declared in this scope
AddFriend.h:46: error: `evt' was not declared in this scope
AddFriend.h:46: error: variable or field `OnCloseBtn' declared void
AddFriend.h:47: error: syntax error before `}' token
In file included from AddFriend.cpp:34:
muuli_wdr.h:19:22: wx/image.h: No such file or directory
muuli_wdr.h:20:25: wx/statline.h: No such file or directory
muuli_wdr.h:21:25: wx/spinbutt.h: No such file or directory
muuli_wdr.h:22:25: wx/spinctrl.h: No such file or directory
muuli_wdr.h:23:25: wx/splitter.h: No such file or directory
muuli_wdr.h:24:25: wx/listctrl.h: No such file or directory
muuli_wdr.h:25:25: wx/treectrl.h: No such file or directory
muuli_wdr.h:26:25: wx/notebook.h: No such file or directory
muuli_wdr.h:27:21: wx/grid.h: No such file or directory
muuli_wdr.h:28:24: wx/toolbar.h: No such file or directory
In file included from AddFriend.cpp:34:
muuli_wdr.h:35: error: syntax error before `*' token
muuli_wdr.h:37: error: syntax error before `*' token
muuli_wdr.h:38: error: syntax error before `*' token
muuli_wdr.h:39: error: syntax error before `*' token
muuli_wdr.h:40: error: syntax error before `*' token
muuli_wdr.h:46: error: syntax error before `*' token
muuli_wdr.h:49: error: syntax error before `*' token
muuli_wdr.h:51: error: syntax error before `*' token
muuli_wdr.h:52: error: syntax error before `*' token
muuli_wdr.h:57: error: syntax error before `*' token
muuli_wdr.h:72: error: syntax error before `*' token
muuli_wdr.h:74: error: syntax error before `*' token
muuli_wdr.h:79: error: syntax error before `*' token
muuli_wdr.h:81: error: syntax error before `*' token
muuli_wdr.h:82: error: syntax error before `*' token
muuli_wdr.h:87: error: syntax error before `*' token
muuli_wdr.h:94: error: syntax error before `*' token
muuli_wdr.h:96: error: syntax error before `*' token
muuli_wdr.h:109: error: syntax error before `*' token
muuli_wdr.h:125: error: syntax error before `*' token
muuli_wdr.h:139: error: syntax error before `*' token
muuli_wdr.h:146: error: syntax error before `*' token
muuli_wdr.h:151: error: syntax error before `*' token
muuli_wdr.h:157: error: syntax error before `*' token
muuli_wdr.h:165: error: syntax error before `*' token
muuli_wdr.h:176: error: syntax error before `*' token
muuli_wdr.h:178: error: syntax error before `*' token
muuli_wdr.h:193: error: syntax error before `*' token
muuli_wdr.h:215: error: syntax error before `*' token
muuli_wdr.h:219: error: syntax error before `*' token
muuli_wdr.h:234: error: syntax error before `*' token
muuli_wdr.h:260: error: syntax error before `*' token
muuli_wdr.h:274: error: syntax error before `*' token
muuli_wdr.h:292: error: syntax error before `*' token
muuli_wdr.h:303: error: syntax error before `*' token
muuli_wdr.h:316: error: syntax error before `*' token
muuli_wdr.h:330: error: syntax error before `*' token
muuli_wdr.h:342: error: syntax error before `*' token
muuli_wdr.h:357: error: syntax error before `*' token
muuli_wdr.h:364: error: syntax error before `*' token
muuli_wdr.h:377: error: syntax error before `*' token
muuli_wdr.h:379: error: syntax error before `*' token
muuli_wdr.h:380: error: syntax error before `*' token
muuli_wdr.h:381: error: syntax error before `*' token
muuli_wdr.h:385: error: syntax error before `*' token
muuli_wdr.h:399: error: syntax error before `*' token
muuli_wdr.h:402: error: syntax error before `*' token
muuli_wdr.h:406: error: syntax error before `*' token
muuli_wdr.h:410: error: syntax error before `*' token
muuli_wdr.h:419: error: syntax error before `*' token
muuli_wdr.h:422: error: syntax error before `*' token
muuli_wdr.h:426: error: syntax error before `*' token
muuli_wdr.h:437: error: syntax error before `*' token
muuli_wdr.h:440: error: syntax error before `*' token
muuli_wdr.h:457: error: syntax error before `*' token
muuli_wdr.h:463: error: syntax error before `*' token
muuli_wdr.h:471: error: syntax error before `*' token
muuli_wdr.h:481: error: syntax error before `*' token
muuli_wdr.h:488: error: syntax error before `*' token
muuli_wdr.h:492: error: syntax error before `*' token
muuli_wdr.h:508: error: `wxToolBar' was not declared in this scope
muuli_wdr.h:508: error: `parent' was not declared in this scope
muuli_wdr.h:508: error: variable or field `muleToolbar' declared void
muuli_wdr.h:512: error: syntax error before `)' token
muuli_wdr.h:514: error: syntax error before `)' token
muuli_wdr.h:516: error: syntax error before `)' token
muuli_wdr.h:518: error: syntax error before `)' token
muuli_wdr.h:520: error: syntax error before `)' token
muuli_wdr.h:522: error: syntax error before `)' token
muuli_wdr.h:524: error: syntax error before `)' token
In file included from AddFriend.cpp:36:
amuleDlg.h:38:54: wx/frame.h: No such file or directory
amuleDlg.h:40:25: wx/imaglist.h: No such file or directory
In file included from AddFriend.cpp:36:
amuleDlg.h:74: error: base class `wxFrame' has incomplete type
amuleDlg.h:78: error: type specifier omitted for parameter `wxSize'
amuleDlg.h:78: error: syntax error before `=' token
amuleDlg.h:108: error: `wxCloseEvent' was not declared in this scope
amuleDlg.h:108: error: `evt' was not declared in this scope
amuleDlg.h:108: error: invalid data member initialization
amuleDlg.h:108: error: (use `=' to initialize static data members)
amuleDlg.h:108: error: variable or field `OnClose' declared void
amuleDlg.h:145: error: 'wxImageList' is used as a type, but is not defined as a type.
amuleDlg.h:162: error: `wxIconizeEvent' was not declared in this scope
amuleDlg.h:162: error: `evt' was not declared in this scope
amuleDlg.h:162: error: invalid data member initialization
amuleDlg.h:162: error: variable or field `OnMinimize' declared void
amuleDlg.h:169: error: `wxSizeEvent' was not declared in this scope
amuleDlg.h:169: error: `evt' was not declared in this scope
amuleDlg.h:169: error: invalid data member initialization
amuleDlg.h:169: error: variable or field `OnMainGUISizeChange' declared void
amuleDlg.h:173: error: syntax error before `*' token
amuleDlg.h:74: warning: `class CamuleDlg' has virtual functions but non-virtual destructor
amuleDlg.h: In member function `void CamuleDlg::StartGuiTimer()':
amuleDlg.h:147: error: `Start' undeclared (first use this function)
amuleDlg.h:147: error: (Each undeclared identifier is reported only once for each function it appears in.)
In file included from AddFriend.cpp:37:
ChatWnd.h:33:54: wx/panel.h: No such file or directory
ChatWnd.h:34:70: wx/notebook.h: No such file or directory
In file included from AddFriend.cpp:37:
ChatWnd.h: At global scope:
ChatWnd.h:44: error: syntax error before `{' token
ChatWnd.h:47: error: destructors must be member functions
ChatWnd.h:61: error: syntax error before `protected'
ChatWnd.h:64: error: `wxNotebookEvent' was not declared in this scope
ChatWnd.h:64: error: `evt' was not declared in this scope
ChatWnd.h:64: error: variable or field `OnAllPagesClosed' declared void
ChatWnd.h:67: error: syntax error before `private'
ChatWnd.h:67: error: virtual outside class declaration
ChatWnd.h:67: error: non-member function `const wxEventTable* GetEventTable()' cannot have `const' method qualifier
ChatWnd.h:67: error: no matching function for call to `wxEventHashTable::wxEventHashTable()'
/home/jaramir/amule/wxbase-2.6.2/include/wx-2.6/wx/event.h:2298: error: candidates are: wxEventHashTable::wxEventHashTable(const wxEventHashTable&)
/home/jaramir/amule/wxbase-2.6.2/include/wx-2.6/wx/event.h:2262: error: wxEventHashTable::wxEventHashTable(const wxEventTable&)
ChatWnd.h:67: error: virtual outside class declaration
ChatWnd.h:67: error: non-member function `wxEventHashTable& GetEventHashTable()' cannot have `const' method qualifier
ChatWnd.h:71: error: syntax error before `}' token
AddFriend.cpp:42:25: wx/textctrl.h: No such file or directory
AddFriend.cpp:43:23: wx/msgdlg.h: No such file or directory
AddFriend.cpp:44:22: wx/sizer.h: No such file or directory
AddFriend.cpp:47: error: invalid use of undefined type `class CAddFriend'
AddFriend.h:35: error: forward declaration of `class CAddFriend'
AddFriend.cpp:47: error: `wxDialog' was not declared in this scope
AddFriend.cpp:47: error: syntax error before `::' token
AddFriend.cpp:47: error: incomplete type `CAddFriend' does not have member `sm_eventTableEntries'
AddFriend.cpp:47: error: assignment (not initialization) in declaration
AddFriend.cpp:47: error: invalid use of undefined type `class CAddFriend'
AddFriend.h:35: error: forward declaration of `class CAddFriend'
AddFriend.cpp: In member function `const wxEventTable* CAddFriend::GetEventTable() const':
AddFriend.cpp:47: error: incomplete type `CAddFriend' does not have member `sm_eventTable'
AddFriend.cpp: At global scope:
AddFriend.cpp:47: error: incomplete type `CAddFriend' does not have member `sm_eventTable'
AddFriend.cpp:47: error: invalid use of undefined type `class CAddFriend'
AddFriend.h:35: error: forward declaration of `class CAddFriend'
AddFriend.cpp:47: error: invalid declarator
AddFriend.cpp:47: error: invalid use of undefined type `class CAddFriend'
AddFriend.h:35: error: forward declaration of `class CAddFriend'
AddFriend.cpp: In member function `wxEventHashTable& CAddFriend::GetEventHashTable() const':
AddFriend.cpp:47: error: incomplete type `CAddFriend' does not have member `sm_eventHashTable'
AddFriend.cpp: At global scope:
AddFriend.cpp:47: error: invalid use of undefined type `class CAddFriend'
AddFriend.h:35: error: forward declaration of `class CAddFriend'
AddFriend.cpp:48: error: incomplete type `CAddFriend' does not have member `OnAddBtn'
AddFriend.cpp:48: error: `wxCommandEventHandler' was not declared in this scope
AddFriend.cpp:49: error: incomplete type `CAddFriend' does not have member `OnCloseBtn'
AddFriend.cpp:49: error: `wxCommandEventHandler' was not declared in this scope
AddFriend.cpp:50: error: assignment (not initialization) in declaration
AddFriend.cpp:54: error: invalid use of undefined type `class CAddFriend'
AddFriend.h:35: error: forward declaration of `class CAddFriend'
AddFriend.cpp: In constructor `CAddFriend::CAddFriend(wxWindow*)':
AddFriend.cpp:54: error: class `CAddFriend' does not have any field named `wxDialog'
AddFriend.cpp:54: error: `wxDefaultPosition' undeclared (first use this function)
AddFriend.cpp:54: error: `wxDefaultSize' undeclared (first use this function)
AddFriend.cpp:55: error: `wxDEFAULT_DIALOG_STYLE' undeclared (first use this function)
AddFriend.cpp:55: error: `wxSYSTEM_MENU' undeclared (first use this function)
AddFriend.cpp:57: error: `wxSizer' undeclared (first use this function)
AddFriend.cpp:57: error: `content' undeclared (first use this function)
AddFriend.cpp:57: error: `addFriendDlg' undeclared (first use this function)
AddFriend.cpp: At global scope:
AddFriend.cpp:62: error: invalid use of undefined type `class CAddFriend'
AddFriend.h:35: error: forward declaration of `class CAddFriend'
AddFriend.cpp: In member function `void CAddFriend::OnAddBtn(wxCommandEvent&)':
AddFriend.cpp:67: error: `FindWindow' undeclared (first use this function)
AddFriend.cpp:75: error: `wxMessageBox' undeclared (first use this function)
AddFriend.cpp:92: error: `AddFriend' undeclared (first use this function)
AddFriend.cpp:94: error: `EndModal' undeclared (first use this function)
AddFriend.cpp: At global scope:
AddFriend.cpp:99: error: invalid use of undefined type `class CAddFriend'
AddFriend.h:35: error: forward declaration of `class CAddFriend'
AddFriend.cpp: In member function `void CAddFriend::OnCloseBtn(wxCommandEvent&)':
AddFriend.cpp:101: error: `EndModal' undeclared (first use this function)
make[3]: *** [amule-AddFriend.o] Error 1
make[3]: Leaving directory `/home/jaramir/amule/aMule-2.0.3/src'
make[2]: *** [all-recursive] Error 1
make[2]: Leaving directory `/home/jaramir/amule/aMule-2.0.3/src'
make[1]: *** [all-recursive] Error 1
make[1]: Leaving directory `/home/jaramir/amule/aMule-2.0.3'
make: *** [all] Error 2