frosty@knightsdivine.net [~/Unreal3.2/src/modules]# make custommodule MODULEFILE=m_cidrban
cc -fPIC -DPIC -shared -DDYNAMIC_LINKING \
-o m_cidrban.so m_cidrban.c
m_cidrban.c:21:9: #include expects "FILENAME" or <FILENAME>
m_cidrban.c:22:20: config.h: No such file or directory
m_cidrban.c:23:20: struct.h: No such file or directory
m_cidrban.c:24:20: common.h: No such file or directory
m_cidrban.c:25:17: sys.h: No such file or directory
m_cidrban.c:26:21: numeric.h: No such file or directory
m_cidrban.c:27:17: msg.h: No such file or directory
m_cidrban.c:28:19: proto.h: No such file or directory
m_cidrban.c:29:21: channel.h: No such file or directory
m_cidrban.c:30:9: #include expects "FILENAME" or <FILENAME>
m_cidrban.c:31:9: #include expects "FILENAME" or <FILENAME>
m_cidrban.c:32:9: #include expects "FILENAME" or <FILENAME>
m_cidrban.c:33:9: #include expects "FILENAME" or <FILENAME>
m_cidrban.c:34:9: #include expects "FILENAME" or <FILENAME>
m_cidrban.c:38:9: #include expects "FILENAME" or <FILENAME>
m_cidrban.c:39:15: h.h: No such file or directory
m_cidrban.c:46:9: #include expects "FILENAME" or <FILENAME>
m_cidrban.c:55: error: syntax error before "MOD_HEADER"
m_cidrban.c:56: warning: parameter names (without types) in function declaration
m_cidrban.c:56: error: function `MOD_HEADER' is initialized like a variable
m_cidrban.c:57: error: invalid initializer
m_cidrban.c:57: error: (near initialization for `MOD_HEADER')
m_cidrban.c:58: warning: excess elements in scalar initializer
m_cidrban.c:58: warning: (near initialization for `MOD_HEADER')
m_cidrban.c:59: warning: excess elements in scalar initializer
m_cidrban.c:59: warning: (near initialization for `MOD_HEADER')
m_cidrban.c:60: warning: excess elements in scalar initializer
m_cidrban.c:60: warning: (near initialization for `MOD_HEADER')
m_cidrban.c:62: error: `NULL' undeclared here (not in a function)
m_cidrban.c:62: warning: excess elements in scalar initializer
m_cidrban.c:62: warning: (near initialization for `MOD_HEADER')
m_cidrban.c:62: warning: data definition has no type or storage class
m_cidrban.c:64: error: syntax error before '*' token
m_cidrban.c:64: warning: data definition has no type or storage class
m_cidrban.c:76: error: syntax error before '*' token
m_cidrban.c: In function `extban_modeC_is_banned':
m_cidrban.c:78: error: storage size of 'tmp' isn't known
m_cidrban.c:80: error: `xban' undeclared (first use in this function)
m_cidrban.c:80: error: (Each undeclared identifier is reported only once
m_cidrban.c:80: error: for each function it appears in.)
m_cidrban.c:80: warning: initialization makes pointer from integer without a cast
m_cidrban.c:83: error: `HM_HOST' undeclared (first use in this function)
m_cidrban.c:84: error: invalid application of `sizeof' to incomplete type `irc_netmask'
m_cidrban.c:84: warning: assignment makes pointer from integer without a cast
m_cidrban.c:85: error: invalid application of `sizeof' to incomplete type `irc_netmask'
m_cidrban.c:86: error: `sptr' undeclared (first use in this function)
m_cidrban.c: At top level:
m_cidrban.c:96: error: syntax error before "int"
m_cidrban.c:96: error: syntax error before '*' token
m_cidrban.c:97: error: `MOD_INIT' declared as function returning a function
m_cidrban.c: In function `MOD_INIT':
m_cidrban.c:98: error: `ExtbanInfo' undeclared (first use in this function)
m_cidrban.c:98: error: syntax error before "req"
m_cidrban.c:100: error: `req' undeclared (first use in this function)
m_cidrban.c:104: error: `modinfo' undeclared (first use in this function)
m_cidrban.c:104: warning: assignment makes pointer from integer without a cast
m_cidrban.c:108: error: `MOD_FAILED' undeclared (first use in this function)
m_cidrban.c:111: error: `MOD_OPT_PERM' undeclared (first use in this function)
m_cidrban.c:113: error: `MOD_SUCCESS' undeclared (first use in this function)
m_cidrban.c: At top level:
m_cidrban.c:116: error: syntax error before "int"
m_cidrban.c:117: error: `MOD_LOAD' declared as function returning a function
m_cidrban.c: In function `MOD_LOAD':
m_cidrban.c:118: error: `MOD_SUCCESS' undeclared (first use in this function)
m_cidrban.c: At top level:
m_cidrban.c:121: error: syntax error before "int"
m_cidrban.c:122: error: `MOD_UNLOAD' declared as function returning a function
m_cidrban.c: In function `MOD_UNLOAD':
m_cidrban.c:124: error: `MOD_SUCCESS' undeclared (first use in this function)
m_cidrban.c:125:2: warning: no newline at end of file
make: *** [custommodule] Error 1
frosty@knightsdivine.net [~/Unreal3.2/src/modules]#