ablo-jdk1.5.0/include -I/usr/local/diablo-jdk1.5.0/include/freebsd -fpic -fPIC
-I/usr/X11R6/include `pkg-config --cflags gtk+-2.0` -c os_stats.c
[exec] gcc -shared -fPIC -fpic -s `pkg-config --libs-only-L gtk+-2.0 gthrea
d-2.0` -lgtk-x11-2.0 -lgthread-2.0 -L/usr/X11R6/lib -lXtst -o libswt-pi-gtk-323
5.so swt.o os.o os_structs.o os_custom.o os_stats.o
[exec] gcc -O -Wall -DSWT_VERSION=3235 -DFREEBSD -DGTK -I/usr/local/diablo-jdk1.5.0/include -I
/usr/local/diablo-jdk1.5.0/include/freebsd -fpic -fPIC -I/usr/X11R6/include `pkg-config --cflags atk
gtk+-2.0` -c atk.c
[exec] gcc -O -Wall -DSWT_VERSION=3235 -DFREEBSD -DGTK -I/usr/local/diablo-jdk1.5.0/include -I/usr/local/diablo-jdk1.5.0/include/freebsd -fpic -fPIC -I/usr/X11R6/include `pkg-config --cflags atk gtk+-2.0` -c atk_structs.c
[exec] gcc -O -Wall -DSWT_VERSION=3235 -DFREEBSD -DGTK -I/usr/local/diablo-jdk1.5.0/include -I/usr/local/diablo-jdk1.5.0/include/freebsd -fpic -fPIC -I/usr/X11R6/include `pkg-config --cflags atk gtk+-2.0` -c atk_custom.c
[exec] gcc -O -Wall -DSWT_VERSION=3235 -DFREEBSD -DGTK -I/usr/local/diablo-jdk1.5.0/include -I/usr/local/diablo-jdk1.5.0/include/freebsd -fpic -fPIC -I/usr/X11R6/include `pkg-config --cflags atk gtk+-2.0` -c atk_stats.c
[exec] gcc -shared -fPIC -fpic -s `pkg-config --libs-only-L atk gtk+-2.0` -latk-1.0 -lgtk-x11-2.0 -o libswt-atk-gtk-3235.so swt.o atk.o atk_structs.o atk_custom.o atk_stats.o
[exec] gcc -O -Wall -DSWT_VERSION=3235 -DFREEBSD -DGTK -I/usr/local/diablo-jdk1.5.0/include -I/usr/local/diablo-jdk1.5.0/include/freebsd -fpic -fPIC -I/usr/X11R6/include `pkg-config --cflags gnome-vfs-module-2.0 libgnome-2.0 libgnomeui-2.0` -c gnome.c
[exec] gcc -O -Wall -DSWT_VERSION=3235 -DFREEBSD -DGTK -I/usr/local/diablo-jdk1.5.0/include -I/usr/local/diablo-jdk1.5.0/include/freebsd -fpic -fPIC -I/usr/X11R6/include `pkg-config --cflags gnome-vfs-module-2.0 libgnome-2.0 libgnomeui-2.0` -c gnome_structs.c
[exec] gcc -O -Wall -DSWT_VERSION=3235 -DFREEBSD -DGTK -I/usr/local/diablo-jdk1.5.0/include -I/usr/local/diablo-jdk1.5.0/include/freebsd -fpic -fPIC -I/usr/X11R6/include `pkg-config --cflags gnome-vfs-module-2.0 libgnome-2.0 libgnomeui-2.0` -c gnome_stats.c
[exec] gcc -shared -fPIC -fpic -s `pkg-config --libs-only-L gnome-vfs-module-2.0 libgnome-2.0 libgnomeui-2.0` -lgnomevfs-2 -lgnome-2 -lgnomeui-2 -o libswt-gnome-gtk-3235.so swt.o gnome.o gnome_structs.o gnome_stats.o
[exec] gcc -O -Wall -DSWT_VERSION=3235 -DFREEBSD -DGTK -I/usr/local/diablo-jdk1.5.0/include -I/usr/local/diablo-jdk1.5.0/include/freebsd -fpic -fPIC -I/usr/X11R6/include -c swt_awt.c
[exec] gcc -L/usr/local/diablo-jdk1.5.0/jre/lib/i386 -ljawt -shared -s -o libswt-awt-gtk-3235.so swt_awt.o
[exec] c++ -O -DSWT_VERSION=3235 -DXPCOM_GLUE=1 -DMOZILLA_STRICT_API=1 -fno-rtti -fno-exceptions -Wall -Wno-non-virtual-dtor -fPIC -I. -I/usr/local/diablo-jdk1.5.0/include -I/usr/local/diablo-jdk1.5.0/include/freebsd -c xpcom.cpp
[exec] In file included from xpcom_structs.h:29,
[exec] from xpcom.cpp:30:
[exec] xpcom.h:34:21: nsXPCOM.h: No such file or directory
[exec] xpcom.h:35:25: nsEmbedAPI.h: No such file or directory
[exec] xpcom.h:36:27: nsEmbedString.h: No such file or directory
[exec] xpcom.h:37:28: nsIInputStream.h: No such file or directory
[exec] xpcom.h:38:30: nsISupportsUtils.h: No such file or directory
[exec] xpcom.h:39:19: prmem.h: No such file or directory
[exec] xpcom.h:40:19: prenv.h: No such file or directory
[exec] In file included from xpcom.cpp:30:
[exec] xpcom_structs.h:33: error: expected constructor, destructor, or type conversion before '*' token
[exec] xpcom_structs.h:34: error: `nsID' has not been declared
[exec] xpcom_structs.h:34: error: ISO C++ forbids declaration of `lpStruct' with no type
[exec] xpcom.cpp: In function `jint Java_org_eclipse_swt_internal_mozilla_XPCOM_Call(JNIEnv*, _jclass*, jint, jint, jint, _jbyteArray*, jint, jint, _jintArray*)':
[exec] xpcom.cpp:47: error: `nsWriteSegmentFun' was not declared in this scope
[exec] xpcom.cpp:47: error: expected primary-expression before ')' token
[exec] xpcom.cpp:47: error: expected `)' before "arg0"
[exec] xpcom.cpp:47: error: `nsIInputStream' was not declared in this scope
[exec] xpcom.cpp:47: error: expected primary-expression before ')' token
[exec] xpcom.cpp:47: error: `PRUint32' was not declared in this scope
[exec] xpcom.cpp:47: error: expected primary-expression before ')' token
[exec] xpcom.cpp:47: warning: unused variable 'nsIInputStream'
[exec] xpcom.cpp:47: warning: unused variable 'PRUint32'
[exec] xpcom.cpp: In function `jint Java_org_eclipse_swt_internal_mozilla_XPCOM_NS_1GetComponentManager(JNIEnv*, _jclass*, _jintArray*)':
[exec] xpcom.cpp:64: error: `nsIComponentManager' was not declared in this scope
[exec] xpcom.cpp:64: error: `NS_GetComponentManager' was not declared in this scope
[exec] xpcom.cpp:64: error: expected primary-expression before ')' token
[exec] xpcom.cpp:64: error: expected `;' before "NS_GetComponentManager"
[exec] xpcom.cpp:64: warning: unused variable 'nsIComponentManager'
[exec] xpcom.cpp:64: warning: unused variable 'NS_GetComponentManager'
[exec] xpcom.cpp: In function `jint Java_org_eclipse_swt_internal_mozilla_XPCOM_NS_1GetServiceManager(JNIEnv*, _jclass*, _jintArray*)':
[exec] xpcom.cpp:80: error: `nsIServiceManager' was not declared in this scope
[exec] xpcom.cpp:80: error: `NS_GetServiceManager' was not declared in this scope
[exec] xpcom.cpp:80: error: expected primary-expression before ')' token
[exec] xpcom.cpp:80: error: expected `;' before "NS_GetServiceManager"
[exec] xpcom.cpp:80: warning: unused variable 'nsIServiceManager'
[exec] xpcom.cpp:80: warning: unused variable 'NS_GetServiceManager'
[exec] xpcom.cpp: In function `jint Java_org_eclipse_swt_internal_mozilla_XPCOM_NS_1InitEmbedding(JNIEnv*, _jclass*, jint, jint)':
[exec] xpcom.cpp:94: error: `nsILocalFile' was not declared in this scope
[exec] xpcom.cpp:94: error: `nsIDirectoryServiceProvider' was not declared in this scope
[exec] xpcom.cpp:94: error: `NS_InitEmbedding' was not declared in this scope
[exec] xpcom.cpp:94: error: expected primary-expression before ')' token
[exec] xpcom.cpp:94: error: expected `;' before "NS_InitEmbedding"
[exec] xpcom.cpp:94: warning: unused variable 'nsILocalFile'
[exec] xpcom.cpp:94: warning: unused variable 'nsIDirectoryServiceProvider'
[exec] xpcom.cpp:94: warning: unused variable 'NS_InitEmbedding'
[exec] xpcom.cpp: In function `jint Java_org_eclipse_swt_internal_mozilla_XPCOM_NS_1NewLocalFile(JNIEnv*, _jclass*, jint, jboolean, _jintArray*)':
[exec] xpcom.cpp:108: error: `nsAString' was not declared in this scope
[exec] xpcom.cpp:108: error: `nsILocalFile' was not declared in this scope
[exec] xpcom.cpp:108: error: `NS_NewLocalFile' was not declared in this scope
[exec] xpcom.cpp:108: error: expected primary-expression before ')' token
[exec] xpcom.cpp:108: error: expected `;' before "NS_NewLocalFile"
[exec] xpcom.cpp:108: warning: unused variable 'nsAString'
[exec] xpcom.cpp:108: warning: unused variable 'nsILocalFile'
[exec] xpcom.cpp:108: warning: unused variable 'NS_NewLocalFile'
[exec] xpcom.cpp: In function `jint Java_org_eclipse_swt_internal_mozilla_XPCOM_NS_1TermEmbedding(JNIEnv*, _jclass*)':
[exec] xpcom.cpp:122: error: `NS_TermEmbedding' was not declared in this scope
[exec] xpcom.cpp:122: warning: unused variable 'NS_TermEmbedding'
[exec] xpcom.cpp: In function `void Java_org_eclipse_swt_internal_mozilla_XPCOM_PR_1Free(JNIEnv*, _jclass*, jint)':
[exec] xpcom.cpp:133: error: `PR_Free' was not declared in this scope
[exec] xpcom.cpp:133: warning: unused variable 'PR_Free'
[exec] xpcom.cpp: In function `jint Java_org_eclipse_swt_internal_mozilla_XPCOM_PR_1Malloc(JNIEnv*, _jclass*, jint)':
[exec] xpcom.cpp:144: error: `PR_Malloc' was not declared in this scope
[exec] xpcom.cpp:144: warning: unused variable 'PR_Malloc'
[exec] xpcom.cpp: In function `jint Java_org_eclipse_swt_internal_mozilla_XPCOM_VtblCall__IIILorg_eclipse_swt_internal_mozilla_nsID_2(JNIEnv*, _jclass*, jint, jint, jint, _jobject*)':
[exec] xpcom.cpp:428: error: `nsID' was not declared in this scope
[exec] xpcom.cpp:428: error: expected `;' before "_arg3"
[exec] xpcom.cpp:431: error: `lparg3' was not declared in this scope
[exec] xpcom.cpp:431: error: `_arg3' was not declared in this scope
[exec] xpcom.cpp:431: error: `getnsIDFields' was not declared in this scope
[exec] xpcom.cpp:431: warning: unused variable 'lparg3'
[exec] xpcom.cpp:431: warning: unused variable '_arg3'
[exec] xpcom.cpp:431: warning: unused variable 'getnsIDFields'
[exec] xpcom.cpp:432: error: `lparg3' was not declared in this scope
[exec] xpcom.cpp:432: error: expected primary-expression before ')' token
[exec] xpcom.cpp:432: error: expected primary-expression before '(' token
[exec] xpcom.cpp:432: error: expected primary-expression before ')' token
[exec] xpcom.cpp:432: error: expected primary-expression before ',' token
[exec] xpcom.cpp:432: error: expected primary-expression before ',' token
[exec] xpcom.cpp:432: error: expected primary-expression before ')' token
[exec] xpcom.cpp: In function `jint Java_org_eclipse_swt_internal_mozilla_XPCOM_VtblCall__IIILorg_eclipse_swt_internal_mozilla_nsID_2_3I(JNIEnv*, _jclass*, jint, jint, jint, _jobject*, _jintArray*)':
[exec] xpcom.cpp:444: error: `nsID' was not declared in this scope
[exec] xpcom.cpp:444: error: expected `;' before "_arg3"
[exec] xpcom.cpp:448: error: `lparg3' was not declared in this scope
[exec] xpcom.cpp:448: error: `_arg3' was not declared in this scope
[exec] xpcom.cpp:448: error: `getnsIDFields' was not declared in this scope
[exec] xpcom.cpp:448: warning: unused variable 'lparg3'
[exec] xpcom.cpp:448: warning: unused variable '_arg3'
[exec] xpcom.cpp:448: warning: unused variable 'getnsIDFields'
[exec] xpcom.cpp:450: error: `lparg3' was not declared in this scope
[exec] xpcom.cpp:450: error: expected primary-expression before ')' token
[exec] xpcom.cpp:450: error: expected primary-expression before '(' token
[exec] xpcom.cpp:450: error: expected primary-expression before ')' token
[exec] xpcom.cpp:450: error: expected primary-expression before ',' token
[exec] xpcom.cpp:450: error: expected primary-expression before ',' token
[exec] xpcom.cpp:450: error: expected primary-expression before ',' token
[exec] xpcom.cpp:450: error: expected primary-expression before '*' token
[exec] xpcom.cpp:450: error: expected primary-expression before ')' token
[exec] xpcom.cpp: In function `jint Java_org_eclipse_swt_internal_mozilla_XPCOM_VtblCall__IILorg_eclipse_swt_internal_mozilla_nsID_2I(JNIEnv*, _jclass*, jint, jint, _jobject*, jint)':
[exec] xpcom.cpp:985: error: `nsID' was not declared in this scope
[exec] xpcom.cpp:985: error: expected `;' before "_arg2"
[exec] xpcom.cpp:988: error: `lparg2' was not declared in this scope
[exec] xpcom.cpp:988: error: `_arg2' was not declared in this scope
[exec] xpcom.cpp:988: error: `getnsIDFields' was not declared in this scope
[exec] xpcom.cpp:988: warning: unused variable 'lparg2'
[exec] xpcom.cpp:988: warning: unused variable '_arg2'
[exec] xpcom.cpp:988: warning: unused variable 'getnsIDFields'
[exec] xpcom.cpp:989: error: `lparg2' was not declared in this scope
[exec] xpcom.cpp:989: error: expected primary-expression before ')' token
[exec] xpcom.cpp:989: error: expected primary-expression before '(' token
[exec] xpcom.cpp:989: error: expected primary-expression before ')' token
[exec] xpcom.cpp:989: error: expected primary-expression before ',' token
[exec] xpcom.cpp:989: error: expected primary-expression before ',' token
[exec] xpcom.cpp:989: error: expected primary-expression before ')' token
[exec] xpcom.cpp: In function `jint Java_org_eclipse_swt_internal_mozilla_XPCOM_VtblCall__IILorg_eclipse_swt_internal_mozilla_nsID_2ILorg_eclipse_swt_internal_mozilla_nsID_2_3I(JNIEnv*, _jclass*, jint, jint, _jobject*, jint, _jobject*, _jintArray*)':
[exec] xpcom.cpp:1001: error: `nsID' was not declared in this scope
[exec] xpcom.cpp:1001: error: expected `;' before "_arg2"
[exec] xpcom.cpp:1002: error: expected `;' before "_arg4"
[exec] xpcom.cpp:1006: error: `lparg2' was not declared in this scope
[exec] xpcom.cpp:1006: error: `_arg2' was not declared in this scope
[exec] xpcom.cpp:1006: error: `getnsIDFields' was not declared in this scope
[exec] xpcom.cpp:1006: warning: unused variable 'lparg2'
[exec] xpcom.cpp:1006: warning: unused variable '_arg2'
[exec] xpcom.cpp:1006: warning: unused variable 'getnsIDFields'
[exec] xpcom.cpp:1007: error: `lparg4' was not declared in this scope
[exec] xpcom.cpp:1007: error: `_arg4' was not declared in this scope
[exec] xpcom.cpp:1007: error: `getnsIDFields' was not declared in this scope
[exec] xpcom.cpp:1007: warning: unused variable 'lparg4'
[exec] xpcom.cpp:1007: warning: unused variable '_arg4'
[exec] xpcom.cpp:1007: warning: unused variable 'getnsIDFields'
[exec] xpcom.cpp:1009: error: `lparg2' was not declared in this scope
[exec] xpcom.cpp:1009: error: `lparg4' was not declared in this scope
[exec] xpcom.cpp:1009: error: expected primary-expression before ')' token
[exec] xpcom.cpp:1009: error: expected primary-expression before '(' token
[exec] xpcom.cpp:1009: error: expected primary-expression before ')' token
[exec] xpcom.cpp:1009: error: expected primary-expression before ',' token
[exec] xpcom.cpp:1009: error: expected primary-expression before ',' token
[exec] xpcom.cpp:1009: error: expected primary-expression before ',' token
[exec] xpcom.cpp:1009: error: expected primary-expression before ',' token
[exec] xpcom.cpp:1009: error: expected primary-expression before '*' token
[exec] xpcom.cpp:1009: error: expected primary-expression before ')' token
[exec] xpcom.cpp: In function `jint Java_org_eclipse_swt_internal_mozilla_XPCOM_VtblCall__IILorg_eclipse_swt_internal_mozilla_nsID_2Lorg_eclipse_swt_internal_mozilla_nsID_2_3I(JNIEnv*, _jclass*, jint, jint, _jobject*, _jobject*, _jintArray*)':
[exec] xpcom.cpp:1023: error: `nsID' was not declared in this scope
[exec] xpcom.cpp:1023: error: expected `;' before "_arg2"
[exec] xpcom.cpp:1024: error: expected `;' before "_arg3"
[exec] xpcom.cpp:1028: error: `lparg2' was not declared in this scope
[exec] xpcom.cpp:1028: error: `_arg2' was not declared in this scope
[exec] xpcom.cpp:1028: error: `getnsIDFields' was not declared in this scope
[exec] xpcom.cpp:1028: warning: unused variable 'lparg2'
[exec] xpcom.cpp:1028: warning: unused variable '_arg2'
[exec] xpcom.cpp:1028: warning: unused variable 'getnsIDFields'
[exec] xpcom.cpp:1029: error: `lparg3' was not declared in this scope
[exec] xpcom.cpp:1029: error: `_arg3' was not declared in this scope
[exec] xpcom.cpp:1029: error: `getnsIDFields' was not declared in this scope
[exec] xpcom.cpp:1029: warning: unused variable 'lparg3'
[exec] xpcom.cpp:1029: warning: unused variable '_arg3'
[exec] xpcom.cpp:1029: warning: unused variable 'getnsIDFields'
[exec] xpcom.cpp:1031: error: `lparg2' was not declared in this scope
[exec] xpcom.cpp:1031: error: `lparg3' was not declared in this scope
[exec] xpcom.cpp:1031: error: expected primary-expression before ')' token
[exec] xpcom.cpp:1031: error: expected primary-expression before '(' token
[exec] xpcom.cpp:1031: error: expected primary-expression before ')' token
[exec] xpcom.cpp:1031: error: expected primary-expression before ',' token
[exec] xpcom.cpp:1031: error: expected primary-expression before ',' token
[exec] xpcom.cpp:1031: error: expected primary-expression before ',' token
[exec] xpcom.cpp:1031: error: expected primary-expression before '*' token
[exec] xpcom.cpp:1031: error: expected primary-expression before ')' token
[exec] xpcom.cpp: In function `jint Java_org_eclipse_swt_internal_mozilla_XPCOM_VtblCall__IILorg_eclipse_swt_internal_mozilla_nsID_2Lorg_eclipse_swt_internal_mozilla_nsID_2_3Z(JNIEnv*, _jclass*, jint, jint, _jobject*, _jobject*, _jbooleanArray*)':
[exec] xpcom.cpp:1045: error: `nsID' was not declared in this scope
[exec] xpcom.cpp:1045: error: expected `;' before "_arg2"
[exec] xpcom.cpp:1046: error: expected `;' before "_arg3"
[exec] xpcom.cpp:1050: error: `lparg2' was not declared in this scope
[exec] xpcom.cpp:1050: error: `_arg2' was not declared in this scope
[exec] xpcom.cpp:1050: error: `getnsIDFields' was not declared in this scope
[exec] xpcom.cpp:1050: warning: unused variable 'lparg2'
[exec] xpcom.cpp:1050: warning: unused variable '_arg2'
[exec] xpcom.cpp:1050: warning: unused variable 'getnsIDFields'
[exec] xpcom.cpp:1051: error: `lparg3' was not declared in this scope
[exec] xpcom.cpp:1051: error: `_arg3' was not declared in this scope
[exec] xpcom.cpp:1051: error: `getnsIDFields' was not declared in this scope
[exec] xpcom.cpp:1051: warning: unused variable 'lparg3'
[exec] xpcom.cpp:1051: warning: unused variable '_arg3'
[exec] xpcom.cpp:1051: warning: unused variable 'getnsIDFields'
[exec] xpcom.cpp:1053: error: `lparg2' was not declared in this scope
[exec] xpcom.cpp:1053: error: `lparg3' was not declared in this scope
[exec] xpcom.cpp:1053: error: expected primary-expression before ')' token
[exec] xpcom.cpp:1053: error: expected primary-expression before '(' token
[exec] xpcom.cpp:1053: error: expected primary-expression before ')' token
[exec] xpcom.cpp:1053: error: expected primary-expression before ',' token
[exec] xpcom.cpp:1053: error: expected primary-expression before ',' token
[exec] xpcom.cpp:1053: error: expected primary-expression before ',' token
[exec] xpcom.cpp:1053: error: expected primary-expression before '*' token
[exec] xpcom.cpp:1053: error: expected primary-expression before ')' token
[exec] xpcom.cpp: In function `jint Java_org_eclipse_swt_internal_mozilla_XPCOM_VtblCall__IILorg_eclipse_swt_internal_mozilla_nsID_2_3B_3BI(JNIEnv*, _jclass*, jint, jint, _jobject*, _jbyteArray*, _jbyteArray*, jint)':
[exec] xpcom.cpp:1067: error: `nsID' was not declared in this scope
[exec] xpcom.cpp:1067: error: expected `;' before "_arg2"
[exec] xpcom.cpp:1072: error: `lparg2' was not declared in this scope
[exec] xpcom.cpp:1072: error: `_arg2' was not declared in this scope
[exec] xpcom.cpp:1072: error: `getnsIDFields' was not declared in this scope
[exec] xpcom.cpp:1072: warning: unused variable 'lparg2'
[exec] xpcom.cpp:1072: warning: unused variable '_arg2'
[exec] xpcom.cpp:1072: warning: unused variable 'getnsIDFields'
[exec] xpcom.cpp:1075: error: `lparg2' was not declared in this scope
[exec] xpcom.cpp:1075: error: expected primary-expression before ')' token
[exec] xpcom.cpp:1075: error: expected primary-expression before '(' token
[exec] xpcom.cpp:1075: error: expected primary-expression before ')' token
[exec] xpcom.cpp:1075: error: expected primary-expression before ',' token
[exec] xpcom.cpp:1075: error: expected primary-expression before ',' token
[exec] xpcom.cpp:1075: error: expected primary-expression before '*' token
[exec] xpcom.cpp:1075: error: expected primary-expression before ',' token
[exec] xpcom.cpp:1075: error: expected primary-expression before '*' token
[exec] xpcom.cpp:1075: error: expected primary-expression before ',' token
[exec] xpcom.cpp:1075: error: expected primary-expression before ')' token
[exec] xpcom.cpp: In function `jint Java_org_eclipse_swt_internal_mozilla_XPCOM_VtblCall__IILorg_eclipse_swt_internal_mozilla_nsID_2_3B_3BI_3B_3B(JNIEnv*, _jclass*, jint, jint, _jobject*, _jbyteArray*, _jbyteArray*, jint, _jbyteArray*, _jbyteArray*)':
[exec] xpcom.cpp:1089: error: `nsID' was not declared in this scope
[exec] xpcom.cpp:1089: error: expected `;' before "_arg2"
[exec] xpcom.cpp:1096: error: `lparg2' was not declared in this scope
[exec] xpcom.cpp:1096: error: `_arg2' was not declared in this scope
[exec] xpcom.cpp:1096: error: `getnsIDFields' was not declared in this scope
[exec] xpcom.cpp:1096: warning: unused variable 'lparg2'
[exec] xpcom.cpp:1096: warning: unused variable '_arg2'
[exec] xpcom.cpp:1096: warning: unused variable 'getnsIDFields'
[exec] xpcom.cpp:1101: error: `lparg2' was not declared in this scope
[exec] xpcom.cpp:1101: error: expected primary-expression before ')' token
[exec] xpcom.cpp:1101: error: expected primary-expression before '(' token
[exec] xpcom.cpp:1101: error: expected primary-expression before ')' token
[exec] xpcom.cpp:1101: error: expected primary-expression before ',' token
[exec] xpcom.cpp:1101: error: expected primary-expression before ',' token
[exec] xpcom.cpp:1101: error: expected primary-expression before '*' token
[exec] xpcom.cpp:1101: error: expected primary-expression before ',' token
[exec] xpcom.cpp:1101: error: expected primary-expression before '*' token
[exec] xpcom.cpp:1101: error: expected primary-expression before ',' token
[exec] xpcom.cpp:1101: error: expected primary-expression before ',' token
[exec] xpcom.cpp:1101: error: expected primary-expression before '*' token
[exec] xpcom.cpp:1101: error: expected primary-expression before ',' token
[exec] xpcom.cpp:1101: error: expected primary-expression before '*' token
[exec] xpcom.cpp:1101: error: expected primary-expression before ')' token
[exec] xpcom.cpp: In function `jint Java_org_eclipse_swt_internal_mozilla_XPCOM_VtblCall__IILorg_eclipse_swt_internal_mozilla_nsID_2_3I(JNIEnv*, _jclass*, jint, jint, _jobject*, _jintArray*)':
[exec] xpcom.cpp:1117: error: `nsID' was not declared in this scope
[exec] xpcom.cpp:1117: error: expected `;' before "_arg2"
[exec] xpcom.cpp:1121: error: `lparg2' was not declared in this scope
[exec] xpcom.cpp:1121: error: `_arg2' was not declared in this scope
[exec] xpcom.cpp:1121: error: `getnsIDFields' was not declared in this scope
[exec] xpcom.cpp:1121: warning: unused variable 'lparg2'
[exec] xpcom.cpp:1121: warning: unused variable '_arg2'
[exec] xpcom.cpp:1121: warning: unused variable 'getnsIDFields'
[exec] xpcom.cpp:1123: error: `lparg2' was not declared in this scope
[exec] xpcom.cpp:1123: error: expected primary-expression before ')' token
[exec] xpcom.cpp:1123: error: expected primary-expression before '(' token
[exec] xpcom.cpp:1123: error: expected primary-expression before ')' token
[exec] xpcom.cpp:1123: error: expected primary-expression before ',' token
[exec] xpcom.cpp:1123: error: expected primary-expression before ',' token
[exec] xpcom.cpp:1123: error: expected primary-expression before '*' token
[exec] xpcom.cpp:1123: error: expected primary-expression before ')' token
[exec] xpcom.cpp: In function `jint Java_org_eclipse_swt_internal_mozilla_XPCOM_VtblCall__IILorg_eclipse_swt_internal_mozilla_nsID_2_3Z(JNIEnv*, _jclass*, jint, jint, _jobject*, _jbooleanArray*)':
[exec] xpcom.cpp:1136: error: `nsID' was not declared in this scope
[exec] xpcom.cpp:1136: error: expected `;' before "_arg2"
[exec] xpcom.cpp:1140: error: `lparg2' was not declared in this scope
[exec] xpcom.cpp:1140: error: `_arg2' was not declared in this scope
[exec] xpcom.cpp:1140: error: `getnsIDFields' was not declared in this scope
[exec] xpcom.cpp:1140: warning: unused variable 'lparg2'
[exec] xpcom.cpp:1140: warning: unused variable '_arg2'
[exec] xpcom.cpp:1140: warning: unused variable 'getnsIDFields'
[exec] xpcom.cpp:1142: error: `lparg2' was not declared in this scope
[exec] xpcom.cpp:1142: error: expected primary-expression before ')' token
[exec] xpcom.cpp:1142: error: expected primary-expression before '(' token
[exec] xpcom.cpp:1142: error: expected primary-expression before ')' token
[exec] xpcom.cpp:1142: error: expected primary-expression before ',' token
[exec] xpcom.cpp:1142: error: expected primary-expression before ',' token
[exec] xpcom.cpp:1142: error: expected primary-expression before '*' token
[exec] xpcom.cpp:1142: error: expected primary-expression before ')' token
[exec] xpcom.cpp: In function `jint Java_org_eclipse_swt_internal_mozilla_XPCOM_VtblCall__II_3BILorg_eclipse_swt_internal_mozilla_nsID_2_3I(JNIEnv*, _jclass*, jint, jint, _jbyteArray*, jint, _jobject*, _jintArray*)':
[exec] xpcom.cpp:1228: error: `nsID' was not declared in this scope
[exec] xpcom.cpp:1228: error: expected `;' before "_arg4"
[exec] xpcom.cpp:1233: error: `lparg4' was not declared in this scope
[exec] xpcom.cpp:1233: error: `_arg4' was not declared in this scope
[exec] xpcom.cpp:1233: error: `getnsIDFields' was not declared in this scope
[exec] xpcom.cpp:1233: warning: unused variable 'lparg4'
[exec] xpcom.cpp:1233: warning: unused variable '_arg4'
[exec] xpcom.cpp:1233: warning: unused variable 'getnsIDFields'
[exec] xpcom.cpp:1235: error: `lparg4' was not declared in this scope
[exec] xpcom.cpp:1235: error: expected primary-expression before ')' token
[exec] xpcom.cpp:1235: error: expected primary-expression before '(' token
[exec] xpcom.cpp:1235: error: expected primary-expression before ')' token
[exec] xpcom.cpp:1235: error: expected primary-expression before ',' token
[exec] xpcom.cpp:1235: error: expected primary-expression before '*' token
[exec] xpcom.cpp:1235: error: expected primary-expression before ',' token
[exec] xpcom.cpp:1235: error: expected primary-expression before ',' token
[exec] xpcom.cpp:1235: error: expected primary-expression before ',' token
[exec] xpcom.cpp:1235: error: expected primary-expression before '*' token
[exec] xpcom.cpp:1235: error: expected primary-expression before ')' token
[exec] xpcom.cpp: In function `jint Java_org_eclipse_swt_internal_mozilla_XPCOM_VtblCall__II_3BLorg_eclipse_swt_internal_mozilla_nsID_2I(JNIEnv*, _jclass*, jint, jint, _jbyteArray*, _jobject*, jint)':
[exec] xpcom.cpp:1285: error: `nsID' was not declared in this scope
[exec] xpcom.cpp:1285: error: expected `;' before "_arg3"
[exec] xpcom.cpp:1289: error: `lparg3' was not declared in this scope
[exec] xpcom.cpp:1289: error: `_arg3' was not declared in this scope
[exec] xpcom.cpp:1289: error: `getnsIDFields' was not declared in this scope
[exec] xpcom.cpp:1289: warning: unused variable 'lparg3'
[exec] xpcom.cpp:1289: warning: unused variable '_arg3'
[exec] xpcom.cpp:1289: warning: unused variable 'getnsIDFields'
[exec] xpcom.cpp:1290: error: `lparg3' was not declared in this scope
[exec] xpcom.cpp:1290: error: expected primary-expression before ')' token
[exec] xpcom.cpp:1290: error: expected primary-expression before '(' token
[exec] xpcom.cpp:1290: error: expected primary-expression before ')' token
[exec] xpcom.cpp:1290: error: expected primary-expression before ',' token
[exec] xpcom.cpp:1290: error: expected primary-expression before '*' token
[exec] xpcom.cpp:1290: error: expected primary-expression before ',' token
[exec] xpcom.cpp:1290: error: expected primary-expression before ',' token
[exec] xpcom.cpp:1290: error: expected primary-expression before ')' token
[exec] xpcom.cpp: In function `jint Java_org_eclipse_swt_internal_mozilla_XPCOM_VtblCall__II_3BLorg_eclipse_swt_internal_mozilla_nsID_2_3I(JNIEnv*, _jclass*, jint, jint, _jbyteArray*, _jobject*, _jintArray*)':
[exec] xpcom.cpp:1304: error: `nsID' was not declared in this scope
[exec] xpcom.cpp:1304: error: expected `;' before "_arg3"
[exec] xpcom.cpp:1309: error: `lparg3' was not declared in this scope
[exec] xpcom.cpp:1309: error: `_arg3' was not declared in this scope
[exec] xpcom.cpp:1309: error: `getnsIDFields' was not declared in this scope
[exec] xpcom.cpp:1309: warning: unused variable 'lparg3'
[exec] xpcom.cpp:1309: warning: unused variable '_arg3'
[exec] xpcom.cpp:1309: warning: unused variable 'getnsIDFields'
[exec] xpcom.cpp:1311: error: `lparg3' was not declared in this scope
[exec] xpcom.cpp:1311: error: expected primary-expression before ')' token
[exec] xpcom.cpp:1311: error: expected primary-expression before '(' token
[exec] xpcom.cpp:1311: error: expected primary-expression before ')' token
[exec] xpcom.cpp:1311: error: expected primary-expression before ',' token
[exec] xpcom.cpp:1311: error: expected primary-expression before '*' token
[exec] xpcom.cpp:1311: error: expected primary-expression before ',' token
[exec] xpcom.cpp:1311: error: expected primary-expression before ',' token
[exec] xpcom.cpp:1311: error: expected primary-expression before '*' token
[exec] xpcom.cpp:1311: error: expected primary-expression before ')' token
[exec] xpcom.cpp: In function `jint Java_org_eclipse_swt_internal_mozilla_XPCOM_VtblCall__II_3BLorg_eclipse_swt_internal_mozilla_nsID_2_3Z(JNIEnv*, _jclass*, jint, jint, _jbyteArray*, _jobject*, _jbooleanArray*)':
[exec] xpcom.cpp:1326: error: `nsID' was not declared in this scope
[exec] xpcom.cpp:1326: error: expected `;' before "_arg3"
[exec] xpcom.cpp:1331: error: `lparg3' was not declared in this scope
[exec] xpcom.cpp:1331: error: `_arg3' was not declared in this scope
[exec] xpcom.cpp:1331: error: `getnsIDFields' was not declared in this scope
[exec] xpcom.cpp:1331: warning: unused variable 'lparg3'
[exec] xpcom.cpp:1331: warning: unused variable '_arg3'
[exec] xpcom.cpp:1331: warning: unused variable 'getnsIDFields'
[exec] xpcom.cpp:1333: error: `lparg3' was not declared in this scope
[exec] xpcom.cpp:1333: error: expected primary-expression before ')' token
[exec] xpcom.cpp:1333: error: expected primary-expression before '(' token
[exec] xpcom.cpp:1333: error: expected primary-expression before ')' token
[exec] xpcom.cpp:1333: error: expected primary-expression before ',' token
[exec] xpcom.cpp:1333: error: expected primary-expression before '*' token
[exec] xpcom.cpp:1333: error: expected primary-expression before ',' token
[exec] xpcom.cpp:1333: error: expected primary-expression before ',' token
[exec] xpcom.cpp:1333: error: expected primary-expression before '*' token
[exec] xpcom.cpp:1333: error: expected primary-expression before ')' token
[exec] xpcom.cpp: In function `void Java_org_eclipse_swt_internal_mozilla_XPCOM_memmove__ILorg_eclipse_swt_internal_mozilla_nsID_2I(JNIEnv*, _jclass*, jint, _jobject*, jint)':
[exec] xpcom.cpp:1913: error: `nsID' was not declared in this scope
[exec] xpcom.cpp:1913: error: expected `;' before "_arg1"
[exec] xpcom.cpp:1915: error: `lparg1' was not declared in this scope
[exec] xpcom.cpp:1915: error: `_arg1' was not declared in this scope
[exec] xpcom.cpp:1915: error: `getnsIDFields' was not declared in this scope
[exec] xpcom.cpp:1915: warning: unused variable 'lparg1'
[exec] xpcom.cpp:1915: warning: unused variable '_arg1'
[exec] xpcom.cpp:1915: warning: unused variable 'getnsIDFields'
[exec] xpcom.cpp:1916: error: `lparg1' was not declared in this scope
[exec] xpcom.cpp:1916: error: `memmove' was not declared in this scope
[exec] xpcom.cpp:1913: warning: unused variable 'nsID'
[exec] xpcom.cpp:1916: warning: unused variable 'memmove'
[exec] xpcom.cpp: In function `void Java_org_eclipse_swt_internal_mozilla_XPCOM_memmove__I_3BI(JNIEnv*, _jclass*, jint, _jbyteArray*, jint)':
[exec] xpcom.cpp:1930: error: `memmove' was not declared in this scope
[exec] xpcom.cpp:1930: warning: unused variable 'memmove'
[exec] xpcom.cpp: In function `void Java_org_eclipse_swt_internal_mozilla_XPCOM_memmove__I_3CI(JNIEnv*, _jclass*, jint, _jcharArray*, jint)':
[exec] xpcom.cpp:1944: error: `memmove' was not declared in this scope
[exec] xpcom.cpp:1944: warning: unused variable 'memmove'
[exec] xpcom.cpp: In function `void Java_org_eclipse_swt_internal_mozilla_XPCOM_memmove__I_3II(JNIEnv*, _jclass*, jint, _jintArray*, jint)':
[exec] xpcom.cpp:1958: error: `memmove' was not declared in this scope
[exec] xpcom.cpp:1958: warning: unused variable 'memmove'
[exec] xpcom.cpp: In function `void Java_org_eclipse_swt_internal_mozilla_XPCOM_memmove__I_3JI(JNIEnv*, _jclass*, jint, _jlongArray*, jint)':
[exec] xpcom.cpp:1972: error: `memmove' was not declared in this scope
[exec] xpcom.cpp:1972: warning: unused variable 'memmove'
[exec] xpcom.cpp: In function `void Java_org_eclipse_swt_internal_mozilla_XPCOM_memmove__Lorg_eclipse_swt_internal_mozilla_nsID_2II(JNIEnv*, _jclass*, _jobject*, jint, jint)':
[exec] xpcom.cpp:1983: error: `nsID' was not declared in this scope
[exec] xpcom.cpp:1983: error: expected `;' before "_arg0"
[exec] xpcom.cpp:1985: error: `lparg0' was not declared in this scope
[exec] xpcom.cpp:1985: error: `_arg0' was not declared in this scope
[exec] xpcom.cpp:1985: error: `getnsIDFields' was not declared in this scope
[exec] xpcom.cpp:1985: warning: unused variable 'lparg0'
[exec] xpcom.cpp:1985: warning: unused variable '_arg0'
[exec] xpcom.cpp:1985: warning: unused variable 'getnsIDFields'
[exec] xpcom.cpp:1986: error: `lparg0' was not declared in this scope
[exec] xpcom.cpp:1986: error: `memmove' was not declared in this scope
[exec] xpcom.cpp:1983: warning: unused variable 'nsID'
[exec] xpcom.cpp:1986: warning: unused variable 'memmove'
[exec] xpcom.cpp: In function `void Java_org_eclipse_swt_internal_mozilla_XPCOM_memmove___3BII(JNIEnv*, _jclass*, _jbyteArray*, jint, jint)':
[exec] xpcom.cpp:2000: error: `memmove' was not declared in this scope
[exec] xpcom.cpp:2000: warning: unused variable 'memmove'
[exec] xpcom.cpp: In function `void Java_org_eclipse_swt_internal_mozilla_XPCOM_memmove___3B_3CI(JNIEnv*, _jclass*, _jbyteArray*, _jcharArray*, jint)':
[exec] xpcom.cpp:2016: error: `memmove' was not declared in this scope
[exec] xpcom.cpp:2016: warning: unused variable 'memmove'
[exec] xpcom.cpp: In function `void Java_org_eclipse_swt_internal_mozilla_XPCOM_memmove___3CII(JNIEnv*, _jclass*, _jcharArray*, jint, jint)':
[exec] xpcom.cpp:2031: error: `memmove' was not declared in this scope
[exec] xpcom.cpp:2031: warning: unused variable 'memmove'
[exec] xpcom.cpp: In function `void Java_org_eclipse_swt_internal_mozilla_XPCOM_memmove___3III(JNIEnv*, _jclass*, _jintArray*, jint, jint)':
[exec] xpcom.cpp:2045: error: `memmove' was not declared in this scope
[exec] xpcom.cpp:2045: warning: unused variable 'memmove'
[exec] xpcom.cpp: In function `void Java_org_eclipse_swt_internal_mozilla_XPCOM_memmove___3JII(JNIEnv*, _jclass*, _jlongArray*, jint, jint)':
[exec] xpcom.cpp:2059: error: `memmove' was not declared in this scope
[exec] xpcom.cpp:2059: warning: unused variable 'memmove'
[exec] xpcom.cpp: In function `jint Java_org_eclipse_swt_internal_mozilla_XPCOM_nsEmbedCString_1Length(JNIEnv*, _jclass*, jint)':
[exec] xpcom.cpp:2072: error: `nsEmbedCString' was not declared in this scope
[exec] xpcom.cpp:2072: error: expected primary-expression before ')' token
[exec] xpcom.cpp:2072: error: expected primary-expression before ')' token
[exec] xpcom.cpp: In function `void Java_org_eclipse_swt_internal_mozilla_XPCOM_nsEmbedCString_1delete(JNIEnv*, _jclass*, jint)':
[exec] xpcom.cpp:2083: error: `nsEmbedCString' was not declared in this scope
[exec] xpcom.cpp:2083: error: expected primary-expression before ')' token
[exec] xpcom.cpp:2083: error: expected `;' before "arg0"
[exec] xpcom.cpp:2083: warning: unused variable 'nsEmbedCString'
[exec] xpcom.cpp: In function `jint Java_org_eclipse_swt_internal_mozilla_XPCOM_nsEmbedCString_1get(JNIEnv*, _jclass*, jint)':
[exec] xpcom.cpp:2094: error: `nsEmbedCString' was not declared in this scope
[exec] xpcom.cpp:2094: error: expected primary-expression before ')' token
[exec] xpcom.cpp:2094: error: expected primary-expression before ')' token
[exec] xpcom.cpp: In function `jint Java_org_eclipse_swt_internal_mozilla_XPCOM_nsEmbedCString_1new__(JNIEnv*, _jclass*)':
[exec] xpcom.cpp:2106: error: expected primary-expression before ')' token
[exec] xpcom.cpp:2106: error: expected `;' before "new"
[exec] xpcom.cpp: In function `jint Java_org_eclipse_swt_internal_mozilla_XPCOM_nsEmbedCString_1new___3BI(JNIEnv*, _jclass*, _jbyteArray*, jint)':
[exec] xpcom.cpp:2120: error: expected primary-expression before ')' token
[exec] xpcom.cpp:2120: error: expected `;' before "new"
[exec] xpcom.cpp: In function `jint Java_org_eclipse_swt_internal_mozilla_XPCOM_nsEmbedString_1Length(JNIEnv*, _jclass*, jint)':
[exec] xpcom.cpp:2134: error: `nsEmbedString' was not declared in this scope
[exec] xpcom.cpp:2134: error: expected primary-expression before ')' token
[exec] xpcom.cpp:2134: error: expected primary-expression before ')' token
[exec] xpcom.cpp: In function `void Java_org_eclipse_swt_internal_mozilla_XPCOM_nsEmbedString_1delete(JNIEnv*, _jclass*, jint)':
[exec] xpcom.cpp:2145: error: `nsEmbedString' was not declared in this scope
[exec] xpcom.cpp:2145: error: expected primary-expression before ')' token
[exec] xpcom.cpp:2145: error: expected `;' before "arg0"
[exec] xpcom.cpp:2145: warning: unused variable 'nsEmbedString'
[exec] xpcom.cpp: In function `jint Java_org_eclipse_swt_internal_mozilla_XPCOM_nsEmbedString_1get(JNIEnv*, _jclass*, jint)':
[exec] xpcom.cpp:2156: error: `nsEmbedString' was not declared in this scope
[exec] xpcom.cpp:2156: error: expected primary-expression before ')' token
[exec] xpcom.cpp:2156: error: expected primary-expression before ')' token
[exec] xpcom.cpp: In function `jint Java_org_eclipse_swt_internal_mozilla_XPCOM_nsEmbedString_1new__(JNIEnv*, _jclass*)':
[exec] xpcom.cpp:2168: error: expected primary-expression before ')' token
[exec] xpcom.cpp:2168: error: expected `;' before "new"
[exec] xpcom.cpp: In function `jint Java_org_eclipse_swt_internal_mozilla_XPCOM_nsEmbedString_1new___3C(JNIEnv*, _jclass*, _jcharArray*)':
[exec] xpcom.cpp:2182: error: expected primary-expression before ')' token
[exec] xpcom.cpp:2182: error: expected `;' before "new"
[exec] xpcom.cpp: In function `jboolean Java_org_eclipse_swt_internal_mozilla_XPCOM_nsID_1Equals(JNIEnv*, _jclass*, jint, jint)':
[exec] xpcom.cpp:2196: error: `nsID' was not declared in this scope
[exec] xpcom.cpp:2196: error: expected primary-expression before ')' token
[exec] xpcom.cpp:2196: error: expected primary-expression before ')' token
[exec] xpcom.cpp:2196: error: expected primary-expression before ')' token
[exec] xpcom.cpp: In function `jboolean Java_org_eclipse_swt_internal_mozilla_XPCOM_nsID_1Parse(JNIEnv*, _jclass*, jint, _jstring*)':
[exec] xpcom.cpp:2210: error: `nsID' was not declared in this scope
[exec] xpcom.cpp:2210: error: expected primary-expression before ')' token
[exec] xpcom.cpp:2210: error: expected primary-expression before ')' token
[exec] xpcom.cpp: In function `void Java_org_eclipse_swt_internal_mozilla_XPCOM_nsID_1delete(JNIEnv*, _jclass*, jint)':
[exec] xpcom.cpp:2223: error: `nsID' was not declared in this scope
[exec] xpcom.cpp:2223: error: expected primary-expression before ')' token
[exec] xpcom.cpp:2223: error: expected `;' before "arg0"
[exec] xpcom.cpp:2223: warning: unused variable 'nsID'
[exec] xpcom.cpp: In function `jint Java_org_eclipse_swt_internal_mozilla_XPCOM_nsID_1new(JNIEnv*, _jclass*)':
[exec] xpcom.cpp:2234: error: expected primary-expression before ')' token
[exec] xpcom.cpp:2234: error: expected `;' before "new"
[exec] xpcom.cpp: In function `jint Java_org_eclipse_swt_internal_mozilla_XPCOM_strlen(JNIEnv*, _jclass*, jint)':
[exec] xpcom.cpp:2246: error: `strlen' was not declared in this scope
[exec] xpcom.cpp:2246: warning: unused variable 'strlen'
[exec] *** Error code 1
[exec] Stop in /usr/home/miwi/dev/newport/swt32/work/swt-M20060921-0945-gtk-linux-x86.
BUILD FAILED
/usr/home/miwi/dev/newport/swt32/work/swt-M20060921-0945-gtk-linux-x86/build.xml:51: exec returned: 1
Total time: 20 seconds
*** Error code 1
Stop in /usr/home/miwi/dev/newport/swt32.
===> Error running make build
===> Cleaning up