All pastes #26020 Raw Edit

Someone

public text v1 · immutable
#26020 ·published 2005-10-20 01:53 UTC
rendered paste body
mjerris@MIL-MJERRIS /usr/src/AutoMakeTest
$ make
Making all in libltdl
make[1]: Entering directory `/usr/src/AutoMakeTest/libltdl'
make  all-am
make[2]: Entering directory `/usr/src/AutoMakeTest/libltdl'
make[2]: Leaving directory `/usr/src/AutoMakeTest/libltdl'
make[1]: Leaving directory `/usr/src/AutoMakeTest/libltdl'
Making all in editline
make[1]: Entering directory `/usr/src/AutoMakeTest/editline'
make  all-recursive
make[2]: Entering directory `/usr/src/AutoMakeTest/editline'
Making all in src
make[3]: Entering directory `/usr/src/AutoMakeTest/editline/src'
make  all-am
make[4]: Entering directory `/usr/src/AutoMakeTest/editline/src'
make[4]: Nothing to be done for `all-am'.
make[4]: Leaving directory `/usr/src/AutoMakeTest/editline/src'
make[3]: Leaving directory `/usr/src/AutoMakeTest/editline/src'
make[3]: Entering directory `/usr/src/AutoMakeTest/editline'
make[3]: Leaving directory `/usr/src/AutoMakeTest/editline'
make[2]: Leaving directory `/usr/src/AutoMakeTest/editline'
make[1]: Leaving directory `/usr/src/AutoMakeTest/editline'
Making all in stdtime
make[1]: Entering directory `/usr/src/AutoMakeTest/stdtime'
make[1]: Nothing to be done for `all'.
make[1]: Leaving directory `/usr/src/AutoMakeTest/stdtime'
Making all in .
make[1]: Entering directory `/usr/src/AutoMakeTest'
if /bin/sh ./libtool --tag=CC --mode=compile gcc -DHAVE_CONFIG_H -I. -I. -I./inc
lude -I./include -I.  -I./editline/src   -fomit-frame-pointer -D_REENTRANT -Wall
 -Wstrict-prototypes -Wmissing-prototypes -Wmissing-declarations -DTHREADSAFE=1
 -export-dynamic -g -O2 -MT libopenpbx_la-stubfunctions-features.lo -MD -MP -MF
".deps/libopenpbx_la-stubfunctions-features.Tpo" -c -o libopenpbx_la-stubfunctio
ns-features.lo `test -f 'stubfunctions-features.c' || echo './'`stubfunctions-fe
atures.c; \
then mv -f ".deps/libopenpbx_la-stubfunctions-features.Tpo" ".deps/libopenpbx_la
-stubfunctions-features.Plo"; else rm -f ".deps/libopenpbx_la-stubfunctions-feat
ures.Tpo"; exit 1; fi
 gcc -DHAVE_CONFIG_H -I. -I. -I./include -I./include -I. -I./editline/src -fomit
-frame-pointer -D_REENTRANT -Wall -Wstrict-prototypes -Wmissing-prototypes -Wmis
sing-declarations -DTHREADSAFE=1 -export-dynamic -g -O2 -MT libopenpbx_la-stubfu
nctions-features.lo -MD -MP -MF .deps/libopenpbx_la-stubfunctions-features.Tpo -
c stubfunctions-features.c  -DPIC -o .libs/libopenpbx_la-stubfunctions-features.
o
 gcc -DHAVE_CONFIG_H -I. -I. -I./include -I./include -I. -I./editline/src -fomit
-frame-pointer -D_REENTRANT -Wall -Wstrict-prototypes -Wmissing-prototypes -Wmis
sing-declarations -DTHREADSAFE=1 -export-dynamic -g -O2 -MT libopenpbx_la-stubfu
nctions-features.lo -MD -MP -MF .deps/libopenpbx_la-stubfunctions-features.Tpo -
c stubfunctions-features.c -o libopenpbx_la-stubfunctions-features.o >/dev/null
2>&1
if /bin/sh ./libtool --tag=CC --mode=compile gcc -DHAVE_CONFIG_H -I. -I. -I./inc
lude -I./include -I.  -I./editline/src   -fomit-frame-pointer -D_REENTRANT -Wall
 -Wstrict-prototypes -Wmissing-prototypes -Wmissing-declarations -DTHREADSAFE=1
 -export-dynamic -g -O2 -MT libopenpbx_la-stubfunctions-monitor.lo -MD -MP -MF "
.deps/libopenpbx_la-stubfunctions-monitor.Tpo" -c -o libopenpbx_la-stubfunctions
-monitor.lo `test -f 'stubfunctions-monitor.c' || echo './'`stubfunctions-monito
r.c; \
then mv -f ".deps/libopenpbx_la-stubfunctions-monitor.Tpo" ".deps/libopenpbx_la-
stubfunctions-monitor.Plo"; else rm -f ".deps/libopenpbx_la-stubfunctions-monito
r.Tpo"; exit 1; fi
make[1]: *** [libopenpbx_la-stubfunctions-monitor.lo] Interrupt
make: *** [all-recursive] Interrupt


mjerris@MIL-MJERRIS /usr/src/AutoMakeTest
$ make
Making all in libltdl
make[1]: Entering directory `/usr/src/AutoMakeTest/libltdl'
make  all-am
make[2]: Entering directory `/usr/src/AutoMakeTest/libltdl'
make[2]: Leaving directory `/usr/src/AutoMakeTest/libltdl'
make[1]: Leaving directory `/usr/src/AutoMakeTest/libltdl'
Making all in editline
make[1]: Entering directory `/usr/src/AutoMakeTest/editline'
make  all-recursive
make[2]: Entering directory `/usr/src/AutoMakeTest/editline'
Making all in src
make[3]: Entering directory `/usr/src/AutoMakeTest/editline/src'
make  all-am
make[4]: Entering directory `/usr/src/AutoMakeTest/editline/src'
make[4]: Nothing to be done for `all-am'.
make[4]: Leaving directory `/usr/src/AutoMakeTest/editline/src'
make[3]: Leaving directory `/usr/src/AutoMakeTest/editline/src'
make[3]: Entering directory `/usr/src/AutoMakeTest/editline'
make[3]: Leaving directory `/usr/src/AutoMakeTest/editline'
make[2]: Leaving directory `/usr/src/AutoMakeTest/editline'
make[1]: Leaving directory `/usr/src/AutoMakeTest/editline'
Making all in stdtime
make[1]: Entering directory `/usr/src/AutoMakeTest/stdtime'
make[1]: Nothing to be done for `all'.
make[1]: Leaving directory `/usr/src/AutoMakeTest/stdtime'
Making all in .
make[1]: Entering directory `/usr/src/AutoMakeTest'
if /bin/sh ./libtool --tag=CC --mode=compile gcc -DHAVE_CONFIG_H -I. -I. -I./inc
lude -I./include -I.  -I./editline/src   -fomit-frame-pointer -D_REENTRANT -Wall
 -Wstrict-prototypes -Wmissing-prototypes -Wmissing-declarations -DTHREADSAFE=1
 -export-dynamic -g -O2 -MT libopenpbx_la-stubfunctions-monitor.lo -MD -MP -MF "
.deps/libopenpbx_la-stubfunctions-monitor.Tpo" -c -o libopenpbx_la-stubfunctions
-monitor.lo `test -f 'stubfunctions-monitor.c' || echo './'`stubfunctions-monito
r.c; \
then mv -f ".deps/libopenpbx_la-stubfunctions-monitor.Tpo" ".deps/libopenpbx_la-
stubfunctions-monitor.Plo"; else rm -f ".deps/libopenpbx_la-stubfunctions-monito
r.Tpo"; exit 1; fi
 gcc -DHAVE_CONFIG_H -I. -I. -I./include -I./include -I. -I./editline/src -fomit
-frame-pointer -D_REENTRANT -Wall -Wstrict-prototypes -Wmissing-prototypes -Wmis
sing-declarations -DTHREADSAFE=1 -export-dynamic -g -O2 -MT libopenpbx_la-stubfu
nctions-monitor.lo -MD -MP -MF .deps/libopenpbx_la-stubfunctions-monitor.Tpo -c
stubfunctions-monitor.c  -DPIC -o .libs/libopenpbx_la-stubfunctions-monitor.o
 gcc -DHAVE_CONFIG_H -I. -I. -I./include -I./include -I. -I./editline/src -fomit
-frame-pointer -D_REENTRANT -Wall -Wstrict-prototypes -Wmissing-prototypes -Wmis
sing-declarations -DTHREADSAFE=1 -export-dynamic -g -O2 -MT libopenpbx_la-stubfu
nctions-monitor.lo -MD -MP -MF .deps/libopenpbx_la-stubfunctions-monitor.Tpo -c
stubfunctions-monitor.c -o libopenpbx_la-stubfunctions-monitor.o >/dev/null 2>&1

if /bin/sh ./libtool --tag=CC --mode=compile gcc -DHAVE_CONFIG_H -I. -I. -I./inc
lude -I./include -I.  -I./editline/src   -fomit-frame-pointer -D_REENTRANT -Wall
 -Wstrict-prototypes -Wmissing-prototypes -Wmissing-declarations -DTHREADSAFE=1
 -export-dynamic -g -O2 -MT libopenpbx_la-attach.lo -MD -MP -MF ".deps/libopenpb
x_la-attach.Tpo" -c -o libopenpbx_la-attach.lo `test -f 'sqlite3-embedded/attach
.c' || echo './'`sqlite3-embedded/attach.c; \
then mv -f ".deps/libopenpbx_la-attach.Tpo" ".deps/libopenpbx_la-attach.Plo"; el
se rm -f ".deps/libopenpbx_la-attach.Tpo"; exit 1; fi
 gcc -DHAVE_CONFIG_H -I. -I. -I./include -I./include -I. -I./editline/src -fomit
-frame-pointer -D_REENTRANT -Wall -Wstrict-prototypes -Wmissing-prototypes -Wmis
sing-declarations -DTHREADSAFE=1 -export-dynamic -g -O2 -MT libopenpbx_la-attach
.lo -MD -MP -MF .deps/libopenpbx_la-attach.Tpo -c sqlite3-embedded/attach.c  -DP
IC -o .libs/libopenpbx_la-attach.o
In file included from sqlite3-embedded/sqliteInt.h:53,
                 from sqlite3-embedded/attach.c:16:
sqlite3-embedded/sqlite3.h:1254: warning: function declaration isn't a prototype

 gcc -DHAVE_CONFIG_H -I. -I. -I./include -I./include -I. -I./editline/src -fomit
-frame-pointer -D_REENTRANT -Wall -Wstrict-prototypes -Wmissing-prototypes -Wmis
sing-declarations -DTHREADSAFE=1 -export-dynamic -g -O2 -MT libopenpbx_la-attach
.lo -MD -MP -MF .deps/libopenpbx_la-attach.Tpo -c sqlite3-embedded/attach.c -o l
ibopenpbx_la-attach.o >/dev/null 2>&1
if /bin/sh ./libtool --tag=CC --mode=compile gcc -DHAVE_CONFIG_H -I. -I. -I./inc
lude -I./include -I.  -I./editline/src   -fomit-frame-pointer -D_REENTRANT -Wall
 -Wstrict-prototypes -Wmissing-prototypes -Wmissing-declarations -DTHREADSAFE=1
 -export-dynamic -g -O2 -MT libopenpbx_la-auth.lo -MD -MP -MF ".deps/libopenpbx_
la-auth.Tpo" -c -o libopenpbx_la-auth.lo `test -f 'sqlite3-embedded/auth.c' || e
cho './'`sqlite3-embedded/auth.c; \
then mv -f ".deps/libopenpbx_la-auth.Tpo" ".deps/libopenpbx_la-auth.Plo"; else r
m -f ".deps/libopenpbx_la-auth.Tpo"; exit 1; fi
 gcc -DHAVE_CONFIG_H -I. -I. -I./include -I./include -I. -I./editline/src -fomit
-frame-pointer -D_REENTRANT -Wall -Wstrict-prototypes -Wmissing-prototypes -Wmis
sing-declarations -DTHREADSAFE=1 -export-dynamic -g -O2 -MT libopenpbx_la-auth.l
o -MD -MP -MF .deps/libopenpbx_la-auth.Tpo -c sqlite3-embedded/auth.c  -DPIC -o
.libs/libopenpbx_la-auth.o
In file included from sqlite3-embedded/sqliteInt.h:53,
                 from sqlite3-embedded/auth.c:19:
sqlite3-embedded/sqlite3.h:1254: warning: function declaration isn't a prototype

 gcc -DHAVE_CONFIG_H -I. -I. -I./include -I./include -I. -I./editline/src -fomit
-frame-pointer -D_REENTRANT -Wall -Wstrict-prototypes -Wmissing-prototypes -Wmis
sing-declarations -DTHREADSAFE=1 -export-dynamic -g -O2 -MT libopenpbx_la-auth.l
o -MD -MP -MF .deps/libopenpbx_la-auth.Tpo -c sqlite3-embedded/auth.c -o libopen
pbx_la-auth.o >/dev/null 2>&1
if /bin/sh ./libtool --tag=CC --mode=compile gcc -DHAVE_CONFIG_H -I. -I. -I./inc
lude -I./include -I.  -I./editline/src   -fomit-frame-pointer -D_REENTRANT -Wall
 -Wstrict-prototypes -Wmissing-prototypes -Wmissing-declarations -DTHREADSAFE=1
 -export-dynamic -g -O2 -MT libopenpbx_la-btree.lo -MD -MP -MF ".deps/libopenpbx
_la-btree.Tpo" -c -o libopenpbx_la-btree.lo `test -f 'sqlite3-embedded/btree.c'
|| echo './'`sqlite3-embedded/btree.c; \
then mv -f ".deps/libopenpbx_la-btree.Tpo" ".deps/libopenpbx_la-btree.Plo"; else
 rm -f ".deps/libopenpbx_la-btree.Tpo"; exit 1; fi
 gcc -DHAVE_CONFIG_H -I. -I. -I./include -I./include -I. -I./editline/src -fomit
-frame-pointer -D_REENTRANT -Wall -Wstrict-prototypes -Wmissing-prototypes -Wmis
sing-declarations -DTHREADSAFE=1 -export-dynamic -g -O2 -MT libopenpbx_la-btree.
lo -MD -MP -MF .deps/libopenpbx_la-btree.Tpo -c sqlite3-embedded/btree.c  -DPIC
-o .libs/libopenpbx_la-btree.o
In file included from sqlite3-embedded/sqliteInt.h:53,
                 from sqlite3-embedded/btree.c:208:
sqlite3-embedded/sqlite3.h:1254: warning: function declaration isn't a prototype

sqlite3-embedded/btree.c: In function `ptrmapPut':
sqlite3-embedded/btree.c:500: warning: dereferencing type-punned pointer will br
eak strict-aliasing rules
sqlite3-embedded/btree.c: In function `ptrmapGet':
sqlite3-embedded/btree.c:533: warning: dereferencing type-punned pointer will br
eak strict-aliasing rules
sqlite3-embedded/btree.c: In function `getPage':
sqlite3-embedded/btree.c:1125: warning: dereferencing type-punned pointer will b
reak strict-aliasing rules
sqlite3-embedded/btree.c: In function `getPayload':
sqlite3-embedded/btree.c:2395: warning: dereferencing type-punned pointer will b
reak strict-aliasing rules
sqlite3-embedded/btree.c: In function `sqlite3BtreeGetMeta':
sqlite3-embedded/btree.c:5058: warning: dereferencing type-punned pointer will b
reak strict-aliasing rules
sqlite3-embedded/btree.c: In function `checkList':
sqlite3-embedded/btree.c:5397: warning: dereferencing type-punned pointer will b
reak strict-aliasing rules
 gcc -DHAVE_CONFIG_H -I. -I. -I./include -I./include -I. -I./editline/src -fomit
-frame-pointer -D_REENTRANT -Wall -Wstrict-prototypes -Wmissing-prototypes -Wmis
sing-declarations -DTHREADSAFE=1 -export-dynamic -g -O2 -MT libopenpbx_la-btree.
lo -MD -MP -MF .deps/libopenpbx_la-btree.Tpo -c sqlite3-embedded/btree.c -o libo
penpbx_la-btree.o >/dev/null 2>&1
if /bin/sh ./libtool --tag=CC --mode=compile gcc -DHAVE_CONFIG_H -I. -I. -I./inc
lude -I./include -I.  -I./editline/src   -fomit-frame-pointer -D_REENTRANT -Wall
 -Wstrict-prototypes -Wmissing-prototypes -Wmissing-declarations -DTHREADSAFE=1
 -export-dynamic -g -O2 -MT libopenpbx_la-build.lo -MD -MP -MF ".deps/libopenpbx
_la-build.Tpo" -c -o libopenpbx_la-build.lo `test -f 'sqlite3-embedded/build.c'
|| echo './'`sqlite3-embedded/build.c; \
then mv -f ".deps/libopenpbx_la-build.Tpo" ".deps/libopenpbx_la-build.Plo"; else
 rm -f ".deps/libopenpbx_la-build.Tpo"; exit 1; fi
 gcc -DHAVE_CONFIG_H -I. -I. -I./include -I./include -I. -I./editline/src -fomit
-frame-pointer -D_REENTRANT -Wall -Wstrict-prototypes -Wmissing-prototypes -Wmis
sing-declarations -DTHREADSAFE=1 -export-dynamic -g -O2 -MT libopenpbx_la-build.
lo -MD -MP -MF .deps/libopenpbx_la-build.Tpo -c sqlite3-embedded/build.c  -DPIC
-o .libs/libopenpbx_la-build.o
In file included from sqlite3-embedded/sqliteInt.h:53,
                 from sqlite3-embedded/build.c:27:
sqlite3-embedded/sqlite3.h:1254: warning: function declaration isn't a prototype

 gcc -DHAVE_CONFIG_H -I. -I. -I./include -I./include -I. -I./editline/src -fomit
-frame-pointer -D_REENTRANT -Wall -Wstrict-prototypes -Wmissing-prototypes -Wmis
sing-declarations -DTHREADSAFE=1 -export-dynamic -g -O2 -MT libopenpbx_la-build.
lo -MD -MP -MF .deps/libopenpbx_la-build.Tpo -c sqlite3-embedded/build.c -o libo
penpbx_la-build.o >/dev/null 2>&1
if /bin/sh ./libtool --tag=CC --mode=compile gcc -DHAVE_CONFIG_H -I. -I. -I./inc
lude -I./include -I.  -I./editline/src   -fomit-frame-pointer -D_REENTRANT -Wall
 -Wstrict-prototypes -Wmissing-prototypes -Wmissing-declarations -DTHREADSAFE=1
 -export-dynamic -g -O2 -MT libopenpbx_la-date.lo -MD -MP -MF ".deps/libopenpbx_
la-date.Tpo" -c -o libopenpbx_la-date.lo `test -f 'sqlite3-embedded/date.c' || e
cho './'`sqlite3-embedded/date.c; \
then mv -f ".deps/libopenpbx_la-date.Tpo" ".deps/libopenpbx_la-date.Plo"; else r
m -f ".deps/libopenpbx_la-date.Tpo"; exit 1; fi
 gcc -DHAVE_CONFIG_H -I. -I. -I./include -I./include -I. -I./editline/src -fomit
-frame-pointer -D_REENTRANT -Wall -Wstrict-prototypes -Wmissing-prototypes -Wmis
sing-declarations -DTHREADSAFE=1 -export-dynamic -g -O2 -MT libopenpbx_la-date.l
o -MD -MP -MF .deps/libopenpbx_la-date.Tpo -c sqlite3-embedded/date.c  -DPIC -o
.libs/libopenpbx_la-date.o
In file included from sqlite3-embedded/sqliteInt.h:53,
                 from sqlite3-embedded/date.c:50:
sqlite3-embedded/sqlite3.h:1254: warning: function declaration isn't a prototype

 gcc -DHAVE_CONFIG_H -I. -I. -I./include -I./include -I. -I./editline/src -fomit
-frame-pointer -D_REENTRANT -Wall -Wstrict-prototypes -Wmissing-prototypes -Wmis
sing-declarations -DTHREADSAFE=1 -export-dynamic -g -O2 -MT libopenpbx_la-date.l
o -MD -MP -MF .deps/libopenpbx_la-date.Tpo -c sqlite3-embedded/date.c -o libopen
pbx_la-date.o >/dev/null 2>&1
if /bin/sh ./libtool --tag=CC --mode=compile gcc -DHAVE_CONFIG_H -I. -I. -I./inc
lude -I./include -I.  -I./editline/src   -fomit-frame-pointer -D_REENTRANT -Wall
 -Wstrict-prototypes -Wmissing-prototypes -Wmissing-declarations -DTHREADSAFE=1
 -export-dynamic -g -O2 -MT libopenpbx_la-delete.lo -MD -MP -MF ".deps/libopenpb
x_la-delete.Tpo" -c -o libopenpbx_la-delete.lo `test -f 'sqlite3-embedded/delete
.c' || echo './'`sqlite3-embedded/delete.c; \
then mv -f ".deps/libopenpbx_la-delete.Tpo" ".deps/libopenpbx_la-delete.Plo"; el
se rm -f ".deps/libopenpbx_la-delete.Tpo"; exit 1; fi
 gcc -DHAVE_CONFIG_H -I. -I. -I./include -I./include -I. -I./editline/src -fomit
-frame-pointer -D_REENTRANT -Wall -Wstrict-prototypes -Wmissing-prototypes -Wmis
sing-declarations -DTHREADSAFE=1 -export-dynamic -g -O2 -MT libopenpbx_la-delete
.lo -MD -MP -MF .deps/libopenpbx_la-delete.Tpo -c sqlite3-embedded/delete.c  -DP
IC -o .libs/libopenpbx_la-delete.o
In file included from sqlite3-embedded/sqliteInt.h:53,
                 from sqlite3-embedded/delete.c:17:
sqlite3-embedded/sqlite3.h:1254: warning: function declaration isn't a prototype

 gcc -DHAVE_CONFIG_H -I. -I. -I./include -I./include -I. -I./editline/src -fomit
-frame-pointer -D_REENTRANT -Wall -Wstrict-prototypes -Wmissing-prototypes -Wmis
sing-declarations -DTHREADSAFE=1 -export-dynamic -g -O2 -MT libopenpbx_la-delete
.lo -MD -MP -MF .deps/libopenpbx_la-delete.Tpo -c sqlite3-embedded/delete.c -o l
ibopenpbx_la-delete.o >/dev/null 2>&1
if /bin/sh ./libtool --tag=CC --mode=compile gcc -DHAVE_CONFIG_H -I. -I. -I./inc
lude -I./include -I.  -I./editline/src   -fomit-frame-pointer -D_REENTRANT -Wall
 -Wstrict-prototypes -Wmissing-prototypes -Wmissing-declarations -DTHREADSAFE=1
 -export-dynamic -g -O2 -MT libopenpbx_la-expr.lo -MD -MP -MF ".deps/libopenpbx_
la-expr.Tpo" -c -o libopenpbx_la-expr.lo `test -f 'sqlite3-embedded/expr.c' || e
cho './'`sqlite3-embedded/expr.c; \
then mv -f ".deps/libopenpbx_la-expr.Tpo" ".deps/libopenpbx_la-expr.Plo"; else r
m -f ".deps/libopenpbx_la-expr.Tpo"; exit 1; fi
 gcc -DHAVE_CONFIG_H -I. -I. -I./include -I./include -I. -I./editline/src -fomit
-frame-pointer -D_REENTRANT -Wall -Wstrict-prototypes -Wmissing-prototypes -Wmis
sing-declarations -DTHREADSAFE=1 -export-dynamic -g -O2 -MT libopenpbx_la-expr.l
o -MD -MP -MF .deps/libopenpbx_la-expr.Tpo -c sqlite3-embedded/expr.c  -DPIC -o
.libs/libopenpbx_la-expr.o
In file included from sqlite3-embedded/sqliteInt.h:53,
                 from sqlite3-embedded/expr.c:17:
sqlite3-embedded/sqlite3.h:1254: warning: function declaration isn't a prototype

sqlite3-embedded/expr.c: In function `sqlite3ExprCode':
sqlite3-embedded/expr.c:1521: warning: 'op' might be used uninitialized in this
function
 gcc -DHAVE_CONFIG_H -I. -I. -I./include -I./include -I. -I./editline/src -fomit
-frame-pointer -D_REENTRANT -Wall -Wstrict-prototypes -Wmissing-prototypes -Wmis
sing-declarations -DTHREADSAFE=1 -export-dynamic -g -O2 -MT libopenpbx_la-expr.l
o -MD -MP -MF .deps/libopenpbx_la-expr.Tpo -c sqlite3-embedded/expr.c -o libopen
pbx_la-expr.o >/dev/null 2>&1
if /bin/sh ./libtool --tag=CC --mode=compile gcc -DHAVE_CONFIG_H -I. -I. -I./inc
lude -I./include -I.  -I./editline/src   -fomit-frame-pointer -D_REENTRANT -Wall
 -Wstrict-prototypes -Wmissing-prototypes -Wmissing-declarations -DTHREADSAFE=1
 -export-dynamic -g -O2 -MT libopenpbx_la-func.lo -MD -MP -MF ".deps/libopenpbx_
la-func.Tpo" -c -o libopenpbx_la-func.lo `test -f 'sqlite3-embedded/func.c' || e
cho './'`sqlite3-embedded/func.c; \
then mv -f ".deps/libopenpbx_la-func.Tpo" ".deps/libopenpbx_la-func.Plo"; else r
m -f ".deps/libopenpbx_la-func.Tpo"; exit 1; fi
 gcc -DHAVE_CONFIG_H -I. -I. -I./include -I./include -I. -I./editline/src -fomit
-frame-pointer -D_REENTRANT -Wall -Wstrict-prototypes -Wmissing-prototypes -Wmis
sing-declarations -DTHREADSAFE=1 -export-dynamic -g -O2 -MT libopenpbx_la-func.l
o -MD -MP -MF .deps/libopenpbx_la-func.Tpo -c sqlite3-embedded/func.c  -DPIC -o
.libs/libopenpbx_la-func.o
In file included from sqlite3-embedded/sqliteInt.h:53,
                 from sqlite3-embedded/func.c:21:
sqlite3-embedded/sqlite3.h:1254: warning: function declaration isn't a prototype

 gcc -DHAVE_CONFIG_H -I. -I. -I./include -I./include -I. -I./editline/src -fomit
-frame-pointer -D_REENTRANT -Wall -Wstrict-prototypes -Wmissing-prototypes -Wmis
sing-declarations -DTHREADSAFE=1 -export-dynamic -g -O2 -MT libopenpbx_la-func.l
o -MD -MP -MF .deps/libopenpbx_la-func.Tpo -c sqlite3-embedded/func.c -o libopen
pbx_la-func.o >/dev/null 2>&1
if /bin/sh ./libtool --tag=CC --mode=compile gcc -DHAVE_CONFIG_H -I. -I. -I./inc
lude -I./include -I.  -I./editline/src   -fomit-frame-pointer -D_REENTRANT -Wall
 -Wstrict-prototypes -Wmissing-prototypes -Wmissing-declarations -DTHREADSAFE=1
 -export-dynamic -g -O2 -MT libopenpbx_la-hash.lo -MD -MP -MF ".deps/libopenpbx_
la-hash.Tpo" -c -o libopenpbx_la-hash.lo `test -f 'sqlite3-embedded/hash.c' || e
cho './'`sqlite3-embedded/hash.c; \
then mv -f ".deps/libopenpbx_la-hash.Tpo" ".deps/libopenpbx_la-hash.Plo"; else r
m -f ".deps/libopenpbx_la-hash.Tpo"; exit 1; fi
 gcc -DHAVE_CONFIG_H -I. -I. -I./include -I./include -I. -I./editline/src -fomit
-frame-pointer -D_REENTRANT -Wall -Wstrict-prototypes -Wmissing-prototypes -Wmis
sing-declarations -DTHREADSAFE=1 -export-dynamic -g -O2 -MT libopenpbx_la-hash.l
o -MD -MP -MF .deps/libopenpbx_la-hash.Tpo -c sqlite3-embedded/hash.c  -DPIC -o
.libs/libopenpbx_la-hash.o
In file included from sqlite3-embedded/sqliteInt.h:53,
                 from sqlite3-embedded/hash.c:17:
sqlite3-embedded/sqlite3.h:1254: warning: function declaration isn't a prototype

 gcc -DHAVE_CONFIG_H -I. -I. -I./include -I./include -I. -I./editline/src -fomit
-frame-pointer -D_REENTRANT -Wall -Wstrict-prototypes -Wmissing-prototypes -Wmis
sing-declarations -DTHREADSAFE=1 -export-dynamic -g -O2 -MT libopenpbx_la-hash.l
o -MD -MP -MF .deps/libopenpbx_la-hash.Tpo -c sqlite3-embedded/hash.c -o libopen
pbx_la-hash.o >/dev/null 2>&1
if /bin/sh ./libtool --tag=CC --mode=compile gcc -DHAVE_CONFIG_H -I. -I. -I./inc
lude -I./include -I.  -I./editline/src   -fomit-frame-pointer -D_REENTRANT -Wall
 -Wstrict-prototypes -Wmissing-prototypes -Wmissing-declarations -DTHREADSAFE=1
 -export-dynamic -g -O2 -MT libopenpbx_la-insert.lo -MD -MP -MF ".deps/libopenpb
x_la-insert.Tpo" -c -o libopenpbx_la-insert.lo `test -f 'sqlite3-embedded/insert
.c' || echo './'`sqlite3-embedded/insert.c; \
then mv -f ".deps/libopenpbx_la-insert.Tpo" ".deps/libopenpbx_la-insert.Plo"; el
se rm -f ".deps/libopenpbx_la-insert.Tpo"; exit 1; fi
 gcc -DHAVE_CONFIG_H -I. -I. -I./include -I./include -I. -I./editline/src -fomit
-frame-pointer -D_REENTRANT -Wall -Wstrict-prototypes -Wmissing-prototypes -Wmis
sing-declarations -DTHREADSAFE=1 -export-dynamic -g -O2 -MT libopenpbx_la-insert
.lo -MD -MP -MF .deps/libopenpbx_la-insert.Tpo -c sqlite3-embedded/insert.c  -DP
IC -o .libs/libopenpbx_la-insert.o
In file included from sqlite3-embedded/sqliteInt.h:53,
                 from sqlite3-embedded/insert.c:17:
sqlite3-embedded/sqlite3.h:1254: warning: function declaration isn't a prototype

sqlite3-embedded/insert.c: In function `sqlite3Insert':
sqlite3-embedded/insert.c:222: warning: 'counterRowid' might be used uninitializ
ed in this function
 gcc -DHAVE_CONFIG_H -I. -I. -I./include -I./include -I. -I./editline/src -fomit
-frame-pointer -D_REENTRANT -Wall -Wstrict-prototypes -Wmissing-prototypes -Wmis
sing-declarations -DTHREADSAFE=1 -export-dynamic -g -O2 -MT libopenpbx_la-insert
.lo -MD -MP -MF .deps/libopenpbx_la-insert.Tpo -c sqlite3-embedded/insert.c -o l
ibopenpbx_la-insert.o >/dev/null 2>&1
if /bin/sh ./libtool --tag=CC --mode=compile gcc -DHAVE_CONFIG_H -I. -I. -I./inc
lude -I./include -I.  -I./editline/src   -fomit-frame-pointer -D_REENTRANT -Wall
 -Wstrict-prototypes -Wmissing-prototypes -Wmissing-declarations -DTHREADSAFE=1
 -export-dynamic -g -O2 -MT libopenpbx_la-legacy.lo -MD -MP -MF ".deps/libopenpb
x_la-legacy.Tpo" -c -o libopenpbx_la-legacy.lo `test -f 'sqlite3-embedded/legacy
.c' || echo './'`sqlite3-embedded/legacy.c; \
then mv -f ".deps/libopenpbx_la-legacy.Tpo" ".deps/libopenpbx_la-legacy.Plo"; el
se rm -f ".deps/libopenpbx_la-legacy.Tpo"; exit 1; fi
 gcc -DHAVE_CONFIG_H -I. -I. -I./include -I./include -I. -I./editline/src -fomit
-frame-pointer -D_REENTRANT -Wall -Wstrict-prototypes -Wmissing-prototypes -Wmis
sing-declarations -DTHREADSAFE=1 -export-dynamic -g -O2 -MT libopenpbx_la-legacy
.lo -MD -MP -MF .deps/libopenpbx_la-legacy.Tpo -c sqlite3-embedded/legacy.c  -DP
IC -o .libs/libopenpbx_la-legacy.o
In file included from sqlite3-embedded/sqliteInt.h:53,
                 from sqlite3-embedded/legacy.c:20:
sqlite3-embedded/sqlite3.h:1254: warning: function declaration isn't a prototype

 gcc -DHAVE_CONFIG_H -I. -I. -I./include -I./include -I. -I./editline/src -fomit
-frame-pointer -D_REENTRANT -Wall -Wstrict-prototypes -Wmissing-prototypes -Wmis
sing-declarations -DTHREADSAFE=1 -export-dynamic -g -O2 -MT libopenpbx_la-legacy
.lo -MD -MP -MF .deps/libopenpbx_la-legacy.Tpo -c sqlite3-embedded/legacy.c -o l
ibopenpbx_la-legacy.o >/dev/null 2>&1
if /bin/sh ./libtool --tag=CC --mode=compile gcc -DHAVE_CONFIG_H -I. -I. -I./inc
lude -I./include -I.  -I./editline/src   -fomit-frame-pointer -D_REENTRANT -Wall
 -Wstrict-prototypes -Wmissing-prototypes -Wmissing-declarations -DTHREADSAFE=1
 -export-dynamic -g -O2 -MT libopenpbx_la-sqlite3main.lo -MD -MP -MF ".deps/libo
penpbx_la-sqlite3main.Tpo" -c -o libopenpbx_la-sqlite3main.lo `test -f 'sqlite3-
embedded/sqlite3main.c' || echo './'`sqlite3-embedded/sqlite3main.c; \
then mv -f ".deps/libopenpbx_la-sqlite3main.Tpo" ".deps/libopenpbx_la-sqlite3mai
n.Plo"; else rm -f ".deps/libopenpbx_la-sqlite3main.Tpo"; exit 1; fi
 gcc -DHAVE_CONFIG_H -I. -I. -I./include -I./include -I. -I./editline/src -fomit
-frame-pointer -D_REENTRANT -Wall -Wstrict-prototypes -Wmissing-prototypes -Wmis
sing-declarations -DTHREADSAFE=1 -export-dynamic -g -O2 -MT libopenpbx_la-sqlite
3main.lo -MD -MP -MF .deps/libopenpbx_la-sqlite3main.Tpo -c sqlite3-embedded/sql
ite3main.c  -DPIC -o .libs/libopenpbx_la-sqlite3main.o
In file included from sqlite3-embedded/sqliteInt.h:53,
                 from sqlite3-embedded/sqlite3main.c:19:
sqlite3-embedded/sqlite3.h:1254: warning: function declaration isn't a prototype

sqlite3-embedded/sqlite3main.c:1012: warning: function declaration isn't a proto
type
 gcc -DHAVE_CONFIG_H -I. -I. -I./include -I./include -I. -I./editline/src -fomit
-frame-pointer -D_REENTRANT -Wall -Wstrict-prototypes -Wmissing-prototypes -Wmis
sing-declarations -DTHREADSAFE=1 -export-dynamic -g -O2 -MT libopenpbx_la-sqlite
3main.lo -MD -MP -MF .deps/libopenpbx_la-sqlite3main.Tpo -c sqlite3-embedded/sql
ite3main.c -o libopenpbx_la-sqlite3main.o >/dev/null 2>&1
if /bin/sh ./libtool --tag=CC --mode=compile gcc -DHAVE_CONFIG_H -I. -I. -I./inc
lude -I./include -I.  -I./editline/src   -fomit-frame-pointer -D_REENTRANT -Wall
 -Wstrict-prototypes -Wmissing-prototypes -Wmissing-declarations -DTHREADSAFE=1
 -export-dynamic -g -O2 -MT libopenpbx_la-opcodes.lo -MD -MP -MF ".deps/libopenp
bx_la-opcodes.Tpo" -c -o libopenpbx_la-opcodes.lo `test -f 'sqlite3-embedded/opc
odes.c' || echo './'`sqlite3-embedded/opcodes.c; \
then mv -f ".deps/libopenpbx_la-opcodes.Tpo" ".deps/libopenpbx_la-opcodes.Plo";
else rm -f ".deps/libopenpbx_la-opcodes.Tpo"; exit 1; fi
 gcc -DHAVE_CONFIG_H -I. -I. -I./include -I./include -I. -I./editline/src -fomit
-frame-pointer -D_REENTRANT -Wall -Wstrict-prototypes -Wmissing-prototypes -Wmis
sing-declarations -DTHREADSAFE=1 -export-dynamic -g -O2 -MT libopenpbx_la-opcode
s.lo -MD -MP -MF .deps/libopenpbx_la-opcodes.Tpo -c sqlite3-embedded/opcodes.c
-DPIC -o .libs/libopenpbx_la-opcodes.o
 gcc -DHAVE_CONFIG_H -I. -I. -I./include -I./include -I. -I./editline/src -fomit
-frame-pointer -D_REENTRANT -Wall -Wstrict-prototypes -Wmissing-prototypes -Wmis
sing-declarations -DTHREADSAFE=1 -export-dynamic -g -O2 -MT libopenpbx_la-opcode
s.lo -MD -MP -MF .deps/libopenpbx_la-opcodes.Tpo -c sqlite3-embedded/opcodes.c -
o libopenpbx_la-opcodes.o >/dev/null 2>&1
if /bin/sh ./libtool --tag=CC --mode=compile gcc -DHAVE_CONFIG_H -I. -I. -I./inc
lude -I./include -I.  -I./editline/src   -fomit-frame-pointer -D_REENTRANT -Wall
 -Wstrict-prototypes -Wmissing-prototypes -Wmissing-declarations -DTHREADSAFE=1
 -export-dynamic -g -O2 -MT libopenpbx_la-os_unix.lo -MD -MP -MF ".deps/libopenp
bx_la-os_unix.Tpo" -c -o libopenpbx_la-os_unix.lo `test -f 'sqlite3-embedded/os_
unix.c' || echo './'`sqlite3-embedded/os_unix.c; \
then mv -f ".deps/libopenpbx_la-os_unix.Tpo" ".deps/libopenpbx_la-os_unix.Plo";
else rm -f ".deps/libopenpbx_la-os_unix.Tpo"; exit 1; fi
 gcc -DHAVE_CONFIG_H -I. -I. -I./include -I./include -I. -I./editline/src -fomit
-frame-pointer -D_REENTRANT -Wall -Wstrict-prototypes -Wmissing-prototypes -Wmis
sing-declarations -DTHREADSAFE=1 -export-dynamic -g -O2 -MT libopenpbx_la-os_uni
x.lo -MD -MP -MF .deps/libopenpbx_la-os_unix.Tpo -c sqlite3-embedded/os_unix.c
-DPIC -o .libs/libopenpbx_la-os_unix.o
In file included from sqlite3-embedded/sqliteInt.h:53,
                 from sqlite3-embedded/os_unix.c:15:
sqlite3-embedded/sqlite3.h:1254: warning: function declaration isn't a prototype

 gcc -DHAVE_CONFIG_H -I. -I. -I./include -I./include -I. -I./editline/src -fomit
-frame-pointer -D_REENTRANT -Wall -Wstrict-prototypes -Wmissing-prototypes -Wmis
sing-declarations -DTHREADSAFE=1 -export-dynamic -g -O2 -MT libopenpbx_la-os_uni
x.lo -MD -MP -MF .deps/libopenpbx_la-os_unix.Tpo -c sqlite3-embedded/os_unix.c -
o libopenpbx_la-os_unix.o >/dev/null 2>&1
if /bin/sh ./libtool --tag=CC --mode=compile gcc -DHAVE_CONFIG_H -I. -I. -I./inc
lude -I./include -I.  -I./editline/src   -fomit-frame-pointer -D_REENTRANT -Wall
 -Wstrict-prototypes -Wmissing-prototypes -Wmissing-declarations -DTHREADSAFE=1
 -export-dynamic -g -O2 -MT libopenpbx_la-os_win.lo -MD -MP -MF ".deps/libopenpb
x_la-os_win.Tpo" -c -o libopenpbx_la-os_win.lo `test -f 'sqlite3-embedded/os_win
.c' || echo './'`sqlite3-embedded/os_win.c; \
then mv -f ".deps/libopenpbx_la-os_win.Tpo" ".deps/libopenpbx_la-os_win.Plo"; el
se rm -f ".deps/libopenpbx_la-os_win.Tpo"; exit 1; fi
 gcc -DHAVE_CONFIG_H -I. -I. -I./include -I./include -I. -I./editline/src -fomit
-frame-pointer -D_REENTRANT -Wall -Wstrict-prototypes -Wmissing-prototypes -Wmis
sing-declarations -DTHREADSAFE=1 -export-dynamic -g -O2 -MT libopenpbx_la-os_win
.lo -MD -MP -MF .deps/libopenpbx_la-os_win.Tpo -c sqlite3-embedded/os_win.c  -DP
IC -o .libs/libopenpbx_la-os_win.o
In file included from sqlite3-embedded/sqliteInt.h:53,
                 from sqlite3-embedded/os_win.c:15:
sqlite3-embedded/sqlite3.h:1254: warning: function declaration isn't a prototype

sqlite3-embedded/os_win.c: In function `sqlite3OsFullPathname':
sqlite3-embedded/os_win.c:802: warning: unused variable `zNotUsed'
sqlite3-embedded/os_win.c:804: warning: unused variable `zWide'
 gcc -DHAVE_CONFIG_H -I. -I. -I./include -I./include -I. -I./editline/src -fomit
-frame-pointer -D_REENTRANT -Wall -Wstrict-prototypes -Wmissing-prototypes -Wmis
sing-declarations -DTHREADSAFE=1 -export-dynamic -g -O2 -MT libopenpbx_la-os_win
.lo -MD -MP -MF .deps/libopenpbx_la-os_win.Tpo -c sqlite3-embedded/os_win.c -o l
ibopenpbx_la-os_win.o >/dev/null 2>&1
if /bin/sh ./libtool --tag=CC --mode=compile gcc -DHAVE_CONFIG_H -I. -I. -I./inc
lude -I./include -I.  -I./editline/src   -fomit-frame-pointer -D_REENTRANT -Wall
 -Wstrict-prototypes -Wmissing-prototypes -Wmissing-declarations -DTHREADSAFE=1
 -export-dynamic -g -O2 -MT libopenpbx_la-vdbefifo.lo -MD -MP -MF ".deps/libopen
pbx_la-vdbefifo.Tpo" -c -o libopenpbx_la-vdbefifo.lo `test -f 'sqlite3-embedded/
vdbefifo.c' || echo './'`sqlite3-embedded/vdbefifo.c; \
then mv -f ".deps/libopenpbx_la-vdbefifo.Tpo" ".deps/libopenpbx_la-vdbefifo.Plo"
; else rm -f ".deps/libopenpbx_la-vdbefifo.Tpo"; exit 1; fi
 gcc -DHAVE_CONFIG_H -I. -I. -I./include -I./include -I. -I./editline/src -fomit
-frame-pointer -D_REENTRANT -Wall -Wstrict-prototypes -Wmissing-prototypes -Wmis
sing-declarations -DTHREADSAFE=1 -export-dynamic -g -O2 -MT libopenpbx_la-vdbefi
fo.lo -MD -MP -MF .deps/libopenpbx_la-vdbefifo.Tpo -c sqlite3-embedded/vdbefifo.
c  -DPIC -o .libs/libopenpbx_la-vdbefifo.o
In file included from sqlite3-embedded/sqliteInt.h:53,
                 from sqlite3-embedded/vdbefifo.c:15:
sqlite3-embedded/sqlite3.h:1254: warning: function declaration isn't a prototype

 gcc -DHAVE_CONFIG_H -I. -I. -I./include -I./include -I. -I./editline/src -fomit
-frame-pointer -D_REENTRANT -Wall -Wstrict-prototypes -Wmissing-prototypes -Wmis
sing-declarations -DTHREADSAFE=1 -export-dynamic -g -O2 -MT libopenpbx_la-vdbefi
fo.lo -MD -MP -MF .deps/libopenpbx_la-vdbefifo.Tpo -c sqlite3-embedded/vdbefifo.
c -o libopenpbx_la-vdbefifo.o >/dev/null 2>&1
if /bin/sh ./libtool --tag=CC --mode=compile gcc -DHAVE_CONFIG_H -I. -I. -I./inc
lude -I./include -I.  -I./editline/src   -fomit-frame-pointer -D_REENTRANT -Wall
 -Wstrict-prototypes -Wmissing-prototypes -Wmissing-declarations -DTHREADSAFE=1
 -export-dynamic -g -O2 -MT libopenpbx_la-analyze.lo -MD -MP -MF ".deps/libopenp
bx_la-analyze.Tpo" -c -o libopenpbx_la-analyze.lo `test -f 'sqlite3-embedded/ana
lyze.c' || echo './'`sqlite3-embedded/analyze.c; \
then mv -f ".deps/libopenpbx_la-analyze.Tpo" ".deps/libopenpbx_la-analyze.Plo";
else rm -f ".deps/libopenpbx_la-analyze.Tpo"; exit 1; fi
 gcc -DHAVE_CONFIG_H -I. -I. -I./include -I./include -I. -I./editline/src -fomit
-frame-pointer -D_REENTRANT -Wall -Wstrict-prototypes -Wmissing-prototypes -Wmis
sing-declarations -DTHREADSAFE=1 -export-dynamic -g -O2 -MT libopenpbx_la-analyz
e.lo -MD -MP -MF .deps/libopenpbx_la-analyze.Tpo -c sqlite3-embedded/analyze.c
-DPIC -o .libs/libopenpbx_la-analyze.o
In file included from sqlite3-embedded/sqliteInt.h:53,
                 from sqlite3-embedded/analyze.c:17:
sqlite3-embedded/sqlite3.h:1254: warning: function declaration isn't a prototype

 gcc -DHAVE_CONFIG_H -I. -I. -I./include -I./include -I. -I./editline/src -fomit
-frame-pointer -D_REENTRANT -Wall -Wstrict-prototypes -Wmissing-prototypes -Wmis
sing-declarations -DTHREADSAFE=1 -export-dynamic -g -O2 -MT libopenpbx_la-analyz
e.lo -MD -MP -MF .deps/libopenpbx_la-analyze.Tpo -c sqlite3-embedded/analyze.c -
o libopenpbx_la-analyze.o >/dev/null 2>&1
if /bin/sh ./libtool --tag=CC --mode=compile gcc -DHAVE_CONFIG_H -I. -I. -I./inc
lude -I./include -I.  -I./editline/src   -fomit-frame-pointer -D_REENTRANT -Wall
 -Wstrict-prototypes -Wmissing-prototypes -Wmissing-declarations -DTHREADSAFE=1
 -export-dynamic -g -O2 -MT libopenpbx_la-alter.lo -MD -MP -MF ".deps/libopenpbx
_la-alter.Tpo" -c -o libopenpbx_la-alter.lo `test -f 'sqlite3-embedded/alter.c'
|| echo './'`sqlite3-embedded/alter.c; \
then mv -f ".deps/libopenpbx_la-alter.Tpo" ".deps/libopenpbx_la-alter.Plo"; else
 rm -f ".deps/libopenpbx_la-alter.Tpo"; exit 1; fi
 gcc -DHAVE_CONFIG_H -I. -I. -I./include -I./include -I. -I./editline/src -fomit
-frame-pointer -D_REENTRANT -Wall -Wstrict-prototypes -Wmissing-prototypes -Wmis
sing-declarations -DTHREADSAFE=1 -export-dynamic -g -O2 -MT libopenpbx_la-alter.
lo -MD -MP -MF .deps/libopenpbx_la-alter.Tpo -c sqlite3-embedded/alter.c  -DPIC
-o .libs/libopenpbx_la-alter.o
In file included from sqlite3-embedded/sqliteInt.h:53,
                 from sqlite3-embedded/alter.c:17:
sqlite3-embedded/sqlite3.h:1254: warning: function declaration isn't a prototype

 gcc -DHAVE_CONFIG_H -I. -I. -I./include -I./include -I. -I./editline/src -fomit
-frame-pointer -D_REENTRANT -Wall -Wstrict-prototypes -Wmissing-prototypes -Wmis
sing-declarations -DTHREADSAFE=1 -export-dynamic -g -O2 -MT libopenpbx_la-alter.
lo -MD -MP -MF .deps/libopenpbx_la-alter.Tpo -c sqlite3-embedded/alter.c -o libo
penpbx_la-alter.o >/dev/null 2>&1
if /bin/sh ./libtool --tag=CC --mode=compile gcc -DHAVE_CONFIG_H -I. -I. -I./inc
lude -I./include -I.  -I./editline/src   -fomit-frame-pointer -D_REENTRANT -Wall
 -Wstrict-prototypes -Wmissing-prototypes -Wmissing-declarations -DTHREADSAFE=1
 -export-dynamic -g -O2 -MT libopenpbx_la-pager.lo -MD -MP -MF ".deps/libopenpbx
_la-pager.Tpo" -c -o libopenpbx_la-pager.lo `test -f 'sqlite3-embedded/pager.c'
|| echo './'`sqlite3-embedded/pager.c; \
then mv -f ".deps/libopenpbx_la-pager.Tpo" ".deps/libopenpbx_la-pager.Plo"; else
 rm -f ".deps/libopenpbx_la-pager.Tpo"; exit 1; fi
 gcc -DHAVE_CONFIG_H -I. -I. -I./include -I./include -I. -I./editline/src -fomit
-frame-pointer -D_REENTRANT -Wall -Wstrict-prototypes -Wmissing-prototypes -Wmis
sing-declarations -DTHREADSAFE=1 -export-dynamic -g -O2 -MT libopenpbx_la-pager.
lo -MD -MP -MF .deps/libopenpbx_la-pager.Tpo -c sqlite3-embedded/pager.c  -DPIC
-o .libs/libopenpbx_la-pager.o
In file included from sqlite3-embedded/sqliteInt.h:53,
                 from sqlite3-embedded/pager.c:24:
sqlite3-embedded/sqlite3.h:1254: warning: function declaration isn't a prototype

 gcc -DHAVE_CONFIG_H -I. -I. -I./include -I./include -I. -I./editline/src -fomit
-frame-pointer -D_REENTRANT -Wall -Wstrict-prototypes -Wmissing-prototypes -Wmis
sing-declarations -DTHREADSAFE=1 -export-dynamic -g -O2 -MT libopenpbx_la-pager.
lo -MD -MP -MF .deps/libopenpbx_la-pager.Tpo -c sqlite3-embedded/pager.c -o libo
penpbx_la-pager.o >/dev/null 2>&1
if /bin/sh ./libtool --tag=CC --mode=compile gcc -DHAVE_CONFIG_H -I. -I. -I./inc
lude -I./include -I.  -I./editline/src   -fomit-frame-pointer -D_REENTRANT -Wall
 -Wstrict-prototypes -Wmissing-prototypes -Wmissing-declarations -DTHREADSAFE=1
 -export-dynamic -g -O2 -MT libopenpbx_la-parse.lo -MD -MP -MF ".deps/libopenpbx
_la-parse.Tpo" -c -o libopenpbx_la-parse.lo `test -f 'sqlite3-embedded/parse.c'
|| echo './'`sqlite3-embedded/parse.c; \
then mv -f ".deps/libopenpbx_la-parse.Tpo" ".deps/libopenpbx_la-parse.Plo"; else
 rm -f ".deps/libopenpbx_la-parse.Tpo"; exit 1; fi
 gcc -DHAVE_CONFIG_H -I. -I. -I./include -I./include -I. -I./editline/src -fomit
-frame-pointer -D_REENTRANT -Wall -Wstrict-prototypes -Wmissing-prototypes -Wmis
sing-declarations -DTHREADSAFE=1 -export-dynamic -g -O2 -MT libopenpbx_la-parse.
lo -MD -MP -MF .deps/libopenpbx_la-parse.Tpo -c sqlite3-embedded/parse.c  -DPIC
-o .libs/libopenpbx_la-parse.o
In file included from sqlite3-embedded/sqliteInt.h:53,
                 from parse.y:52:
sqlite3-embedded/sqlite3.h:1254: warning: function declaration isn't a prototype

parse.c:1276: warning: no previous prototype for 'sqlite3ParserTokenName'
parse.c:1300: warning: no previous prototype for 'sqlite3ParserAlloc'
parse.c:1438: warning: no previous prototype for 'sqlite3ParserFree'
parse.c:3327: warning: no previous prototype for 'sqlite3Parser'
 gcc -DHAVE_CONFIG_H -I. -I. -I./include -I./include -I. -I./editline/src -fomit
-frame-pointer -D_REENTRANT -Wall -Wstrict-prototypes -Wmissing-prototypes -Wmis
sing-declarations -DTHREADSAFE=1 -export-dynamic -g -O2 -MT libopenpbx_la-parse.
lo -MD -MP -MF .deps/libopenpbx_la-parse.Tpo -c sqlite3-embedded/parse.c -o libo
penpbx_la-parse.o >/dev/null 2>&1
if /bin/sh ./libtool --tag=CC --mode=compile gcc -DHAVE_CONFIG_H -I. -I. -I./inc
lude -I./include -I.  -I./editline/src   -fomit-frame-pointer -D_REENTRANT -Wall
 -Wstrict-prototypes -Wmissing-prototypes -Wmissing-declarations -DTHREADSAFE=1
 -export-dynamic -g -O2 -MT libopenpbx_la-callback.lo -MD -MP -MF ".deps/libopen
pbx_la-callback.Tpo" -c -o libopenpbx_la-callback.lo `test -f 'sqlite3-embedded/
callback.c' || echo './'`sqlite3-embedded/callback.c; \
then mv -f ".deps/libopenpbx_la-callback.Tpo" ".deps/libopenpbx_la-callback.Plo"
; else rm -f ".deps/libopenpbx_la-callback.Tpo"; exit 1; fi
 gcc -DHAVE_CONFIG_H -I. -I. -I./include -I./include -I. -I./editline/src -fomit
-frame-pointer -D_REENTRANT -Wall -Wstrict-prototypes -Wmissing-prototypes -Wmis
sing-declarations -DTHREADSAFE=1 -export-dynamic -g -O2 -MT libopenpbx_la-callba
ck.lo -MD -MP -MF .deps/libopenpbx_la-callback.Tpo -c sqlite3-embedded/callback.
c  -DPIC -o .libs/libopenpbx_la-callback.o
In file included from sqlite3-embedded/sqliteInt.h:53,
                 from sqlite3-embedded/callback.c:19:
sqlite3-embedded/sqlite3.h:1254: warning: function declaration isn't a prototype

 gcc -DHAVE_CONFIG_H -I. -I. -I./include -I./include -I. -I./editline/src -fomit
-frame-pointer -D_REENTRANT -Wall -Wstrict-prototypes -Wmissing-prototypes -Wmis
sing-declarations -DTHREADSAFE=1 -export-dynamic -g -O2 -MT libopenpbx_la-callba
ck.lo -MD -MP -MF .deps/libopenpbx_la-callback.Tpo -c sqlite3-embedded/callback.
c -o libopenpbx_la-callback.o >/dev/null 2>&1
if /bin/sh ./libtool --tag=CC --mode=compile gcc -DHAVE_CONFIG_H -I. -I. -I./inc
lude -I./include -I.  -I./editline/src   -fomit-frame-pointer -D_REENTRANT -Wall
 -Wstrict-prototypes -Wmissing-prototypes -Wmissing-declarations -DTHREADSAFE=1
 -export-dynamic -g -O2 -MT libopenpbx_la-pragma.lo -MD -MP -MF ".deps/libopenpb
x_la-pragma.Tpo" -c -o libopenpbx_la-pragma.lo `test -f 'sqlite3-embedded/pragma
.c' || echo './'`sqlite3-embedded/pragma.c; \
then mv -f ".deps/libopenpbx_la-pragma.Tpo" ".deps/libopenpbx_la-pragma.Plo"; el
se rm -f ".deps/libopenpbx_la-pragma.Tpo"; exit 1; fi
 gcc -DHAVE_CONFIG_H -I. -I. -I./include -I./include -I. -I./editline/src -fomit
-frame-pointer -D_REENTRANT -Wall -Wstrict-prototypes -Wmissing-prototypes -Wmis
sing-declarations -DTHREADSAFE=1 -export-dynamic -g -O2 -MT libopenpbx_la-pragma
.lo -MD -MP -MF .deps/libopenpbx_la-pragma.Tpo -c sqlite3-embedded/pragma.c  -DP
IC -o .libs/libopenpbx_la-pragma.o
In file included from sqlite3-embedded/sqliteInt.h:53,
                 from sqlite3-embedded/pragma.c:16:
sqlite3-embedded/sqlite3.h:1254: warning: function declaration isn't a prototype

 gcc -DHAVE_CONFIG_H -I. -I. -I./include -I./include -I. -I./editline/src -fomit
-frame-pointer -D_REENTRANT -Wall -Wstrict-prototypes -Wmissing-prototypes -Wmis
sing-declarations -DTHREADSAFE=1 -export-dynamic -g -O2 -MT libopenpbx_la-pragma
.lo -MD -MP -MF .deps/libopenpbx_la-pragma.Tpo -c sqlite3-embedded/pragma.c -o l
ibopenpbx_la-pragma.o >/dev/null 2>&1
if /bin/sh ./libtool --tag=CC --mode=compile gcc -DHAVE_CONFIG_H -I. -I. -I./inc
lude -I./include -I.  -I./editline/src   -fomit-frame-pointer -D_REENTRANT -Wall
 -Wstrict-prototypes -Wmissing-prototypes -Wmissing-declarations -DTHREADSAFE=1
 -export-dynamic -g -O2 -MT libopenpbx_la-printf.lo -MD -MP -MF ".deps/libopenpb
x_la-printf.Tpo" -c -o libopenpbx_la-printf.lo `test -f 'sqlite3-embedded/printf
.c' || echo './'`sqlite3-embedded/printf.c; \
then mv -f ".deps/libopenpbx_la-printf.Tpo" ".deps/libopenpbx_la-printf.Plo"; el
se rm -f ".deps/libopenpbx_la-printf.Tpo"; exit 1; fi
 gcc -DHAVE_CONFIG_H -I. -I. -I./include -I./include -I. -I./editline/src -fomit
-frame-pointer -D_REENTRANT -Wall -Wstrict-prototypes -Wmissing-prototypes -Wmis
sing-declarations -DTHREADSAFE=1 -export-dynamic -g -O2 -MT libopenpbx_la-printf
.lo -MD -MP -MF .deps/libopenpbx_la-printf.Tpo -c sqlite3-embedded/printf.c  -DP
IC -o .libs/libopenpbx_la-printf.o
In file included from sqlite3-embedded/sqliteInt.h:53,
                 from sqlite3-embedded/printf.c:53:
sqlite3-embedded/sqlite3.h:1254: warning: function declaration isn't a prototype

 gcc -DHAVE_CONFIG_H -I. -I. -I./include -I./include -I. -I./editline/src -fomit
-frame-pointer -D_REENTRANT -Wall -Wstrict-prototypes -Wmissing-prototypes -Wmis
sing-declarations -DTHREADSAFE=1 -export-dynamic -g -O2 -MT libopenpbx_la-printf
.lo -MD -MP -MF .deps/libopenpbx_la-printf.Tpo -c sqlite3-embedded/printf.c -o l
ibopenpbx_la-printf.o >/dev/null 2>&1
if /bin/sh ./libtool --tag=CC --mode=compile gcc -DHAVE_CONFIG_H -I. -I. -I./inc
lude -I./include -I.  -I./editline/src   -fomit-frame-pointer -D_REENTRANT -Wall
 -Wstrict-prototypes -Wmissing-prototypes -Wmissing-declarations -DTHREADSAFE=1
 -export-dynamic -g -O2 -MT libopenpbx_la-random.lo -MD -MP -MF ".deps/libopenpb
x_la-random.Tpo" -c -o libopenpbx_la-random.lo `test -f 'sqlite3-embedded/random
.c' || echo './'`sqlite3-embedded/random.c; \
then mv -f ".deps/libopenpbx_la-random.Tpo" ".deps/libopenpbx_la-random.Plo"; el
se rm -f ".deps/libopenpbx_la-random.Tpo"; exit 1; fi
 gcc -DHAVE_CONFIG_H -I. -I. -I./include -I./include -I. -I./editline/src -fomit
-frame-pointer -D_REENTRANT -Wall -Wstrict-prototypes -Wmissing-prototypes -Wmis
sing-declarations -DTHREADSAFE=1 -export-dynamic -g -O2 -MT libopenpbx_la-random
.lo -MD -MP -MF .deps/libopenpbx_la-random.Tpo -c sqlite3-embedded/random.c  -DP
IC -o .libs/libopenpbx_la-random.o
In file included from sqlite3-embedded/sqliteInt.h:53,
                 from sqlite3-embedded/random.c:20:
sqlite3-embedded/sqlite3.h:1254: warning: function declaration isn't a prototype

sqlite3-embedded/random.c:40: warning: function declaration isn't a prototype
 gcc -DHAVE_CONFIG_H -I. -I. -I./include -I./include -I. -I./editline/src -fomit
-frame-pointer -D_REENTRANT -Wall -Wstrict-prototypes -Wmissing-prototypes -Wmis
sing-declarations -DTHREADSAFE=1 -export-dynamic -g -O2 -MT libopenpbx_la-random
.lo -MD -MP -MF .deps/libopenpbx_la-random.Tpo -c sqlite3-embedded/random.c -o l
ibopenpbx_la-random.o >/dev/null 2>&1
if /bin/sh ./libtool --tag=CC --mode=compile gcc -DHAVE_CONFIG_H -I. -I. -I./inc
lude -I./include -I.  -I./editline/src   -fomit-frame-pointer -D_REENTRANT -Wall
 -Wstrict-prototypes -Wmissing-prototypes -Wmissing-declarations -DTHREADSAFE=1
 -export-dynamic -g -O2 -MT libopenpbx_la-select.lo -MD -MP -MF ".deps/libopenpb
x_la-select.Tpo" -c -o libopenpbx_la-select.lo `test -f 'sqlite3-embedded/select
.c' || echo './'`sqlite3-embedded/select.c; \
then mv -f ".deps/libopenpbx_la-select.Tpo" ".deps/libopenpbx_la-select.Plo"; el
se rm -f ".deps/libopenpbx_la-select.Tpo"; exit 1; fi
 gcc -DHAVE_CONFIG_H -I. -I. -I./include -I./include -I. -I./editline/src -fomit
-frame-pointer -D_REENTRANT -Wall -Wstrict-prototypes -Wmissing-prototypes -Wmis
sing-declarations -DTHREADSAFE=1 -export-dynamic -g -O2 -MT libopenpbx_la-select
.lo -MD -MP -MF .deps/libopenpbx_la-select.Tpo -c sqlite3-embedded/select.c  -DP
IC -o .libs/libopenpbx_la-select.o
In file included from sqlite3-embedded/sqliteInt.h:53,
                 from sqlite3-embedded/select.c:17:
sqlite3-embedded/sqlite3.h:1254: warning: function declaration isn't a prototype

 gcc -DHAVE_CONFIG_H -I. -I. -I./include -I./include -I. -I./editline/src -fomit
-frame-pointer -D_REENTRANT -Wall -Wstrict-prototypes -Wmissing-prototypes -Wmis
sing-declarations -DTHREADSAFE=1 -export-dynamic -g -O2 -MT libopenpbx_la-select
.lo -MD -MP -MF .deps/libopenpbx_la-select.Tpo -c sqlite3-embedded/select.c -o l
ibopenpbx_la-select.o >/dev/null 2>&1
if /bin/sh ./libtool --tag=CC --mode=compile gcc -DHAVE_CONFIG_H -I. -I. -I./inc
lude -I./include -I.  -I./editline/src   -fomit-frame-pointer -D_REENTRANT -Wall
 -Wstrict-prototypes -Wmissing-prototypes -Wmissing-declarations -DTHREADSAFE=1
 -export-dynamic -g -O2 -MT libopenpbx_la-complete.lo -MD -MP -MF ".deps/libopen
pbx_la-complete.Tpo" -c -o libopenpbx_la-complete.lo `test -f 'sqlite3-embedded/
complete.c' || echo './'`sqlite3-embedded/complete.c; \
then mv -f ".deps/libopenpbx_la-complete.Tpo" ".deps/libopenpbx_la-complete.Plo"
; else rm -f ".deps/libopenpbx_la-complete.Tpo"; exit 1; fi
 gcc -DHAVE_CONFIG_H -I. -I. -I./include -I./include -I. -I./editline/src -fomit
-frame-pointer -D_REENTRANT -Wall -Wstrict-prototypes -Wmissing-prototypes -Wmis
sing-declarations -DTHREADSAFE=1 -export-dynamic -g -O2 -MT libopenpbx_la-comple
te.lo -MD -MP -MF .deps/libopenpbx_la-complete.Tpo -c sqlite3-embedded/complete.
c  -DPIC -o .libs/libopenpbx_la-complete.o
In file included from sqlite3-embedded/sqliteInt.h:53,
                 from sqlite3-embedded/complete.c:21:
sqlite3-embedded/sqlite3.h:1254: warning: function declaration isn't a prototype

 gcc -DHAVE_CONFIG_H -I. -I. -I./include -I./include -I. -I./editline/src -fomit
-frame-pointer -D_REENTRANT -Wall -Wstrict-prototypes -Wmissing-prototypes -Wmis
sing-declarations -DTHREADSAFE=1 -export-dynamic -g -O2 -MT libopenpbx_la-comple
te.lo -MD -MP -MF .deps/libopenpbx_la-complete.Tpo -c sqlite3-embedded/complete.
c -o libopenpbx_la-complete.o >/dev/null 2>&1
if /bin/sh ./libtool --tag=CC --mode=compile gcc -DHAVE_CONFIG_H -I. -I. -I./inc
lude -I./include -I.  -I./editline/src   -fomit-frame-pointer -D_REENTRANT -Wall
 -Wstrict-prototypes -Wmissing-prototypes -Wmissing-declarations -DTHREADSAFE=1
 -export-dynamic -g -O2 -MT libopenpbx_la-table.lo -MD -MP -MF ".deps/libopenpbx
_la-table.Tpo" -c -o libopenpbx_la-table.lo `test -f 'sqlite3-embedded/table.c'
|| echo './'`sqlite3-embedded/table.c; \
then mv -f ".deps/libopenpbx_la-table.Tpo" ".deps/libopenpbx_la-table.Plo"; else
 rm -f ".deps/libopenpbx_la-table.Tpo"; exit 1; fi
 gcc -DHAVE_CONFIG_H -I. -I. -I./include -I./include -I. -I./editline/src -fomit
-frame-pointer -D_REENTRANT -Wall -Wstrict-prototypes -Wmissing-prototypes -Wmis
sing-declarations -DTHREADSAFE=1 -export-dynamic -g -O2 -MT libopenpbx_la-table.
lo -MD -MP -MF .deps/libopenpbx_la-table.Tpo -c sqlite3-embedded/table.c  -DPIC
-o .libs/libopenpbx_la-table.o
In file included from sqlite3-embedded/sqliteInt.h:53,
                 from sqlite3-embedded/table.c:21:
sqlite3-embedded/sqlite3.h:1254: warning: function declaration isn't a prototype

 gcc -DHAVE_CONFIG_H -I. -I. -I./include -I./include -I. -I./editline/src -fomit
-frame-pointer -D_REENTRANT -Wall -Wstrict-prototypes -Wmissing-prototypes -Wmis
sing-declarations -DTHREADSAFE=1 -export-dynamic -g -O2 -MT libopenpbx_la-table.
lo -MD -MP -MF .deps/libopenpbx_la-table.Tpo -c sqlite3-embedded/table.c -o libo
penpbx_la-table.o >/dev/null 2>&1
if /bin/sh ./libtool --tag=CC --mode=compile gcc -DHAVE_CONFIG_H -I. -I. -I./inc
lude -I./include -I.  -I./editline/src   -fomit-frame-pointer -D_REENTRANT -Wall
 -Wstrict-prototypes -Wmissing-prototypes -Wmissing-declarations -DTHREADSAFE=1
 -export-dynamic -g -O2 -MT libopenpbx_la-tokenize.lo -MD -MP -MF ".deps/libopen
pbx_la-tokenize.Tpo" -c -o libopenpbx_la-tokenize.lo `test -f 'sqlite3-embedded/
tokenize.c' || echo './'`sqlite3-embedded/tokenize.c; \
then mv -f ".deps/libopenpbx_la-tokenize.Tpo" ".deps/libopenpbx_la-tokenize.Plo"
; else rm -f ".deps/libopenpbx_la-tokenize.Tpo"; exit 1; fi
 gcc -DHAVE_CONFIG_H -I. -I. -I./include -I./include -I. -I./editline/src -fomit
-frame-pointer -D_REENTRANT -Wall -Wstrict-prototypes -Wmissing-prototypes -Wmis
sing-declarations -DTHREADSAFE=1 -export-dynamic -g -O2 -MT libopenpbx_la-tokeni
ze.lo -MD -MP -MF .deps/libopenpbx_la-tokenize.Tpo -c sqlite3-embedded/tokenize.
c  -DPIC -o .libs/libopenpbx_la-tokenize.o
In file included from sqlite3-embedded/sqliteInt.h:53,
                 from sqlite3-embedded/tokenize.c:20:
sqlite3-embedded/sqlite3.h:1254: warning: function declaration isn't a prototype

 gcc -DHAVE_CONFIG_H -I. -I. -I./include -I./include -I. -I./editline/src -fomit
-frame-pointer -D_REENTRANT -Wall -Wstrict-prototypes -Wmissing-prototypes -Wmis
sing-declarations -DTHREADSAFE=1 -export-dynamic -g -O2 -MT libopenpbx_la-tokeni
ze.lo -MD -MP -MF .deps/libopenpbx_la-tokenize.Tpo -c sqlite3-embedded/tokenize.
c -o libopenpbx_la-tokenize.o >/dev/null 2>&1
/bin/sh ./libtool --tag=CC --mode=link gcc  -g -O2   -o libopenpbx.la  -export-d
ynamic -no-undefined libopenpbx_la-io.lo libopenpbx_la-sched.lo libopenpbx_la-lo
gger.lo libopenpbx_la-frame.lo libopenpbx_la-config.lo libopenpbx_la-channel.lo
libopenpbx_la-translate.lo libopenpbx_la-file.lo libopenpbx_la-say.lo libopenpbx
_la-pbx.lo libopenpbx_la-cli.lo libopenpbx_la-md5.lo libopenpbx_la-term.lo libop
enpbx_la-ulaw.lo libopenpbx_la-alaw.lo libopenpbx_la-callerid.lo libopenpbx_la-f
skmodem.lo libopenpbx_la-image.lo libopenpbx_la-app.lo libopenpbx_la-cdr.lo libo
penpbx_la-tdd.lo libopenpbx_la-acl.lo libopenpbx_la-rtp.lo libopenpbx_la-manager
.lo libopenpbx_la-dsp.lo libopenpbx_la-chanvars.lo libopenpbx_la-indications.lo
libopenpbx_la-autoservice.lo libopenpbx_la-db.lo libopenpbx_la-privacy.lo libope
npbx_la-opbxmm.lo libopenpbx_la-enum.lo libopenpbx_la-srv.lo libopenpbx_la-dns.l
o libopenpbx_la-aescrypt.lo libopenpbx_la-aestab.lo libopenpbx_la-aeskey.lo libo
penpbx_la-utils.lo libopenpbx_la-plc.lo libopenpbx_la-jitterbuf.lo libopenpbx_la
-dnsmgr.lo libopenpbx_la-devicestate.lo libopenpbx_la-netsock.lo libopenpbx_la-r
esonator.lo libopenpbx_la-slinfactory.lo libopenpbx_la-opbx_expr2.lo libopenpbx_
la-opbx_expr2f.lo libopenpbx_la-strcompat.lo libopenpbx_la-loader.lo libopenpbx_
la-openpbx.lo libopenpbx_la-stubfunctions-adsi.lo libopenpbx_la-stubfunctions-cr
ypto.lo libopenpbx_la-stubfunctions-features.lo libopenpbx_la-stubfunctions-moni
tor.lo libopenpbx_la-attach.lo libopenpbx_la-auth.lo libopenpbx_la-btree.lo libo
penpbx_la-build.lo libopenpbx_la-date.lo libopenpbx_la-delete.lo libopenpbx_la-e
xpr.lo libopenpbx_la-func.lo libopenpbx_la-hash.lo libopenpbx_la-insert.lo libop
enpbx_la-legacy.lo libopenpbx_la-sqlite3main.lo libopenpbx_la-opcodes.lo libopen
pbx_la-os_unix.lo libopenpbx_la-os_win.lo libopenpbx_la-vdbefifo.lo libopenpbx_l
a-analyze.lo libopenpbx_la-alter.lo libopenpbx_la-pager.lo libopenpbx_la-parse.l
o libopenpbx_la-callback.lo libopenpbx_la-pragma.lo libopenpbx_la-printf.lo libo
penpbx_la-random.lo libopenpbx_la-select.lo libopenpbx_la-complete.lo libopenpbx
_la-table.lo libopenpbx_la-tokenize.lo ./editline/src/libedit.la ./stdtime/libti
me.la ./libltdl/libltdlc.la -lresolv -lpthread -lncurses -lm -lexpat -lc  -lz
rm -fr .libs/libopenpbx.lax
mkdir .libs/libopenpbx.lax
rm -fr .libs/libopenpbx.lax/libtime.a
mkdir .libs/libopenpbx.lax/libtime.a
(cd .libs/libopenpbx.lax/libtime.a && /usr/bin/ar x /usr/src/AutoMakeTest/./stdt
ime/.libs/libtime.a)
rm -fr .libs/libopenpbx.lax/libltdlc.a
mkdir .libs/libopenpbx.lax/libltdlc.a
(cd .libs/libopenpbx.lax/libltdlc.a && /usr/bin/ar x /usr/src/AutoMakeTest/./lib
ltdl/.libs/libltdlc.a)
/usr/bin/ar cru .libs/libopenpbx.a .libs/libopenpbx_la-io.o .libs/libopenpbx_la-
sched.o .libs/libopenpbx_la-logger.o .libs/libopenpbx_la-frame.o .libs/libopenpb
x_la-config.o .libs/libopenpbx_la-channel.o .libs/libopenpbx_la-translate.o .lib
s/libopenpbx_la-file.o .libs/libopenpbx_la-say.o .libs/libopenpbx_la-pbx.o .libs
/libopenpbx_la-cli.o .libs/libopenpbx_la-md5.o .libs/libopenpbx_la-term.o .libs/
libopenpbx_la-ulaw.o .libs/libopenpbx_la-alaw.o .libs/libopenpbx_la-callerid.o .
libs/libopenpbx_la-fskmodem.o .libs/libopenpbx_la-image.o .libs/libopenpbx_la-ap
p.o .libs/libopenpbx_la-cdr.o .libs/libopenpbx_la-tdd.o .libs/libopenpbx_la-acl.
o .libs/libopenpbx_la-rtp.o .libs/libopenpbx_la-manager.o .libs/libopenpbx_la-ds
p.o .libs/libopenpbx_la-chanvars.o .libs/libopenpbx_la-indications.o .libs/libop
enpbx_la-autoservice.o .libs/libopenpbx_la-db.o .libs/libopenpbx_la-privacy.o .l
ibs/libopenpbx_la-opbxmm.o .libs/libopenpbx_la-enum.o .libs/libopenpbx_la-srv.o
.libs/libopenpbx_la-dns.o .libs/libopenpbx_la-aescrypt.o .libs/libopenpbx_la-aes
tab.o .libs/libopenpbx_la-aeskey.o .libs/libopenpbx_la-utils.o .libs/libopenpbx_
la-plc.o .libs/libopenpbx_la-jitterbuf.o .libs/libopenpbx_la-dnsmgr.o .libs/libo
penpbx_la-devicestate.o .libs/libopenpbx_la-netsock.o .libs/libopenpbx_la-resona
tor.o .libs/libopenpbx_la-slinfactory.o .libs/libopenpbx_la-opbx_expr2.o .libs/l
ibopenpbx_la-opbx_expr2f.o .libs/libopenpbx_la-strcompat.o .libs/libopenpbx_la-l
oader.o .libs/libopenpbx_la-openpbx.o .libs/libopenpbx_la-stubfunctions-adsi.o .
libs/libopenpbx_la-stubfunctions-crypto.o .libs/libopenpbx_la-stubfunctions-feat
ures.o .libs/libopenpbx_la-stubfunctions-monitor.o .libs/libopenpbx_la-attach.o
.libs/libopenpbx_la-auth.o .libs/libopenpbx_la-btree.o .libs/libopenpbx_la-build
.o .libs/libopenpbx_la-date.o .libs/libopenpbx_la-delete.o .libs/libopenpbx_la-e
xpr.o .libs/libopenpbx_la-func.o .libs/libopenpbx_la-hash.o .libs/libopenpbx_la-
insert.o .libs/libopenpbx_la-legacy.o .libs/libopenpbx_la-sqlite3main.o .libs/li
bopenpbx_la-opcodes.o .libs/libopenpbx_la-os_unix.o .libs/libopenpbx_la-os_win.o
 .libs/libopenpbx_la-vdbefifo.o .libs/libopenpbx_la-analyze.o .libs/libopenpbx_l
a-alter.o .libs/libopenpbx_la-pager.o .libs/libopenpbx_la-parse.o .libs/libopenp
bx_la-callback.o .libs/libopenpbx_la-pragma.o .libs/libopenpbx_la-printf.o .libs
/libopenpbx_la-random.o .libs/libopenpbx_la-select.o .libs/libopenpbx_la-complet
e.o .libs/libopenpbx_la-table.o .libs/libopenpbx_la-tokenize.o  .libs/libopenpbx
.lax/libtime.a/localtime.o  .libs/libopenpbx.lax/libltdlc.a/ltdl.o
/usr/bin/ranlib .libs/libopenpbx.a
rm -fr .libs/libopenpbx.lax
creating libopenpbx.la
(cd .libs && rm -f libopenpbx.la && ln -s ../libopenpbx.la libopenpbx.la)
if gcc -DHAVE_CONFIG_H -I. -I. -I./include -I./include -I.  -I./editline/src   -
fomit-frame-pointer -Wall -Wstrict-prototypes -Wmissing-prototypes -Wmissing-dec
larations  -g -O2 -MT openpbx-main.o -MD -MP -MF ".deps/openpbx-main.Tpo" -c -o
openpbx-main.o `test -f 'main.c' || echo './'`main.c; \
then mv -f ".deps/openpbx-main.Tpo" ".deps/openpbx-main.Po"; else rm -f ".deps/o
penpbx-main.Tpo"; exit 1; fi
main.c: In function `main':
main.c:27: warning: implicit declaration of function `openpbx_main'
/bin/sh ./libtool --tag=CC --mode=link gcc  -g -O2   -o openpbx.exe  openpbx-mai
n.o ./libopenpbx.la ./editline/src/libedit.la ./stdtime/libtime.la ./libltdl/lib
ltdlc.la -lresolv -lpthread -lncurses -lm -lexpat -lc  -lz
gcc -g -O2 -o .libs/openpbx.exe openpbx-main.o  ./.libs/libopenpbx.a /usr/src/Au
toMakeTest/editline/src/.libs/libedit.dll.a -L/usr/lib ./editline/src/.libs/libe
dit.dll.a -lcurses ./stdtime/.libs/libtime.a ./libltdl/.libs/libltdlc.a -lresolv
 -lpthread /usr/lib/libncurses.dll.a /usr/lib/libexpat.dll.a -lz -L/opt/openpbx.
org/lib
creating openpbx.exe
make[1]: Leaving directory `/usr/src/AutoMakeTest'
Making all in pbx
make[1]: Entering directory `/usr/src/AutoMakeTest/pbx'
if /bin/sh ../libtool --tag=CC --mode=compile gcc -DHAVE_CONFIG_H -I. -I. -I../i
nclude     -g -O2 -MT pbx_spool.lo -MD -MP -MF ".deps/pbx_spool.Tpo" -c -o pbx_s
pool.lo pbx_spool.c; \
then mv -f ".deps/pbx_spool.Tpo" ".deps/pbx_spool.Plo"; else rm -f ".deps/pbx_sp
ool.Tpo"; exit 1; fi
mkdir .libs
 gcc -DHAVE_CONFIG_H -I. -I. -I../include -g -O2 -MT pbx_spool.lo -MD -MP -MF .d
eps/pbx_spool.Tpo -c pbx_spool.c  -DPIC -o .libs/pbx_spool.o
 gcc -DHAVE_CONFIG_H -I. -I. -I../include -g -O2 -MT pbx_spool.lo -MD -MP -MF .d
eps/pbx_spool.Tpo -c pbx_spool.c -o pbx_spool.o >/dev/null 2>&1
/bin/sh ../libtool --tag=CC --mode=link gcc  -g -O2   -o pbx_spool.la -rpath /op
t/openpbx.org/lib/modules -module -avoid-version -no-undefined pbx_spool.lo ../l
ibopenpbx.la -lresolv -lpthread -lncurses -lm -lexpat -lc  -lz
gcc -shared  .libs/pbx_spool.o -Wl,--whole-archive ../.libs/libopenpbx.a -Wl,--n
o-whole-archive  /usr/src/AutoMakeTest/editline/src/.libs/libedit.dll.a -lcurses
 -L/usr/lib -lresolv -lpthread /usr/lib/libncurses.dll.a /usr/lib/libexpat.dll.a
 -lz  -o .libs/pbx_spool.dll -Wl,--enable-auto-image-base -Wl,--out-implib,.libs
/pbx_spool.dll.a
Creating library file: .libs/pbx_spool.dll.a
../.libs/libopenpbx.a(libopenpbx_la-attach.o): In function `sqlite3Attach':
/usr/src/AutoMakeTest/sqlite3-embedded/attach.c:42: undefined reference to `_sql
ite3VdbeAddOp'
/usr/src/AutoMakeTest/sqlite3-embedded/attach.c:43: undefined reference to `_sql
ite3VdbeAddOp'
/usr/src/AutoMakeTest/sqlite3-embedded/attach.c:156: undefined reference to `_sq
lite3FreeX'
/usr/src/AutoMakeTest/sqlite3-embedded/attach.c:54: undefined reference to `_sql
ite3ErrorMsg'
/usr/src/AutoMakeTest/sqlite3-embedded/attach.c:47: undefined reference to `_sql
ite3ErrorMsg'
/usr/src/AutoMakeTest/sqlite3-embedded/attach.c:75: undefined reference to `_sql
ite3StrICmp'
/usr/src/AutoMakeTest/sqlite3-embedded/attach.c:89: undefined reference to `_sql
ite3Realloc'
/usr/src/AutoMakeTest/sqlite3-embedded/attach.c:76: undefined reference to `_sql
ite3ErrorMsg'
/usr/src/AutoMakeTest/sqlite3-embedded/attach.c:139: undefined reference to `_sq
lite3ReadSchema'
/usr/src/AutoMakeTest/sqlite3-embedded/attach.c:106: undefined reference to `_sq
lite3ErrorMsg'
/usr/src/AutoMakeTest/sqlite3-embedded/attach.c:83: undefined reference to `_sql
ite3Malloc'
../.libs/libopenpbx.a(libopenpbx_la-attach.o): In function `sqlite3Detach':
/usr/src/AutoMakeTest/sqlite3-embedded/attach.c:176: undefined reference to `_sq
lite3VdbeAddOp'
/usr/src/AutoMakeTest/sqlite3-embedded/attach.c:177: undefined reference to `_sq
lite3VdbeAddOp'
/usr/src/AutoMakeTest/sqlite3-embedded/attach.c:185: undefined reference to `_sq
lite3StrICmp'
/usr/src/AutoMakeTest/sqlite3-embedded/attach.c:192: undefined reference to `_sq
lite3ErrorMsg'
/usr/src/AutoMakeTest/sqlite3-embedded/attach.c:195: undefined reference to `_sq
lite3FreeX'
/usr/src/AutoMakeTest/sqlite3-embedded/attach.c:197: undefined reference to `_sq
lite3ErrorMsg'
../.libs/libopenpbx.a(libopenpbx_la-attach.o): In function `sqlite3FixSrcList':
/usr/src/AutoMakeTest/sqlite3-embedded/attach.c:263: undefined reference to `_sq
lite3StrDup'
/usr/src/AutoMakeTest/sqlite3-embedded/attach.c:264: undefined reference to `_sq
lite3StrICmp'
/usr/src/AutoMakeTest/sqlite3-embedded/attach.c:265: undefined reference to `_sq
lite3ErrorMsg'
../.libs/libopenpbx.a(libopenpbx_la-attach.o): In function `sqlite3Attach':
/usr/src/AutoMakeTest/sqlite3-embedded/attach.c:157: undefined reference to `_sq
lite3FreeX'
../.libs/libopenpbx.a(libopenpbx_la-auth.o): In function `sqlite3_set_authorizer
':
/usr/src/AutoMakeTest/sqlite3-embedded/auth.c:79: undefined reference to `_sqlit
e3ExpirePreparedStatements'
../.libs/libopenpbx.a(libopenpbx_la-auth.o): In function `sqliteAuthBadReturnCod
e':
/usr/src/AutoMakeTest/sqlite3-embedded/auth.c:88: undefined reference to `_sqlit
e3ErrorMsg'
../.libs/libopenpbx.a(libopenpbx_la-auth.o): In function `sqlite3AuthRead':
/usr/src/AutoMakeTest/sqlite3-embedded/auth.c:151: undefined reference to `_sqli
te3ErrorMsg'
/usr/src/AutoMakeTest/sqlite3-embedded/auth.c:154: undefined reference to `_sqli
te3ErrorMsg'
../.libs/libopenpbx.a(libopenpbx_la-auth.o): In function `sqlite3AuthCheck':
/usr/src/AutoMakeTest/sqlite3-embedded/auth.c:188: undefined reference to `_sqli
te3ErrorMsg'
../.libs/libopenpbx.a(libopenpbx_la-btree.o): In function `parseCellPtr':
/usr/src/AutoMakeTest/sqlite3-embedded/btree.c:607: undefined reference to `_sql
ite3GetVarint'
/usr/src/AutoMakeTest/sqlite3-embedded/btree.c:603: undefined reference to `_sql
ite3GetVarint32'
../.libs/libopenpbx.a(libopenpbx_la-btree.o): In function `defragmentPage':
/usr/src/AutoMakeTest/sqlite3-embedded/btree.c:815: undefined reference to `_sql
ite3Malloc'
/usr/src/AutoMakeTest/sqlite3-embedded/btree.c:843: undefined reference to `_sql
ite3FreeX'
../.libs/libopenpbx.a(libopenpbx_la-btree.o): In function `sqlite3BtreeOpen':
/usr/src/AutoMakeTest/sqlite3-embedded/btree.c:1234: undefined reference to `_sq
lite3Malloc'
/usr/src/AutoMakeTest/sqlite3-embedded/btree.c:1242: undefined reference to `_sq
lite3FreeX'
../.libs/libopenpbx.a(libopenpbx_la-btree.o): In function `sqlite3BtreeCloseCurs
or':
/usr/src/AutoMakeTest/sqlite3-embedded/btree.c:2248: undefined reference to `_sq
lite3FreeX'
../.libs/libopenpbx.a(libopenpbx_la-btree.o): In function `sqlite3BtreeClose':
/usr/src/AutoMakeTest/sqlite3-embedded/btree.c:1300: undefined reference to `_sq
lite3FreeX'
../.libs/libopenpbx.a(libopenpbx_la-btree.o): In function `sqlite3BtreeCursor':
/usr/src/AutoMakeTest/sqlite3-embedded/btree.c:2178: undefined reference to `_sq
lite3MallocRaw'
/usr/src/AutoMakeTest/sqlite3-embedded/btree.c:2212: undefined reference to `_sq
lite3FreeX'
../.libs/libopenpbx.a(libopenpbx_la-btree.o): In function `sqlite3BtreeMoveto':
/usr/src/AutoMakeTest/sqlite3-embedded/btree.c:2787: undefined reference to `_sq
lite3MallocRaw'
/usr/src/AutoMakeTest/sqlite3-embedded/btree.c:2791: undefined reference to `_sq
lite3FreeX'
../.libs/libopenpbx.a(libopenpbx_la-btree.o): In function `fillInCell':
/usr/src/AutoMakeTest/sqlite3-embedded/btree.c:3319: undefined reference to `_sq
lite3PutVarint'
/usr/src/AutoMakeTest/sqlite3-embedded/btree.c:3315: undefined reference to `_sq
lite3PutVarint'
../.libs/libopenpbx.a(libopenpbx_la-btree.o): In function `balance':
/usr/src/AutoMakeTest/sqlite3-embedded/btree.c:4338: undefined reference to `_sq
lite3MallocRaw'
/usr/src/AutoMakeTest/sqlite3-embedded/btree.c:4413: undefined reference to `_sq
lite3FreeX'
../.libs/libopenpbx.a(libopenpbx_la-btree.o): In function `balance_nonroot':
/usr/src/AutoMakeTest/sqlite3-embedded/btree.c:4307: undefined reference to `_sq
lite3FreeX'
/usr/src/AutoMakeTest/sqlite3-embedded/btree.c:3917: undefined reference to `_sq
lite3MallocRaw'
../.libs/libopenpbx.a(libopenpbx_la-btree.o): In function `sqlite3BtreeInsert':
/usr/src/AutoMakeTest/sqlite3-embedded/btree.c:4576: undefined reference to `_sq
lite3MallocRaw'
/usr/src/AutoMakeTest/sqlite3-embedded/btree.c:4609: undefined reference to `_sq
lite3FreeX'
../.libs/libopenpbx.a(libopenpbx_la-btree.o): In function `sqlite3BtreeDelete':
/usr/src/AutoMakeTest/sqlite3-embedded/btree.c:4700: undefined reference to `_sq
lite3FreeX'
/usr/src/AutoMakeTest/sqlite3-embedded/btree.c:4684: undefined reference to `_sq
lite3MallocRaw'
../.libs/libopenpbx.a(libopenpbx_la-btree.o): In function `checkAppendMsg':
/usr/src/AutoMakeTest/sqlite3-embedded/btree.c:5312: undefined reference to `_sq
lite3SetString'
/usr/src/AutoMakeTest/sqlite3-embedded/btree.c:5313: undefined reference to `_sq
lite3FreeX'
/usr/src/AutoMakeTest/sqlite3-embedded/btree.c:5317: undefined reference to `_sq
lite3FreeX'
/usr/src/AutoMakeTest/sqlite3-embedded/btree.c:5315: undefined reference to `_sq
lite3SetString'
/usr/src/AutoMakeTest/sqlite3-embedded/btree.c:5317: undefined reference to `_sq
lite3FreeX'
../.libs/libopenpbx.a(libopenpbx_la-btree.o): In function `checkTreePage':
/usr/src/AutoMakeTest/sqlite3-embedded/btree.c:5560: undefined reference to `_sq
lite3Malloc'
/usr/src/AutoMakeTest/sqlite3-embedded/btree.c:5603: undefined reference to `_sq
lite3FreeX'
../.libs/libopenpbx.a(libopenpbx_la-btree.o): In function `sqlite3BtreeIntegrity
Check':
/usr/src/AutoMakeTest/sqlite3-embedded/btree.c:5628: undefined reference to `_sq
lite3StrDup'
/usr/src/AutoMakeTest/sqlite3-embedded/btree.c:5637: undefined reference to `_sq
lite3MallocRaw'
/usr/src/AutoMakeTest/sqlite3-embedded/btree.c:5701: undefined reference to `_sq
lite3FreeX'
../.libs/libopenpbx.a(libopenpbx_la-build.o): In function `sqlite3FinishCoding':

/usr/src/AutoMakeTest/sqlite3-embedded/build.c:53: undefined reference to `_sqli
te3_malloc_failed'
/usr/src/AutoMakeTest/sqlite3-embedded/build.c:68: undefined reference to `_sqli
te3VdbeAddOp'
/usr/src/AutoMakeTest/sqlite3-embedded/build.c:79: undefined reference to `_sqli
te3VdbeJumpHere'
/usr/src/AutoMakeTest/sqlite3-embedded/build.c:82: undefined reference to `_sqli
te3VdbeAddOp'
/usr/src/AutoMakeTest/sqlite3-embedded/build.c:83: undefined reference to `_sqli
te3VdbeAddOp'
/usr/src/AutoMakeTest/sqlite3-embedded/build.c:85: undefined reference to `_sqli
te3VdbeAddOp'
/usr/src/AutoMakeTest/sqlite3-embedded/build.c:95: undefined reference to `_sqli
te3VdbeOp3'
/usr/src/AutoMakeTest/sqlite3-embedded/build.c:104: undefined reference to `_sql
ite3VdbeTrace'
/usr/src/AutoMakeTest/sqlite3-embedded/build.c:105: undefined reference to `_sql
ite3VdbeMakeReady'
../.libs/libopenpbx.a(libopenpbx_la-build.o): In function `sqlite3NestedParse':
/usr/src/AutoMakeTest/sqlite3-embedded/build.c:150: undefined reference to `_sql
ite3FreeX'
../.libs/libopenpbx.a(libopenpbx_la-build.o): In function `sqlite3FindTable':
/usr/src/AutoMakeTest/sqlite3-embedded/build.c:174: undefined reference to `_sql
ite3StrICmp'
../.libs/libopenpbx.a(libopenpbx_la-build.o): In function `sqlite3LocateTable':
/usr/src/AutoMakeTest/sqlite3-embedded/build.c:196: undefined reference to `_sql
ite3ReadSchema'
/usr/src/AutoMakeTest/sqlite3-embedded/build.c:203: undefined reference to `_sql
ite3ErrorMsg'
/usr/src/AutoMakeTest/sqlite3-embedded/build.c:205: undefined reference to `_sql
ite3ErrorMsg'
../.libs/libopenpbx.a(libopenpbx_la-build.o): In function `sqlite3FindIndex':
/usr/src/AutoMakeTest/sqlite3-embedded/build.c:230: undefined reference to `_sql
ite3StrICmp'
../.libs/libopenpbx.a(libopenpbx_la-build.o): In function `freeIndex':
/usr/src/AutoMakeTest/sqlite3-embedded/build.c:241: undefined reference to `_sql
ite3FreeX'
/usr/src/AutoMakeTest/sqlite3-embedded/build.c:242: undefined reference to `_sql
ite3FreeX'
../.libs/libopenpbx.a(libopenpbx_la-build.o): In function `sqliteResetColumnName
s':
/usr/src/AutoMakeTest/sqlite3-embedded/build.c:394: undefined reference to `_sql
ite3FreeX'
/usr/src/AutoMakeTest/sqlite3-embedded/build.c:396: undefined reference to `_sql
ite3FreeX'
/usr/src/AutoMakeTest/sqlite3-embedded/build.c:398: undefined reference to `_sql
ite3FreeX'
../.libs/libopenpbx.a(libopenpbx_la-build.o):/usr/src/AutoMakeTest/sqlite3-embed
ded/build.c:449: more undefined references to `_sqlite3FreeX' follow
../.libs/libopenpbx.a(libopenpbx_la-build.o): In function `sqlite3ResetInternalS
chema':
/usr/src/AutoMakeTest/sqlite3-embedded/build.c:317: undefined reference to `_sql
ite3DeleteTrigger'
/usr/src/AutoMakeTest/sqlite3-embedded/build.c:349: undefined reference to `_sql
ite3FreeX'
/usr/src/AutoMakeTest/sqlite3-embedded/build.c:362: undefined reference to `_sql
ite3FreeX'
../.libs/libopenpbx.a(libopenpbx_la-build.o): In function `sqlite3NameFromToken'
:
/usr/src/AutoMakeTest/sqlite3-embedded/build.c:509: undefined reference to `_sql
ite3StrNDup'
/usr/src/AutoMakeTest/sqlite3-embedded/build.c:510: undefined reference to `_sql
ite3Dequote'
../.libs/libopenpbx.a(libopenpbx_la-build.o): In function `sqlite3OpenMasterTabl
e':
/usr/src/AutoMakeTest/sqlite3-embedded/build.c:522: undefined reference to `_sql
ite3VdbeAddOp'
/usr/src/AutoMakeTest/sqlite3-embedded/build.c:523: undefined reference to `_sql
ite3VdbeAddOp'
/usr/src/AutoMakeTest/sqlite3-embedded/build.c:524: undefined reference to `_sql
ite3VdbeAddOp'
../.libs/libopenpbx.a(libopenpbx_la-build.o): In function `sqlite3FindDb':
/usr/src/AutoMakeTest/sqlite3-embedded/build.c:548: undefined reference to `_sql
ite3FreeX'
/usr/src/AutoMakeTest/sqlite3-embedded/build.c:543: undefined reference to `_sql
ite3StrICmp'
../.libs/libopenpbx.a(libopenpbx_la-build.o): In function `sqlite3TwoPartName':
/usr/src/AutoMakeTest/sqlite3-embedded/build.c:583: undefined reference to `_sql
ite3ErrorMsg'
../.libs/libopenpbx.a(libopenpbx_la-build.o): In function `sqlite3CheckObjectNam
e':
/usr/src/AutoMakeTest/sqlite3-embedded/build.c:603: undefined reference to `_sql
ite3StrNICmp'
/usr/src/AutoMakeTest/sqlite3-embedded/build.c:606: undefined reference to `_sql
ite3ErrorMsg'
../.libs/libopenpbx.a(libopenpbx_la-build.o): In function `sqlite3AddColumn':
/usr/src/AutoMakeTest/sqlite3-embedded/build.c:834: undefined reference to `_sql
ite3UpperToLower'
/usr/src/AutoMakeTest/sqlite3-embedded/build.c:834: undefined reference to `_sql
ite3UpperToLower'
/usr/src/AutoMakeTest/sqlite3-embedded/build.c:834: undefined reference to `_sql
ite3StrICmp'
/usr/src/AutoMakeTest/sqlite3-embedded/build.c:842: undefined reference to `_sql
ite3Realloc'
/usr/src/AutoMakeTest/sqlite3-embedded/build.c:835: undefined reference to `_sql
ite3ErrorMsg'
../.libs/libopenpbx.a(libopenpbx_la-build.o): In function `sqlite3AffinityType':

/usr/src/AutoMakeTest/sqlite3-embedded/build.c:905: undefined reference to `_sql
ite3UpperToLower'
../.libs/libopenpbx.a(libopenpbx_la-build.o): In function `sqlite3AddColumnType'
:
/usr/src/AutoMakeTest/sqlite3-embedded/build.c:943: undefined reference to `_sql
ite3FreeX'
../.libs/libopenpbx.a(libopenpbx_la-build.o): In function `sqlite3AddDefaultValu
e':
/usr/src/AutoMakeTest/sqlite3-embedded/build.c:964: undefined reference to `_sql
ite3ErrorMsg'
../.libs/libopenpbx.a(libopenpbx_la-build.o): In function `sqlite3LocateCollSeq'
:
/usr/src/AutoMakeTest/sqlite3-embedded/build.c:1115: undefined reference to `_sq
lite3ErrorMsg'
../.libs/libopenpbx.a(libopenpbx_la-build.o): In function `sqlite3ChangeCookie':

/usr/src/AutoMakeTest/sqlite3-embedded/build.c:1141: undefined reference to `_sq
lite3VdbeAddOp'
/usr/src/AutoMakeTest/sqlite3-embedded/build.c:1142: undefined reference to `_sq
lite3VdbeAddOp'
../.libs/libopenpbx.a(libopenpbx_la-build.o): In function `sqlite3EndTable':
/usr/src/AutoMakeTest/sqlite3-embedded/build.c:1263: undefined reference to `_sq
lite3_malloc_failed'
/usr/src/AutoMakeTest/sqlite3-embedded/build.c:1296: undefined reference to `_sq
lite3VdbeAddOp'
/usr/src/AutoMakeTest/sqlite3-embedded/build.c:1324: undefined reference to `_sq
lite3VdbeAddOp'
/usr/src/AutoMakeTest/sqlite3-embedded/build.c:1325: undefined reference to `_sq
lite3VdbeAddOp'
/usr/src/AutoMakeTest/sqlite3-embedded/build.c:1326: undefined reference to `_sq
lite3VdbeAddOp'
/usr/src/AutoMakeTest/sqlite3-embedded/build.c:1329: undefined reference to `_sq
lite3VdbeAddOp'
/usr/src/AutoMakeTest/sqlite3-embedded/build.c:1213: undefined reference to `_sq
lite3MallocRaw'
/usr/src/AutoMakeTest/sqlite3-embedded/build.c:1366: undefined reference to `_sq
lite3FreeX'
/usr/src/AutoMakeTest/sqlite3-embedded/build.c:1385: undefined reference to `_sq
lite3VdbeOp3'
../.libs/libopenpbx.a(libopenpbx_la-build.o): In function `destroyRootPage':
/usr/src/AutoMakeTest/sqlite3-embedded/build.c:1614: undefined reference to `_sq
lite3VdbeAddOp'
../.libs/libopenpbx.a(libopenpbx_la-build.o): In function `sqlite3CreateForeignK
ey':
/usr/src/AutoMakeTest/sqlite3-embedded/build.c:1869: undefined reference to `_sq
lite3Malloc'
/usr/src/AutoMakeTest/sqlite3-embedded/build.c:1888: undefined reference to `_sq
lite3StrICmp'
/usr/src/AutoMakeTest/sqlite3-embedded/build.c:1894: undefined reference to `_sq
lite3ErrorMsg'
/usr/src/AutoMakeTest/sqlite3-embedded/build.c:1921: undefined reference to `_sq
lite3FreeX'
/usr/src/AutoMakeTest/sqlite3-embedded/build.c:1856: undefined reference to `_sq
lite3ErrorMsg'
/usr/src/AutoMakeTest/sqlite3-embedded/build.c:1849: undefined reference to `_sq
lite3ErrorMsg'
../.libs/libopenpbx.a(libopenpbx_la-build.o): In function `sqlite3RefillIndex':
/usr/src/AutoMakeTest/sqlite3-embedded/build.c:1980: undefined reference to `_sq
lite3VdbeAddOp'
/usr/src/AutoMakeTest/sqlite3-embedded/build.c:1986: undefined reference to `_sq
lite3VdbeAddOp'
/usr/src/AutoMakeTest/sqlite3-embedded/build.c:1987: undefined reference to `_sq
lite3VdbeOp3'
/usr/src/AutoMakeTest/sqlite3-embedded/build.c:1990: undefined reference to `_sq
lite3VdbeAddOp'
/usr/src/AutoMakeTest/sqlite3-embedded/build.c:2003: undefined reference to `_sq
lite3VdbeAddOp'
/usr/src/AutoMakeTest/sqlite3-embedded/build.c:2004: undefined reference to `_sq
lite3VdbeAddOp'
/usr/src/AutoMakeTest/sqlite3-embedded/build.c:2005: undefined reference to `_sq
lite3VdbeJumpHere'
/usr/src/AutoMakeTest/sqlite3-embedded/build.c:2006: undefined reference to `_sq
lite3VdbeAddOp'
/usr/src/AutoMakeTest/sqlite3-embedded/build.c:2007: undefined reference to `_sq
lite3VdbeAddOp'
/usr/src/AutoMakeTest/sqlite3-embedded/build.c:1993: undefined reference to `_sq
lite3VdbeCurrentAddr'
/usr/src/AutoMakeTest/sqlite3-embedded/build.c:1995: undefined reference to `_sq
lite3VdbeChangeP2'
/usr/src/AutoMakeTest/sqlite3-embedded/build.c:1996: undefined reference to `_sq
lite3VdbeAddOp'
/usr/src/AutoMakeTest/sqlite3-embedded/build.c:1997: undefined reference to `_sq
lite3VdbeAddOp'
/usr/src/AutoMakeTest/sqlite3-embedded/build.c:1998: undefined reference to `_sq
lite3VdbeAddOp'
/usr/src/AutoMakeTest/sqlite3-embedded/build.c:1999: undefined reference to `_sq
lite3VdbeOp3'
/usr/src/AutoMakeTest/sqlite3-embedded/build.c:1984: undefined reference to `_sq
lite3VdbeAddOp'
../.libs/libopenpbx.a(libopenpbx_la-build.o): In function `sqlite3ArrayAllocate'
:
/usr/src/AutoMakeTest/sqlite3-embedded/build.c:2498: undefined reference to `_sq
lite3Realloc'
../.libs/libopenpbx.a(libopenpbx_la-build.o): In function `sqlite3IdListDelete':

/usr/src/AutoMakeTest/sqlite3-embedded/build.c:2539: undefined reference to `_sq
lite3FreeX'
/usr/src/AutoMakeTest/sqlite3-embedded/build.c:2541: undefined reference to `_sq
lite3FreeX'
../.libs/libopenpbx.a(libopenpbx_la-build.o): In function `sqlite3SrcListDelete'
:
/usr/src/AutoMakeTest/sqlite3-embedded/build.c:2650: undefined reference to `_sq
lite3FreeX'
/usr/src/AutoMakeTest/sqlite3-embedded/build.c:2651: undefined reference to `_sq
lite3FreeX'
/usr/src/AutoMakeTest/sqlite3-embedded/build.c:2652: undefined reference to `_sq
lite3FreeX'
../.libs/libopenpbx.a(libopenpbx_la-build.o): In function `sqlite3DropIndex':
/usr/src/AutoMakeTest/sqlite3-embedded/build.c:2417: undefined reference to `_sq
lite3_malloc_failed'
/usr/src/AutoMakeTest/sqlite3-embedded/build.c:2421: undefined reference to `_sq
lite3ReadSchema'
/usr/src/AutoMakeTest/sqlite3-embedded/build.c:2462: undefined reference to `_sq
lite3VdbeOp3'
/usr/src/AutoMakeTest/sqlite3-embedded/build.c:2431: undefined reference to `_sq
lite3ErrorMsg'
/usr/src/AutoMakeTest/sqlite3-embedded/build.c:2426: undefined reference to `_sq
lite3ErrorMsg'
../.libs/libopenpbx.a(libopenpbx_la-build.o): In function `sqlite3IdListAppend':

/usr/src/AutoMakeTest/sqlite3-embedded/build.c:2519: undefined reference to `_sq
lite3Malloc'
../.libs/libopenpbx.a(libopenpbx_la-build.o): In function `sqlite3IdListIndex':
/usr/src/AutoMakeTest/sqlite3-embedded/build.c:2553: undefined reference to `_sq
lite3StrICmp'
../.libs/libopenpbx.a(libopenpbx_la-build.o): In function `sqlite3SrcListAppend'
:
/usr/src/AutoMakeTest/sqlite3-embedded/build.c:2593: undefined reference to `_sq
lite3Realloc'
/usr/src/AutoMakeTest/sqlite3-embedded/build.c:2586: undefined reference to `_sq
lite3Malloc'
../.libs/libopenpbx.a(libopenpbx_la-build.o): In function `sqlite3BeginTransacti
on':
/usr/src/AutoMakeTest/sqlite3-embedded/build.c:2670: undefined reference to `_sq
lite3_malloc_failed'
/usr/src/AutoMakeTest/sqlite3-embedded/build.c:2677: undefined reference to `_sq
lite3VdbeAddOp'
/usr/src/AutoMakeTest/sqlite3-embedded/build.c:2680: undefined reference to `_sq
lite3VdbeAddOp'
../.libs/libopenpbx.a(libopenpbx_la-build.o): In function `sqlite3CommitTransact
ion':
/usr/src/AutoMakeTest/sqlite3-embedded/build.c:2691: undefined reference to `_sq
lite3_malloc_failed'
/usr/src/AutoMakeTest/sqlite3-embedded/build.c:2696: undefined reference to `_sq
lite3VdbeAddOp'
../.libs/libopenpbx.a(libopenpbx_la-build.o): In function `sqlite3RollbackTransa
ction':
/usr/src/AutoMakeTest/sqlite3-embedded/build.c:2708: undefined reference to `_sq
lite3_malloc_failed'
/usr/src/AutoMakeTest/sqlite3-embedded/build.c:2713: undefined reference to `_sq
lite3VdbeAddOp'
../.libs/libopenpbx.a(libopenpbx_la-build.o): In function `sqlite3CodeVerifySche
ma':
/usr/src/AutoMakeTest/sqlite3-embedded/build.c:2775: undefined reference to `_sq
lite3VdbeAddOp'
/usr/src/AutoMakeTest/sqlite3-embedded/build.c:2734: undefined reference to `_sq
lite3ErrorMsg'
../.libs/libopenpbx.a(libopenpbx_la-build.o): In function `sqlite3BeginWriteOper
ation':
/usr/src/AutoMakeTest/sqlite3-embedded/build.c:2816: undefined reference to `_sq
lite3VdbeAddOp'
../.libs/libopenpbx.a(libopenpbx_la-build.o): In function `sqlite3CreateIndex':
/usr/src/AutoMakeTest/sqlite3-embedded/build.c:2043: undefined reference to `_sq
lite3_malloc_failed'
/usr/src/AutoMakeTest/sqlite3-embedded/build.c:2135: undefined reference to `_sq
lite3SetString'
/usr/src/AutoMakeTest/sqlite3-embedded/build.c:2169: undefined reference to `_sq
lite3Malloc'
/usr/src/AutoMakeTest/sqlite3-embedded/build.c:2171: undefined reference to `_sq
lite3_malloc_failed'
/usr/src/AutoMakeTest/sqlite3-embedded/build.c:2188: undefined reference to `_sq
lite3StrICmp'
/usr/src/AutoMakeTest/sqlite3-embedded/build.c:2191: undefined reference to `_sq
lite3ErrorMsg'
/usr/src/AutoMakeTest/sqlite3-embedded/build.c:2373: undefined reference to `_sq
lite3FreeX'
/usr/src/AutoMakeTest/sqlite3-embedded/build.c:2112: undefined reference to `_sq
lite3ReadSchema'
/usr/src/AutoMakeTest/sqlite3-embedded/build.c:2118: undefined reference to `_sq
lite3ReadSchema'
/usr/src/AutoMakeTest/sqlite3-embedded/build.c:2120: undefined reference to `_sq
lite3ErrorMsg'
/usr/src/AutoMakeTest/sqlite3-embedded/build.c:2092: undefined reference to `_sq
lite3ErrorMsg'
/usr/src/AutoMakeTest/sqlite3-embedded/build.c:2303: undefined reference to `_sq
lite3VdbeAddOp'
/usr/src/AutoMakeTest/sqlite3-embedded/build.c:2304: undefined reference to `_sq
lite3VdbeAddOp'
/usr/src/AutoMakeTest/sqlite3-embedded/build.c:2330: undefined reference to `_sq
lite3VdbeAddOp'
/usr/src/AutoMakeTest/sqlite3-embedded/build.c:2331: undefined reference to `_sq
lite3FreeX'
/usr/src/AutoMakeTest/sqlite3-embedded/build.c:2339: undefined reference to `_sq
lite3VdbeOp3'
/usr/src/AutoMakeTest/sqlite3-embedded/build.c:2341: undefined reference to `_sq
lite3VdbeAddOp'
/usr/src/AutoMakeTest/sqlite3-embedded/build.c:2248: undefined reference to `_sq
lite3ErrorMsg'
../.libs/libopenpbx.a(libopenpbx_la-build.o): In function `sqlite3AddPrimaryKey'
:
/usr/src/AutoMakeTest/sqlite3-embedded/build.c:1014: undefined reference to `_sq
lite3StrICmp'
/usr/src/AutoMakeTest/sqlite3-embedded/build.c:1027: undefined reference to `_sq
lite3StrICmp'
/usr/src/AutoMakeTest/sqlite3-embedded/build.c:1033: undefined reference to `_sq
lite3ErrorMsg'
/usr/src/AutoMakeTest/sqlite3-embedded/build.c:1003: undefined reference to `_sq
lite3ErrorMsg'
../.libs/libopenpbx.a(libopenpbx_la-build.o): In function `sqlite3DropTable':
/usr/src/AutoMakeTest/sqlite3-embedded/build.c:1694: undefined reference to `_sq
lite3_malloc_failed'
/usr/src/AutoMakeTest/sqlite3-embedded/build.c:1766: undefined reference to `_sq
lite3DropTriggerPtr'
/usr/src/AutoMakeTest/sqlite3-embedded/build.c:1801: undefined reference to `_sq
lite3VdbeOp3'
/usr/src/AutoMakeTest/sqlite3-embedded/build.c:1744: undefined reference to `_sq
lite3ErrorMsg'
../.libs/libopenpbx.a(libopenpbx_la-build.o): In function `sqlite3StartTable':
/usr/src/AutoMakeTest/sqlite3-embedded/build.c:708: undefined reference to `_sql
ite3ReadSchema'
/usr/src/AutoMakeTest/sqlite3-embedded/build.c:717: undefined reference to `_sql
ite3ErrorMsg'
/usr/src/AutoMakeTest/sqlite3-embedded/build.c:800: undefined reference to `_sql
ite3FreeX'
/usr/src/AutoMakeTest/sqlite3-embedded/build.c:665: undefined reference to `_sql
ite3ErrorMsg'
/usr/src/AutoMakeTest/sqlite3-embedded/build.c:720: undefined reference to `_sql
ite3Malloc'
/usr/src/AutoMakeTest/sqlite3-embedded/build.c:761: undefined reference to `_sql
ite3VdbeAddOp'
/usr/src/AutoMakeTest/sqlite3-embedded/build.c:762: undefined reference to `_sql
ite3VdbeMakeLabel'
/usr/src/AutoMakeTest/sqlite3-embedded/build.c:763: undefined reference to `_sql
ite3VdbeAddOp'
/usr/src/AutoMakeTest/sqlite3-embedded/build.c:764: undefined reference to `_sql
ite3VdbeAddOp'
/usr/src/AutoMakeTest/sqlite3-embedded/build.c:765: undefined reference to `_sql
ite3VdbeAddOp'
/usr/src/AutoMakeTest/sqlite3-embedded/build.c:766: undefined reference to `_sql
ite3VdbeAddOp'
/usr/src/AutoMakeTest/sqlite3-embedded/build.c:767: undefined reference to `_sql
ite3VdbeAddOp'
/usr/src/AutoMakeTest/sqlite3-embedded/build.c:768: undefined reference to `_sql
ite3VdbeResolveLabel'
/usr/src/AutoMakeTest/sqlite3-embedded/build.c:784: undefined reference to `_sql
ite3VdbeAddOp'
/usr/src/AutoMakeTest/sqlite3-embedded/build.c:787: undefined reference to `_sql
ite3VdbeAddOp'
/usr/src/AutoMakeTest/sqlite3-embedded/build.c:788: undefined reference to `_sql
ite3VdbeAddOp'
/usr/src/AutoMakeTest/sqlite3-embedded/build.c:789: undefined reference to `_sql
ite3VdbeAddOp'
/usr/src/AutoMakeTest/sqlite3-embedded/build.c:790: undefined reference to `_sql
ite3VdbeAddOp'
../.libs/libopenpbx.a(libopenpbx_la-build.o):/usr/src/AutoMakeTest/sqlite3-embed
ded/build.c:791: more undefined references to `_sqlite3VdbeAddOp' follow
../.libs/libopenpbx.a(libopenpbx_la-build.o): In function `sqlite3CreateView':
/usr/src/AutoMakeTest/sqlite3-embedded/build.c:1442: undefined reference to `_sq
lite3ErrorMsg'
../.libs/libopenpbx.a(libopenpbx_la-build.o): In function `sqlite3Reindex':
/usr/src/AutoMakeTest/sqlite3-embedded/build.c:2905: undefined reference to `_sq
lite3ReadSchema'
/usr/src/AutoMakeTest/sqlite3-embedded/build.c:2926: undefined reference to `_sq
lite3FreeX'
/usr/src/AutoMakeTest/sqlite3-embedded/build.c:2930: undefined reference to `_sq
lite3FreeX'
/usr/src/AutoMakeTest/sqlite3-embedded/build.c:2936: undefined reference to `_sq
lite3ErrorMsg'
../.libs/libopenpbx.a(libopenpbx_la-build.o): In function `sqlite3DeleteTable':
/usr/src/AutoMakeTest/sqlite3-embedded/build.c:459: undefined reference to `_sql
ite3FreeX'
../.libs/libopenpbx.a(libopenpbx_la-build.o): In function `sqlite3AddColumn':
/usr/src/AutoMakeTest/sqlite3-embedded/build.c:844: undefined reference to `_sql
ite3FreeX'
../.libs/libopenpbx.a(libopenpbx_la-build.o): In function `sqlite3IdListDelete':

/usr/src/AutoMakeTest/sqlite3-embedded/build.c:2542: undefined reference to `_sq
lite3FreeX'
../.libs/libopenpbx.a(libopenpbx_la-build.o): In function `sqlite3SrcListDelete'
:
/usr/src/AutoMakeTest/sqlite3-embedded/build.c:2658: undefined reference to `_sq
lite3FreeX'
../.libs/libopenpbx.a(libopenpbx_la-date.o): In function `isDate':
/usr/src/AutoMakeTest/sqlite3-embedded/date.c:641: undefined reference to `_sqli
te3_value_type'
/usr/src/AutoMakeTest/sqlite3-embedded/date.c:306: undefined reference to `_sqli
te3_value_text'
/usr/src/AutoMakeTest/sqlite3-embedded/date.c:644: undefined reference to `_sqli
te3_value_type'
/usr/src/AutoMakeTest/sqlite3-embedded/date.c:450: undefined reference to `_sqli
te3_value_text'
/usr/src/AutoMakeTest/sqlite3-embedded/date.c:505: undefined reference to `_sqli
te3AtoF'
/usr/src/AutoMakeTest/sqlite3-embedded/date.c:561: undefined reference to `_sqli
te3AtoF'
/usr/src/AutoMakeTest/sqlite3-embedded/date.c:312: undefined reference to `_sqli
te3StrICmp'
/usr/src/AutoMakeTest/sqlite3-embedded/date.c:318: undefined reference to `_sqli
te3IsNumber'
/usr/src/AutoMakeTest/sqlite3-embedded/date.c:319: undefined reference to `_sqli
te3AtoF'
../.libs/libopenpbx.a(libopenpbx_la-date.o): In function `juliandayFunc':
/usr/src/AutoMakeTest/sqlite3-embedded/date.c:669: undefined reference to `_sqli
te3_result_double'
../.libs/libopenpbx.a(libopenpbx_la-date.o): In function `datetimeFunc':
/usr/src/AutoMakeTest/sqlite3-embedded/date.c:689: undefined reference to `_sqli
te3_result_text'
../.libs/libopenpbx.a(libopenpbx_la-date.o): In function `timeFunc':
/usr/src/AutoMakeTest/sqlite3-embedded/date.c:708: undefined reference to `_sqli
te3_result_text'
../.libs/libopenpbx.a(libopenpbx_la-date.o): In function `dateFunc':
/usr/src/AutoMakeTest/sqlite3-embedded/date.c:727: undefined reference to `_sqli
te3_result_text'
../.libs/libopenpbx.a(libopenpbx_la-date.o): In function `strftimeFunc':
/usr/src/AutoMakeTest/sqlite3-embedded/date.c:758: undefined reference to `_sqli
te3_value_text'
/usr/src/AutoMakeTest/sqlite3-embedded/date.c:853: undefined reference to `_sqli
te3_result_text'
/usr/src/AutoMakeTest/sqlite3-embedded/date.c:855: undefined reference to `_sqli
te3FreeX'
/usr/src/AutoMakeTest/sqlite3-embedded/date.c:797: undefined reference to `_sqli
te3Malloc'
../.libs/libopenpbx.a(libopenpbx_la-date.o): In function `ctimeFunc':
/usr/src/AutoMakeTest/sqlite3-embedded/date.c:869: undefined reference to `_sqli
te3ValueNew'
/usr/src/AutoMakeTest/sqlite3-embedded/date.c:871: undefined reference to `_sqli
te3ValueSetStr'
/usr/src/AutoMakeTest/sqlite3-embedded/date.c:873: undefined reference to `_sqli
te3ValueFree'
../.libs/libopenpbx.a(libopenpbx_la-date.o): In function `cdateFunc':
/usr/src/AutoMakeTest/sqlite3-embedded/date.c:887: undefined reference to `_sqli
te3ValueNew'
/usr/src/AutoMakeTest/sqlite3-embedded/date.c:889: undefined reference to `_sqli
te3ValueSetStr'
/usr/src/AutoMakeTest/sqlite3-embedded/date.c:891: undefined reference to `_sqli
te3ValueFree'
../.libs/libopenpbx.a(libopenpbx_la-date.o): In function `ctimestampFunc':
/usr/src/AutoMakeTest/sqlite3-embedded/date.c:905: undefined reference to `_sqli
te3ValueNew'
/usr/src/AutoMakeTest/sqlite3-embedded/date.c:907: undefined reference to `_sqli
te3ValueSetStr'
/usr/src/AutoMakeTest/sqlite3-embedded/date.c:909: undefined reference to `_sqli
te3ValueFree'
../.libs/libopenpbx.a(libopenpbx_la-delete.o): In function `sqlite3IsReadOnly':
/usr/src/AutoMakeTest/sqlite3-embedded/delete.c:52: undefined reference to `_sql
ite3ErrorMsg'
../.libs/libopenpbx.a(libopenpbx_la-delete.o): In function `sqlite3OpenTableForR
eading':
/usr/src/AutoMakeTest/sqlite3-embedded/delete.c:67: undefined reference to `_sql
ite3VdbeAddOp'
/usr/src/AutoMakeTest/sqlite3-embedded/delete.c:69: undefined reference to `_sql
ite3VdbeAddOp'
/usr/src/AutoMakeTest/sqlite3-embedded/delete.c:70: undefined reference to `_sql
ite3VdbeAddOp'
../.libs/libopenpbx.a(libopenpbx_la-delete.o): In function `sqlite3GenerateIndex
Key':
/usr/src/AutoMakeTest/sqlite3-embedded/delete.c:433: undefined reference to `_sq
lite3VdbeAddOp'
/usr/src/AutoMakeTest/sqlite3-embedded/delete.c:439: undefined reference to `_sq
lite3VdbeAddOp'
/usr/src/AutoMakeTest/sqlite3-embedded/delete.c:440: undefined reference to `_sq
lite3ColumnDefault'
/usr/src/AutoMakeTest/sqlite3-embedded/delete.c:437: undefined reference to `_sq
lite3VdbeAddOp'
/usr/src/AutoMakeTest/sqlite3-embedded/delete.c:443: undefined reference to `_sq
lite3VdbeAddOp'
../.libs/libopenpbx.a(libopenpbx_la-delete.o): In function `sqlite3GenerateRowIn
dexDelete':
/usr/src/AutoMakeTest/sqlite3-embedded/delete.c:415: undefined reference to `_sq
lite3VdbeAddOp'
../.libs/libopenpbx.a(libopenpbx_la-delete.o): In function `sqlite3GenerateRowDe
lete':
/usr/src/AutoMakeTest/sqlite3-embedded/delete.c:380: undefined reference to `_sq
lite3VdbeAddOp'
/usr/src/AutoMakeTest/sqlite3-embedded/delete.c:382: undefined reference to `_sq
lite3VdbeAddOp'
../.libs/libopenpbx.a(libopenpbx_la-delete.o): In function `sqlite3DeleteFrom':
/usr/src/AutoMakeTest/sqlite3-embedded/delete.c:105: undefined reference to `_sq
lite3_malloc_failed'
/usr/src/AutoMakeTest/sqlite3-embedded/delete.c:123: undefined reference to `_sq
lite3TriggersExist'
/usr/src/AutoMakeTest/sqlite3-embedded/delete.c:340: undefined reference to `_sq
lite3VdbeAddOp'
/usr/src/AutoMakeTest/sqlite3-embedded/delete.c:341: undefined reference to `_sq
lite3VdbeSetNumCols'
/usr/src/AutoMakeTest/sqlite3-embedded/delete.c:342: undefined reference to `_sq
lite3VdbeSetColName'
/usr/src/AutoMakeTest/sqlite3-embedded/delete.c:237: undefined reference to `_sq
lite3WhereBegin'
/usr/src/AutoMakeTest/sqlite3-embedded/delete.c:242: undefined reference to `_sq
lite3VdbeAddOp'
/usr/src/AutoMakeTest/sqlite3-embedded/delete.c:243: undefined reference to `_sq
lite3VdbeAddOp'
/usr/src/AutoMakeTest/sqlite3-embedded/delete.c:250: undefined reference to `_sq
lite3WhereEnd'
/usr/src/AutoMakeTest/sqlite3-embedded/delete.c:263: undefined reference to `_sq
lite3VdbeMakeLabel'
/usr/src/AutoMakeTest/sqlite3-embedded/delete.c:312: undefined reference to `_sq
lite3VdbeAddOp'
/usr/src/AutoMakeTest/sqlite3-embedded/delete.c:314: undefined reference to `_sq
lite3VdbeAddOp'
/usr/src/AutoMakeTest/sqlite3-embedded/delete.c:316: undefined reference to `_sq
lite3CodeRowTrigger'
/usr/src/AutoMakeTest/sqlite3-embedded/delete.c:322: undefined reference to `_sq
lite3VdbeAddOp'
/usr/src/AutoMakeTest/sqlite3-embedded/delete.c:323: undefined reference to `_sq
lite3VdbeResolveLabel'
/usr/src/AutoMakeTest/sqlite3-embedded/delete.c:328: undefined reference to `_sq
lite3VdbeAddOp'
/usr/src/AutoMakeTest/sqlite3-embedded/delete.c:330: undefined reference to `_sq
lite3VdbeAddOp'
/usr/src/AutoMakeTest/sqlite3-embedded/delete.c:194: undefined reference to `_sq
lite3VdbeAddOp'
/usr/src/AutoMakeTest/sqlite3-embedded/delete.c:178: undefined reference to `_sq
lite3VdbeCountChanges'
/usr/src/AutoMakeTest/sqlite3-embedded/delete.c:217: undefined reference to `_sq
lite3VdbeAddOp'
/usr/src/AutoMakeTest/sqlite3-embedded/delete.c:219: undefined reference to `_sq
lite3VdbeAddOp'
/usr/src/AutoMakeTest/sqlite3-embedded/delete.c:205: undefined reference to `_sq
lite3VdbeMakeLabel'
/usr/src/AutoMakeTest/sqlite3-embedded/delete.c:210: undefined reference to `_sq
lite3VdbeCurrentAddr'
/usr/src/AutoMakeTest/sqlite3-embedded/delete.c:210: undefined reference to `_sq
lite3VdbeAddOp'
/usr/src/AutoMakeTest/sqlite3-embedded/delete.c:211: undefined reference to `_sq
lite3VdbeAddOp'
/usr/src/AutoMakeTest/sqlite3-embedded/delete.c:212: undefined reference to `_sq
lite3VdbeAddOp'
/usr/src/AutoMakeTest/sqlite3-embedded/delete.c:213: undefined reference to `_sq
lite3VdbeResolveLabel'
/usr/src/AutoMakeTest/sqlite3-embedded/delete.c:214: undefined reference to `_sq
lite3VdbeAddOp'
/usr/src/AutoMakeTest/sqlite3-embedded/delete.c:255: undefined reference to `_sq
lite3VdbeAddOp'
/usr/src/AutoMakeTest/sqlite3-embedded/delete.c:256: undefined reference to `_sq
lite3VdbeAddOp'
/usr/src/AutoMakeTest/sqlite3-embedded/delete.c:269: undefined reference to `_sq
lite3VdbeAddOp'
/usr/src/AutoMakeTest/sqlite3-embedded/delete.c:274: undefined reference to `_sq
lite3VdbeAddOp'
../.libs/libopenpbx.a(libopenpbx_la-delete.o):/usr/src/AutoMakeTest/sqlite3-embe
dded/delete.c:275: more undefined references to `_sqlite3VdbeAddOp' follow
../.libs/libopenpbx.a(libopenpbx_la-delete.o): In function `sqlite3DeleteFrom':
/usr/src/AutoMakeTest/sqlite3-embedded/delete.c:282: undefined reference to `_sq
lite3CodeRowTrigger'
/usr/src/AutoMakeTest/sqlite3-embedded/delete.c:245: undefined reference to `_sq
lite3VdbeAddOp'
/usr/src/AutoMakeTest/sqlite3-embedded/delete.c:279: undefined reference to `_sq
lite3VdbeAddOp'
/usr/src/AutoMakeTest/sqlite3-embedded/delete.c:271: undefined reference to `_sq
lite3VdbeAddOp'
/usr/src/AutoMakeTest/sqlite3-embedded/delete.c:299: undefined reference to `_sq
lite3VdbeAddOp'
../.libs/libopenpbx.a(libopenpbx_la-delete.o): In function `sqlite3GenerateRowDe
lete':
/usr/src/AutoMakeTest/sqlite3-embedded/delete.c:383: undefined reference to `_sq
lite3VdbeJumpHere'
../.libs/libopenpbx.a(libopenpbx_la-expr.o): In function `codeCompare':
/usr/src/AutoMakeTest/sqlite3-embedded/expr.c:181: undefined reference to `_sqli
te3VdbeOp3'
../.libs/libopenpbx.a(libopenpbx_la-expr.o): In function `sqlite3ExprSpan':
/usr/src/AutoMakeTest/sqlite3-embedded/expr.c:266: undefined reference to `_sqli
te3_malloc_failed'
../.libs/libopenpbx.a(libopenpbx_la-expr.o): In function `sqlite3ExprAssignVarNu
mber':
/usr/src/AutoMakeTest/sqlite3-embedded/expr.c:361: undefined reference to `_sqli
te3_malloc_failed'
/usr/src/AutoMakeTest/sqlite3-embedded/expr.c:358: undefined reference to `_sqli
te3ReallocOrFree'
/usr/src/AutoMakeTest/sqlite3-embedded/expr.c:332: undefined reference to `_sqli
te3ErrorMsg'
../.libs/libopenpbx.a(libopenpbx_la-expr.o): In function `sqlite3ExprDelete':
/usr/src/AutoMakeTest/sqlite3-embedded/expr.c:374: undefined reference to `_sqli
te3FreeX'
/usr/src/AutoMakeTest/sqlite3-embedded/expr.c:375: undefined reference to `_sqli
te3FreeX'
../.libs/libopenpbx.a(libopenpbx_la-expr.o): In function `sqlite3ExprListDelete'
:
/usr/src/AutoMakeTest/sqlite3-embedded/expr.c:616: undefined reference to `_sqli
te3FreeX'
/usr/src/AutoMakeTest/sqlite3-embedded/expr.c:618: undefined reference to `_sqli
te3FreeX'
../.libs/libopenpbx.a(libopenpbx_la-expr.o): In function `sqlite3ExprFunction':
/usr/src/AutoMakeTest/sqlite3-embedded/expr.c:283: undefined reference to `_sqli
te3Malloc'
../.libs/libopenpbx.a(libopenpbx_la-expr.o): In function `sqlite3Expr':
/usr/src/AutoMakeTest/sqlite3-embedded/expr.c:191: undefined reference to `_sqli
te3Malloc'
../.libs/libopenpbx.a(libopenpbx_la-expr.o): In function `sqlite3RegisterExpr':
/usr/src/AutoMakeTest/sqlite3-embedded/expr.c:240: undefined reference to `_sqli
te3VdbeAddOp'
/usr/src/AutoMakeTest/sqlite3-embedded/expr.c:241: undefined reference to `_sqli
te3VdbeAddOp'
/usr/src/AutoMakeTest/sqlite3-embedded/expr.c:230: undefined reference to `_sqli
te3ErrorMsg'
../.libs/libopenpbx.a(libopenpbx_la-expr.o): In function `sqlite3TokenCopy':
/usr/src/AutoMakeTest/sqlite3-embedded/expr.c:432: undefined reference to `_sqli
te3FreeX'
/usr/src/AutoMakeTest/sqlite3-embedded/expr.c:435: undefined reference to `_sqli
te3StrNDup'
../.libs/libopenpbx.a(libopenpbx_la-expr.o): In function `sqlite3IdListDup':
/usr/src/AutoMakeTest/sqlite3-embedded/expr.c:515: undefined reference to `_sqli
te3MallocRaw'
/usr/src/AutoMakeTest/sqlite3-embedded/expr.c:518: undefined reference to `_sqli
te3MallocRaw'
/usr/src/AutoMakeTest/sqlite3-embedded/expr.c:526: undefined reference to `_sqli
te3StrDup'
/usr/src/AutoMakeTest/sqlite3-embedded/expr.c:520: undefined reference to `_sqli
te3FreeX'
../.libs/libopenpbx.a(libopenpbx_la-expr.o): In function `sqlite3SrcListDup':
/usr/src/AutoMakeTest/sqlite3-embedded/expr.c:488: undefined reference to `_sqli
te3MallocRaw'
/usr/src/AutoMakeTest/sqlite3-embedded/expr.c:495: undefined reference to `_sqli
te3StrDup'
/usr/src/AutoMakeTest/sqlite3-embedded/expr.c:496: undefined reference to `_sqli
te3StrDup'
/usr/src/AutoMakeTest/sqlite3-embedded/expr.c:497: undefined reference to `_sqli
te3StrDup'
../.libs/libopenpbx.a(libopenpbx_la-expr.o): In function `sqlite3SelectDup':
/usr/src/AutoMakeTest/sqlite3-embedded/expr.c:534: undefined reference to `_sqli
te3MallocRaw'
../.libs/libopenpbx.a(libopenpbx_la-expr.o): In function `sqlite3ExprDup':
/usr/src/AutoMakeTest/sqlite3-embedded/expr.c:414: undefined reference to `_sqli
te3MallocRaw'
/usr/src/AutoMakeTest/sqlite3-embedded/expr.c:418: undefined reference to `_sqli
te3StrNDup'
../.libs/libopenpbx.a(libopenpbx_la-expr.o): In function `sqlite3ExprListDup':
/usr/src/AutoMakeTest/sqlite3-embedded/expr.c:446: undefined reference to `_sqli
te3Malloc'
/usr/src/AutoMakeTest/sqlite3-embedded/expr.c:449: undefined reference to `_sqli
te3Malloc'
/usr/src/AutoMakeTest/sqlite3-embedded/expr.c:466: undefined reference to `_sqli
te3StrDup'
/usr/src/AutoMakeTest/sqlite3-embedded/expr.c:451: undefined reference to `_sqli
te3FreeX'
../.libs/libopenpbx.a(libopenpbx_la-expr.o): In function `sqlite3ExprListAppend'
:
/usr/src/AutoMakeTest/sqlite3-embedded/expr.c:582: undefined reference to `_sqli
te3Realloc'
/usr/src/AutoMakeTest/sqlite3-embedded/expr.c:573: undefined reference to `_sqli
te3Malloc'
../.libs/libopenpbx.a(libopenpbx_la-expr.o): In function `sqlite3ExprIsInteger':

/usr/src/AutoMakeTest/sqlite3-embedded/expr.c:755: undefined reference to `_sqli
te3GetInt32'
../.libs/libopenpbx.a(libopenpbx_la-expr.o): In function `sqlite3IsRowid':
/usr/src/AutoMakeTest/sqlite3-embedded/expr.c:780: undefined reference to `_sqli
te3StrICmp'
/usr/src/AutoMakeTest/sqlite3-embedded/expr.c:781: undefined reference to `_sqli
te3StrICmp'
/usr/src/AutoMakeTest/sqlite3-embedded/expr.c:782: undefined reference to `_sqli
te3StrICmp'
../.libs/libopenpbx.a(libopenpbx_la-expr.o): In function `lookupName':
/usr/src/AutoMakeTest/sqlite3-embedded/expr.c:834: undefined reference to `_sqli
te3_malloc_failed'
/usr/src/AutoMakeTest/sqlite3-embedded/expr.c:857: undefined reference to `_sqli
te3StrICmp'
/usr/src/AutoMakeTest/sqlite3-embedded/expr.c:858: undefined reference to `_sqli
te3StrICmp'
/usr/src/AutoMakeTest/sqlite3-embedded/expr.c:858: undefined reference to `_sqli
te3StrICmp'
/usr/src/AutoMakeTest/sqlite3-embedded/expr.c:869: undefined reference to `_sqli
te3StrICmp'
/usr/src/AutoMakeTest/sqlite3-embedded/expr.c:891: undefined reference to `_sqli
te3StrICmp'
../.libs/libopenpbx.a(libopenpbx_la-expr.o):/usr/src/AutoMakeTest/sqlite3-embedd
ed/expr.c:911: more undefined references to `_sqlite3StrICmp' follow
../.libs/libopenpbx.a(libopenpbx_la-expr.o): In function `lookupName':
/usr/src/AutoMakeTest/sqlite3-embedded/expr.c:1009: undefined reference to `_sql
ite3SetString'
/usr/src/AutoMakeTest/sqlite3-embedded/expr.c:1015: undefined reference to `_sql
ite3ErrorMsg'
/usr/src/AutoMakeTest/sqlite3-embedded/expr.c:1016: undefined reference to `_sql
ite3FreeX'
/usr/src/AutoMakeTest/sqlite3-embedded/expr.c:1038: undefined reference to `_sql
ite3FreeX'
/usr/src/AutoMakeTest/sqlite3-embedded/expr.c:1039: undefined reference to `_sql
ite3FreeX'
/usr/src/AutoMakeTest/sqlite3-embedded/expr.c:1046: undefined reference to `_sql
ite3FreeX'
/usr/src/AutoMakeTest/sqlite3-embedded/expr.c:915: undefined reference to `_sqli
te3StrICmp'
/usr/src/AutoMakeTest/sqlite3-embedded/expr.c:965: undefined reference to `_sqli
te3StrICmp'
/usr/src/AutoMakeTest/sqlite3-embedded/expr.c:1011: undefined reference to `_sql
ite3SetString'
/usr/src/AutoMakeTest/sqlite3-embedded/expr.c:996: undefined reference to `_sqli
te3FreeX'
/usr/src/AutoMakeTest/sqlite3-embedded/expr.c:1013: undefined reference to `_sql
ite3StrDup'
../.libs/libopenpbx.a(libopenpbx_la-expr.o): In function `nameResolverStep':
/usr/src/AutoMakeTest/sqlite3-embedded/expr.c:1175: undefined reference to `_sql
ite3ErrorMsg'
/usr/src/AutoMakeTest/sqlite3-embedded/expr.c:1168: undefined reference to `_sql
ite3ErrorMsg'
../.libs/libopenpbx.a(libopenpbx_la-expr.o): In function `codeInteger':
/usr/src/AutoMakeTest/sqlite3-embedded/expr.c:1425: undefined reference to `_sql
ite3GetInt32'
/usr/src/AutoMakeTest/sqlite3-embedded/expr.c:1426: undefined reference to `_sql
ite3VdbeAddOp'
/usr/src/AutoMakeTest/sqlite3-embedded/expr.c:1427: undefined reference to `_sql
ite3FitsIn64Bits'
/usr/src/AutoMakeTest/sqlite3-embedded/expr.c:1430: undefined reference to `_sql
ite3VdbeOp3'
../.libs/libopenpbx.a(libopenpbx_la-expr.o): In function `sqlite3ExprCode':
/usr/src/AutoMakeTest/sqlite3-embedded/expr.c:1750: undefined reference to `_sql
ite3VdbeResolveLabel'
/usr/src/AutoMakeTest/sqlite3-embedded/expr.c:1770: undefined reference to `_sql
ite3VdbeAddOp'
/usr/src/AutoMakeTest/sqlite3-embedded/expr.c:1469: undefined reference to `_sql
ite3VdbeAddOp'
/usr/src/AutoMakeTest/sqlite3-embedded/expr.c:1470: undefined reference to `_sql
ite3ColumnDefault'
/usr/src/AutoMakeTest/sqlite3-embedded/expr.c:1609: undefined reference to `_sql
ite3VdbeAddOp'
/usr/src/AutoMakeTest/sqlite3-embedded/expr.c:1611: undefined reference to `_sql
ite3VdbeCurrentAddr'
/usr/src/AutoMakeTest/sqlite3-embedded/expr.c:1683: undefined reference to `_sql
ite3VdbeAddOp'
/usr/src/AutoMakeTest/sqlite3-embedded/expr.c:1765: undefined reference to `_sql
ite3VdbeOp3'
/usr/src/AutoMakeTest/sqlite3-embedded/expr.c:1694: undefined reference to `_sql
ite3VdbeAddOp'
/usr/src/AutoMakeTest/sqlite3-embedded/expr.c:1697: undefined reference to `_sql
ite3VdbeAddOp'
/usr/src/AutoMakeTest/sqlite3-embedded/expr.c:1671: undefined reference to `_sql
ite3VdbeAddOp'
/usr/src/AutoMakeTest/sqlite3-embedded/expr.c:1677: undefined reference to `_sql
ite3VdbeCurrentAddr'
/usr/src/AutoMakeTest/sqlite3-embedded/expr.c:1678: undefined reference to `_sql
ite3VdbeAddOp'
/usr/src/AutoMakeTest/sqlite3-embedded/expr.c:1679: undefined reference to `_sql
ite3VdbeAddOp'
/usr/src/AutoMakeTest/sqlite3-embedded/expr.c:1680: undefined reference to `_sql
ite3VdbeAddOp'
/usr/src/AutoMakeTest/sqlite3-embedded/expr.c:1681: undefined reference to `_sql
ite3VdbeAddOp'
/usr/src/AutoMakeTest/sqlite3-embedded/expr.c:1682: undefined reference to `_sql
ite3VdbeOp3'
/usr/src/AutoMakeTest/sqlite3-embedded/expr.c:1508: undefined reference to `_sql
ite3VdbeAddOp'
/usr/src/AutoMakeTest/sqlite3-embedded/expr.c:1510: undefined reference to `_sql
ite3VdbeChangeP3'
/usr/src/AutoMakeTest/sqlite3-embedded/expr.c:1724: undefined reference to `_sql
ite3VdbeMakeLabel'
/usr/src/AutoMakeTest/sqlite3-embedded/expr.c:1731: undefined reference to `_sql
ite3VdbeAddOp'
/usr/src/AutoMakeTest/sqlite3-embedded/expr.c:1734: undefined reference to `_sql
ite3VdbeAddOp'
/usr/src/AutoMakeTest/sqlite3-embedded/expr.c:1739: undefined reference to `_sql
ite3VdbeAddOp'
/usr/src/AutoMakeTest/sqlite3-embedded/expr.c:1740: undefined reference to `_sql
ite3VdbeJumpHere'
/usr/src/AutoMakeTest/sqlite3-embedded/expr.c:1736: undefined reference to `_sql
ite3VdbeAddOp'
/usr/src/AutoMakeTest/sqlite3-embedded/expr.c:1584: undefined reference to `_sql
ite3Malloc'
/usr/src/AutoMakeTest/sqlite3-embedded/expr.c:1591: undefined reference to `_sql
ite3FreeX'
/usr/src/AutoMakeTest/sqlite3-embedded/expr.c:1647: undefined reference to `_sql
ite3VdbeOp3'
/usr/src/AutoMakeTest/sqlite3-embedded/expr.c:1748: undefined reference to `_sql
ite3VdbeAddOp'
/usr/src/AutoMakeTest/sqlite3-embedded/expr.c:1743: undefined reference to `_sql
ite3VdbeAddOp'
/usr/src/AutoMakeTest/sqlite3-embedded/expr.c:1756: undefined reference to `_sql
ite3ErrorMsg'
/usr/src/AutoMakeTest/sqlite3-embedded/expr.c:1769: undefined reference to `_sql
ite3VdbeAddOp'
/usr/src/AutoMakeTest/sqlite3-embedded/expr.c:1587: undefined reference to `_sql
ite3VdbeOp3'
../.libs/libopenpbx.a(libopenpbx_la-expr.o): In function `sqlite3CodeSubselect':

/usr/src/AutoMakeTest/sqlite3-embedded/expr.c:1294: undefined reference to `_sql
ite3VdbeAddOp'
/usr/src/AutoMakeTest/sqlite3-embedded/expr.c:1295: undefined reference to `_sql
ite3VdbeAddOp'
/usr/src/AutoMakeTest/sqlite3-embedded/expr.c:1297: undefined reference to `_sql
ite3VdbeAddOp'
/usr/src/AutoMakeTest/sqlite3-embedded/expr.c:1413: undefined reference to `_sql
ite3VdbeJumpHere'
/usr/src/AutoMakeTest/sqlite3-embedded/expr.c:1322: undefined reference to `_sql
ite3VdbeAddOp'
/usr/src/AutoMakeTest/sqlite3-embedded/expr.c:1325: undefined reference to `_sql
ite3VdbeAddOp'
/usr/src/AutoMakeTest/sqlite3-embedded/expr.c:1379: undefined reference to `_sql
ite3VdbeOp3'
/usr/src/AutoMakeTest/sqlite3-embedded/expr.c:1380: undefined reference to `_sql
ite3VdbeAddOp'
/usr/src/AutoMakeTest/sqlite3-embedded/expr.c:1369: undefined reference to `_sql
ite3VdbeGetOp'
/usr/src/AutoMakeTest/sqlite3-embedded/expr.c:1383: undefined reference to `_sql
ite3VdbeChangeP3'
../.libs/libopenpbx.a(libopenpbx_la-expr.o): In function `sqlite3ExprCodeAndCach
e':
/usr/src/AutoMakeTest/sqlite3-embedded/expr.c:1795: undefined reference to `_sql
ite3VdbeCurrentAddr'
/usr/src/AutoMakeTest/sqlite3-embedded/expr.c:1797: undefined reference to `_sql
ite3VdbeCurrentAddr'
/usr/src/AutoMakeTest/sqlite3-embedded/expr.c:1800: undefined reference to `_sql
ite3VdbeAddOp'
/usr/src/AutoMakeTest/sqlite3-embedded/expr.c:1798: undefined reference to `_sql
ite3VdbeGetOp'
../.libs/libopenpbx.a(libopenpbx_la-expr.o): In function `sqlite3ExprIfTrue':
/usr/src/AutoMakeTest/sqlite3-embedded/expr.c:1847: undefined reference to `_sql
ite3VdbeMakeLabel'
/usr/src/AutoMakeTest/sqlite3-embedded/expr.c:1898: undefined reference to `_sql
ite3VdbeAddOp'
/usr/src/AutoMakeTest/sqlite3-embedded/expr.c:1906: undefined reference to `_sql
ite3VdbeAddOp'
/usr/src/AutoMakeTest/sqlite3-embedded/expr.c:1907: undefined reference to `_sql
ite3VdbeJumpHere'
../.libs/libopenpbx.a(libopenpbx_la-expr.o): In function `sqlite3ExprIfFalse':
/usr/src/AutoMakeTest/sqlite3-embedded/expr.c:1970: undefined reference to `_sql
ite3VdbeMakeLabel'
/usr/src/AutoMakeTest/sqlite3-embedded/expr.c:2008: undefined reference to `_sql
ite3VdbeAddOp'
/usr/src/AutoMakeTest/sqlite3-embedded/expr.c:2010: undefined reference to `_sql
ite3VdbeCurrentAddr'
/usr/src/AutoMakeTest/sqlite3-embedded/expr.c:2013: undefined reference to `_sql
ite3VdbeAddOp'
/usr/src/AutoMakeTest/sqlite3-embedded/expr.c:2014: undefined reference to `_sql
ite3VdbeAddOp'
../.libs/libopenpbx.a(libopenpbx_la-expr.o): In function `sqlite3ExprCompare':
/usr/src/AutoMakeTest/sqlite3-embedded/expr.c:2059: undefined reference to `_sql
ite3StrNICmp'
../.libs/libopenpbx.a(libopenpbx_la-expr.o): In function `sqlite3ExprDelete':
/usr/src/AutoMakeTest/sqlite3-embedded/expr.c:380: undefined reference to `_sqli
te3FreeX'
../.libs/libopenpbx.a(libopenpbx_la-expr.o): In function `sqlite3ExprListDelete'
:
/usr/src/AutoMakeTest/sqlite3-embedded/expr.c:619: undefined reference to `_sqli
te3FreeX'
../.libs/libopenpbx.a(libopenpbx_la-expr.o): In function `sqlite3DequoteExpr':
/usr/src/AutoMakeTest/sqlite3-embedded/expr.c:395: undefined reference to `_sqli
te3Dequote'
../.libs/libopenpbx.a(libopenpbx_la-expr.o): In function `sqlite3ExprIfTrue':
/usr/src/AutoMakeTest/sqlite3-embedded/expr.c:1913: undefined reference to `_sql
ite3VdbeAddOp'
/usr/src/AutoMakeTest/sqlite3-embedded/expr.c:1850: undefined reference to `_sql
ite3VdbeResolveLabel'
/usr/src/AutoMakeTest/sqlite3-embedded/expr.c:1913: undefined reference to `_sql
ite3VdbeAddOp'
/usr/src/AutoMakeTest/sqlite3-embedded/expr.c:1913: undefined reference to `_sql
ite3VdbeAddOp'
../.libs/libopenpbx.a(libopenpbx_la-expr.o): In function `sqlite3ExprIfFalse':
/usr/src/AutoMakeTest/sqlite3-embedded/expr.c:2022: undefined reference to `_sql
ite3VdbeAddOp'
/usr/src/AutoMakeTest/sqlite3-embedded/expr.c:1973: undefined reference to `_sql
ite3VdbeResolveLabel'
/usr/src/AutoMakeTest/sqlite3-embedded/expr.c:2022: undefined reference to `_sql
ite3VdbeAddOp'
../.libs/libopenpbx.a(libopenpbx_la-func.o): In function `minmaxFunc':
/usr/src/AutoMakeTest/sqlite3-embedded/func.c:50: undefined reference to `_sqlit
e3_user_data'
/usr/src/AutoMakeTest/sqlite3-embedded/func.c:55: undefined reference to `_sqlit
e3_value_type'
/usr/src/AutoMakeTest/sqlite3-embedded/func.c:57: undefined reference to `_sqlit
e3_value_type'
/usr/src/AutoMakeTest/sqlite3-embedded/func.c:58: undefined reference to `_sqlit
e3MemCompare'
../.libs/libopenpbx.a(libopenpbx_la-func.o): In function `typeofFunc':
/usr/src/AutoMakeTest/sqlite3-embedded/func.c:74: undefined reference to `_sqlit
e3_value_type'
/usr/src/AutoMakeTest/sqlite3-embedded/func.c:81: undefined reference to `_sqlit
e3_result_text'
../.libs/libopenpbx.a(libopenpbx_la-func.o): In function `lengthFunc':
/usr/src/AutoMakeTest/sqlite3-embedded/func.c:96: undefined reference to `_sqlit
e3_value_type'
/usr/src/AutoMakeTest/sqlite3-embedded/func.c:100: undefined reference to `_sqli
te3_value_bytes'
/usr/src/AutoMakeTest/sqlite3-embedded/func.c:104: undefined reference to `_sqli
te3_value_text'
../.libs/libopenpbx.a(libopenpbx_la-func.o): In function `absFunc':
/usr/src/AutoMakeTest/sqlite3-embedded/func.c:121: undefined reference to `_sqli
te3_value_type'
/usr/src/AutoMakeTest/sqlite3-embedded/func.c:133: undefined reference to `_sqli
te3_value_double'
/usr/src/AutoMakeTest/sqlite3-embedded/func.c:123: undefined reference to `_sqli
te3_value_int64'
../.libs/libopenpbx.a(libopenpbx_la-func.o): In function `substrFunc':
/usr/src/AutoMakeTest/sqlite3-embedded/func.c:155: undefined reference to `_sqli
te3_value_text'
/usr/src/AutoMakeTest/sqlite3-embedded/func.c:157: undefined reference to `_sqli
te3_value_int'
/usr/src/AutoMakeTest/sqlite3-embedded/func.c:158: undefined reference to `_sqli
te3_value_int'
/usr/src/AutoMakeTest/sqlite3-embedded/func.c:181: undefined reference to `_sqli
te3_result_text'
../.libs/libopenpbx.a(libopenpbx_la-func.o): In function `roundFunc':
/usr/src/AutoMakeTest/sqlite3-embedded/func.c:198: undefined reference to `_sqli
te3_value_type'
/usr/src/AutoMakeTest/sqlite3-embedded/func.c:199: undefined reference to `_sqli
te3_value_double'
/usr/src/AutoMakeTest/sqlite3-embedded/func.c:201: undefined reference to `_sqli
te3_result_text'
/usr/src/AutoMakeTest/sqlite3-embedded/func.c:193: undefined reference to `_sqli
te3_value_type'
/usr/src/AutoMakeTest/sqlite3-embedded/func.c:194: undefined reference to `_sqli
te3_value_int'
../.libs/libopenpbx.a(libopenpbx_la-func.o): In function `upperFunc':
/usr/src/AutoMakeTest/sqlite3-embedded/func.c:210: undefined reference to `_sqli
te3_value_type'
/usr/src/AutoMakeTest/sqlite3-embedded/func.c:211: undefined reference to `_sqli
te3_value_bytes'
/usr/src/AutoMakeTest/sqlite3-embedded/func.c:211: undefined reference to `_sqli
te3Malloc'
/usr/src/AutoMakeTest/sqlite3-embedded/func.c:213: undefined reference to `_sqli
te3_value_text'
/usr/src/AutoMakeTest/sqlite3-embedded/func.c:217: undefined reference to `_sqli
te3_result_text'
../.libs/libopenpbx.a(libopenpbx_la-func.o): In function `lowerFunc':
/usr/src/AutoMakeTest/sqlite3-embedded/func.c:223: undefined reference to `_sqli
te3_value_type'
/usr/src/AutoMakeTest/sqlite3-embedded/func.c:224: undefined reference to `_sqli
te3_value_bytes'
/usr/src/AutoMakeTest/sqlite3-embedded/func.c:224: undefined reference to `_sqli
te3Malloc'
/usr/src/AutoMakeTest/sqlite3-embedded/func.c:226: undefined reference to `_sqli
te3_value_text'
/usr/src/AutoMakeTest/sqlite3-embedded/func.c:230: undefined reference to `_sqli
te3_result_text'
../.libs/libopenpbx.a(libopenpbx_la-func.o): In function `ifnullFunc':
/usr/src/AutoMakeTest/sqlite3-embedded/func.c:246: undefined reference to `_sqli
te3_value_type'
../.libs/libopenpbx.a(libopenpbx_la-func.o): In function `randomFunc':
/usr/src/AutoMakeTest/sqlite3-embedded/func.c:263: undefined reference to `_sqli
te3_result_int'
../.libs/libopenpbx.a(libopenpbx_la-func.o): In function `last_insert_rowid':
/usr/src/AutoMakeTest/sqlite3-embedded/func.c:275: undefined reference to `_sqli
te3_user_data'
../.libs/libopenpbx.a(libopenpbx_la-func.o): In function `changes':
/usr/src/AutoMakeTest/sqlite3-embedded/func.c:288: undefined reference to `_sqli
te3_user_data'
../.libs/libopenpbx.a(libopenpbx_la-func.o): In function `total_changes':
/usr/src/AutoMakeTest/sqlite3-embedded/func.c:301: undefined reference to `_sqli
te3_user_data'
../.libs/libopenpbx.a(libopenpbx_la-func.o): In function `patternCompare':
/usr/src/AutoMakeTest/sqlite3-embedded/func.c:451: undefined reference to `_sqli
te3UpperToLower'
/usr/src/AutoMakeTest/sqlite3-embedded/func.c:451: undefined reference to `_sqli
te3UpperToLower'
/usr/src/AutoMakeTest/sqlite3-embedded/func.c:446: undefined reference to `_sqli
te3ReadUtf8'
/usr/src/AutoMakeTest/sqlite3-embedded/func.c:421: undefined reference to `_sqli
te3ReadUtf8'
/usr/src/AutoMakeTest/sqlite3-embedded/func.c:441: undefined reference to `_sqli
te3ReadUtf8'
/usr/src/AutoMakeTest/sqlite3-embedded/func.c:441: undefined reference to `_sqli
te3ReadUtf8'
/usr/src/AutoMakeTest/sqlite3-embedded/func.c:432: undefined reference to `_sqli
te3ReadUtf8'
/usr/src/AutoMakeTest/sqlite3-embedded/func.c:400: undefined reference to `_sqli
te3UpperToLower'
/usr/src/AutoMakeTest/sqlite3-embedded/func.c:401: undefined reference to `_sqli
te3UpperToLower'
/usr/src/AutoMakeTest/sqlite3-embedded/func.c:402: undefined reference to `_sqli
te3UpperToLower'
/usr/src/AutoMakeTest/sqlite3-embedded/func.c:385: undefined reference to `_sqli
te3ReadUtf8'
../.libs/libopenpbx.a(libopenpbx_la-func.o): In function `likeFunc':
/usr/src/AutoMakeTest/sqlite3-embedded/func.c:490: undefined reference to `_sqli
te3_value_text'
/usr/src/AutoMakeTest/sqlite3-embedded/func.c:491: undefined reference to `_sqli
te3_value_text'
/usr/src/AutoMakeTest/sqlite3-embedded/func.c:506: undefined reference to `_sqli
te3_user_data'
/usr/src/AutoMakeTest/sqlite3-embedded/func.c:497: undefined reference to `_sqli
te3_value_text'
/usr/src/AutoMakeTest/sqlite3-embedded/func.c:498: undefined reference to `_sqli
te3utf8CharLen'
/usr/src/AutoMakeTest/sqlite3-embedded/func.c:503: undefined reference to `_sqli
te3ReadUtf8'
../.libs/libopenpbx.a(libopenpbx_la-func.o): In function `nullifFunc':
/usr/src/AutoMakeTest/sqlite3-embedded/func.c:525: undefined reference to `_sqli
te3MemCompare'
../.libs/libopenpbx.a(libopenpbx_la-func.o): In function `versionFunc':
/usr/src/AutoMakeTest/sqlite3-embedded/func.c:539: undefined reference to `_sqli
te3_result_text'
../.libs/libopenpbx.a(libopenpbx_la-func.o): In function `quoteFunc':
/usr/src/AutoMakeTest/sqlite3-embedded/func.c:556: undefined reference to `_sqli
te3_value_type'
/usr/src/AutoMakeTest/sqlite3-embedded/func.c:558: undefined reference to `_sqli
te3_result_text'
/usr/src/AutoMakeTest/sqlite3-embedded/func.c:572: undefined reference to `_sqli
te3_value_bytes'
/usr/src/AutoMakeTest/sqlite3-embedded/func.c:573: undefined reference to `_sqli
te3_value_blob'
/usr/src/AutoMakeTest/sqlite3-embedded/func.c:575: undefined reference to `_sqli
te3Malloc'
/usr/src/AutoMakeTest/sqlite3-embedded/func.c:610: undefined reference to `_sqli
te3_result_text'
/usr/src/AutoMakeTest/sqlite3-embedded/func.c:595: undefined reference to `_sqli
te3_value_text'
/usr/src/AutoMakeTest/sqlite3-embedded/func.c:599: undefined reference to `_sqli
te3Malloc'
../.libs/libopenpbx.a(libopenpbx_la-func.o): In function `sumStep':
/usr/src/AutoMakeTest/sqlite3-embedded/func.c:832: undefined reference to `_sqli
te3_aggregate_context'
/usr/src/AutoMakeTest/sqlite3-embedded/func.c:833: undefined reference to `_sqli
te3_value_type'
/usr/src/AutoMakeTest/sqlite3-embedded/func.c:835: undefined reference to `_sqli
te3_value_double'
../.libs/libopenpbx.a(libopenpbx_la-func.o): In function `sumFinalize':
/usr/src/AutoMakeTest/sqlite3-embedded/func.c:844: undefined reference to `_sqli
te3_aggregate_context'
/usr/src/AutoMakeTest/sqlite3-embedded/func.c:847: undefined reference to `_sqli
te3_result_double'
/usr/src/AutoMakeTest/sqlite3-embedded/func.c:849: undefined reference to `_sqli
te3_result_int64'
../.libs/libopenpbx.a(libopenpbx_la-func.o): In function `avgFinalize':
/usr/src/AutoMakeTest/sqlite3-embedded/func.c:855: undefined reference to `_sqli
te3_aggregate_context'
/usr/src/AutoMakeTest/sqlite3-embedded/func.c:857: undefined reference to `_sqli
te3_result_double'
../.libs/libopenpbx.a(libopenpbx_la-func.o): In function `countStep':
/usr/src/AutoMakeTest/sqlite3-embedded/func.c:886: undefined reference to `_sqli
te3_aggregate_context'
/usr/src/AutoMakeTest/sqlite3-embedded/func.c:887: undefined reference to `_sqli
te3_value_type'
../.libs/libopenpbx.a(libopenpbx_la-func.o): In function `countFinalize':
/usr/src/AutoMakeTest/sqlite3-embedded/func.c:893: undefined reference to `_sqli
te3_aggregate_context'
/usr/src/AutoMakeTest/sqlite3-embedded/func.c:894: undefined reference to `_sqli
te3_result_int'
../.libs/libopenpbx.a(libopenpbx_la-func.o): In function `minmaxStep':
/usr/src/AutoMakeTest/sqlite3-embedded/func.c:904: undefined reference to `_sqli
te3_value_type'
/usr/src/AutoMakeTest/sqlite3-embedded/func.c:905: undefined reference to `_sqli
te3_aggregate_context'
/usr/src/AutoMakeTest/sqlite3-embedded/func.c:920: undefined reference to `_sqli
te3_user_data'
/usr/src/AutoMakeTest/sqlite3-embedded/func.c:921: undefined reference to `_sqli
te3MemCompare'
../.libs/libopenpbx.a(libopenpbx_la-func.o): In function `minMaxFinalize':
/usr/src/AutoMakeTest/sqlite3-embedded/func.c:931: undefined reference to `_sqli
te3_aggregate_context'
/usr/src/AutoMakeTest/sqlite3-embedded/func.c:934: undefined reference to `_sqli
te3_result_value'
../.libs/libopenpbx.a(libopenpbx_la-func.o): In function `minmaxFunc':
/usr/src/AutoMakeTest/sqlite3-embedded/func.c:62: undefined reference to `_sqlit
e3_result_value'
../.libs/libopenpbx.a(libopenpbx_la-func.o): In function `lengthFunc':
/usr/src/AutoMakeTest/sqlite3-embedded/func.c:106: undefined reference to `_sqli
te3_result_int'
/usr/src/AutoMakeTest/sqlite3-embedded/func.c:110: undefined reference to `_sqli
te3_result_null'
/usr/src/AutoMakeTest/sqlite3-embedded/func.c:106: undefined reference to `_sqli
te3_result_int'
../.libs/libopenpbx.a(libopenpbx_la-func.o): In function `absFunc':
/usr/src/AutoMakeTest/sqlite3-embedded/func.c:135: undefined reference to `_sqli
te3_result_double'
/usr/src/AutoMakeTest/sqlite3-embedded/func.c:129: undefined reference to `_sqli
te3_result_null'
/usr/src/AutoMakeTest/sqlite3-embedded/func.c:125: undefined reference to `_sqli
te3_result_int64'
../.libs/libopenpbx.a(libopenpbx_la-func.o): In function `upperFunc':
/usr/src/AutoMakeTest/sqlite3-embedded/func.c:218: undefined reference to `_sqli
te3FreeX'
../.libs/libopenpbx.a(libopenpbx_la-func.o): In function `lowerFunc':
/usr/src/AutoMakeTest/sqlite3-embedded/func.c:231: undefined reference to `_sqli
te3FreeX'
../.libs/libopenpbx.a(libopenpbx_la-func.o): In function `ifnullFunc':
/usr/src/AutoMakeTest/sqlite3-embedded/func.c:247: undefined reference to `_sqli
te3_result_value'
../.libs/libopenpbx.a(libopenpbx_la-func.o): In function `last_insert_rowid':
/usr/src/AutoMakeTest/sqlite3-embedded/func.c:276: undefined reference to `_sqli
te3_result_int64'
../.libs/libopenpbx.a(libopenpbx_la-func.o): In function `changes':
/usr/src/AutoMakeTest/sqlite3-embedded/func.c:289: undefined reference to `_sqli
te3_result_int'
../.libs/libopenpbx.a(libopenpbx_la-func.o): In function `total_changes':
/usr/src/AutoMakeTest/sqlite3-embedded/func.c:302: undefined reference to `_sqli
te3_result_int'
../.libs/libopenpbx.a(libopenpbx_la-func.o): In function `likeFunc':
/usr/src/AutoMakeTest/sqlite3-embedded/func.c:510: undefined reference to `_sqli
te3_result_int'
/usr/src/AutoMakeTest/sqlite3-embedded/func.c:499: undefined reference to `_sqli
te3_result_error'
../.libs/libopenpbx.a(libopenpbx_la-func.o): In function `nullifFunc':
/usr/src/AutoMakeTest/sqlite3-embedded/func.c:526: undefined reference to `_sqli
te3_result_value'
../.libs/libopenpbx.a(libopenpbx_la-func.o): In function `quoteFunc':
/usr/src/AutoMakeTest/sqlite3-embedded/func.c:611: undefined reference to `_sqli
te3FreeX'
/usr/src/AutoMakeTest/sqlite3-embedded/func.c:563: undefined reference to `_sqli
te3_result_value'
/usr/src/AutoMakeTest/sqlite3-embedded/func.c:577: undefined reference to `_sqli
te3_result_error'
../.libs/libopenpbx.a(libopenpbx_la-func.o): In function `minmaxStep':
/usr/src/AutoMakeTest/sqlite3-embedded/func.c:926: undefined reference to `_sqli
te3VdbeMemCopy'
../.libs/libopenpbx.a(libopenpbx_la-func.o): In function `minMaxFinalize':
/usr/src/AutoMakeTest/sqlite3-embedded/func.c:936: undefined reference to `_sqli
te3VdbeMemRelease'
/usr/src/AutoMakeTest/sqlite3-embedded/func.c:936: undefined reference to `_sqli
te3VdbeMemRelease'
../.libs/libopenpbx.a(libopenpbx_la-func.o): In function `lengthFunc':
/usr/src/AutoMakeTest/sqlite3-embedded/func.c:114: undefined reference to `_sqli
te3utf16Substr'
../.libs/libopenpbx.a(libopenpbx_la-hash.o): In function `sqlite3HashClear':
/usr/src/AutoMakeTest/sqlite3-embedded/hash.c:64: undefined reference to `_sqlit
e3FreeX'
/usr/src/AutoMakeTest/sqlite3-embedded/hash.c:62: undefined reference to `_sqlit
e3FreeX'
/usr/src/AutoMakeTest/sqlite3-embedded/hash.c:56: undefined reference to `_sqlit
e3FreeX'
../.libs/libopenpbx.a(libopenpbx_la-hash.o): In function `strHash':
/usr/src/AutoMakeTest/sqlite3-embedded/hash.c:105: undefined reference to `_sqli
te3UpperToLower'
../.libs/libopenpbx.a(libopenpbx_la-hash.o): In function `rehash':
/usr/src/AutoMakeTest/sqlite3-embedded/hash.c:225: undefined reference to `_sqli
te3Malloc'
/usr/src/AutoMakeTest/sqlite3-embedded/hash.c:227: undefined reference to `_sqli
te3FreeX'
../.libs/libopenpbx.a(libopenpbx_la-hash.o): In function `sqlite3HashInsert':
/usr/src/AutoMakeTest/sqlite3-embedded/hash.c:356: undefined reference to `_sqli
te3Malloc'
/usr/src/AutoMakeTest/sqlite3-embedded/hash.c:295: undefined reference to `_sqli
te3FreeX'
/usr/src/AutoMakeTest/sqlite3-embedded/hash.c:359: undefined reference to `_sqli
te3MallocRaw'
/usr/src/AutoMakeTest/sqlite3-embedded/hash.c:374: undefined reference to `_sqli
te3FreeX'
/usr/src/AutoMakeTest/sqlite3-embedded/hash.c:293: undefined reference to `_sqli
te3FreeX'
../.libs/libopenpbx.a(libopenpbx_la-hash.o): In function `strCompare':
/usr/src/AutoMakeTest/sqlite3-embedded/hash.c:112: undefined reference to `_sqli
te3StrNICmp'
../.libs/libopenpbx.a(libopenpbx_la-insert.o): In function `sqlite3IndexAffinity
Str':
/usr/src/AutoMakeTest/sqlite3-embedded/insert.c:43: undefined reference to `_sql
ite3Malloc'
/usr/src/AutoMakeTest/sqlite3-embedded/insert.c:53: undefined reference to `_sql
ite3VdbeChangeP3'
../.libs/libopenpbx.a(libopenpbx_la-insert.o): In function `sqlite3TableAffinity
Str':
/usr/src/AutoMakeTest/sqlite3-embedded/insert.c:81: undefined reference to `_sql
ite3Malloc'
/usr/src/AutoMakeTest/sqlite3-embedded/insert.c:94: undefined reference to `_sql
ite3VdbeChangeP3'
../.libs/libopenpbx.a(libopenpbx_la-insert.o): In function `sqlite3OpenTableAndI
ndices':
/usr/src/AutoMakeTest/sqlite3-embedded/insert.c:1094: undefined reference to `_s
qlite3VdbeAddOp'
/usr/src/AutoMakeTest/sqlite3-embedded/insert.c:1096: undefined reference to `_s
qlite3VdbeAddOp'
/usr/src/AutoMakeTest/sqlite3-embedded/insert.c:1097: undefined reference to `_s
qlite3VdbeAddOp'
/usr/src/AutoMakeTest/sqlite3-embedded/insert.c:1099: undefined reference to `_s
qlite3VdbeAddOp'
/usr/src/AutoMakeTest/sqlite3-embedded/insert.c:1101: undefined reference to `_s
qlite3VdbeOp3'
../.libs/libopenpbx.a(libopenpbx_la-insert.o): In function `sqlite3CompleteInser
tion':
/usr/src/AutoMakeTest/sqlite3-embedded/insert.c:1056: undefined reference to `_s
qlite3VdbeAddOp'
/usr/src/AutoMakeTest/sqlite3-embedded/insert.c:1058: undefined reference to `_s
qlite3VdbeAddOp'
/usr/src/AutoMakeTest/sqlite3-embedded/insert.c:1062: undefined reference to `_s
qlite3VdbeAddOp'
/usr/src/AutoMakeTest/sqlite3-embedded/insert.c:1063: undefined reference to `_s
qlite3VdbeAddOp'
/usr/src/AutoMakeTest/sqlite3-embedded/insert.c:1064: undefined reference to `_s
qlite3VdbeAddOp'
../.libs/libopenpbx.a(libopenpbx_la-insert.o):/usr/src/AutoMakeTest/sqlite3-embe
dded/insert.c:1072: more undefined references to `_sqlite3VdbeAddOp' follow
../.libs/libopenpbx.a(libopenpbx_la-insert.o): In function `sqlite3GenerateConst
raintChecks':
/usr/src/AutoMakeTest/sqlite3-embedded/insert.c:852: undefined reference to `_sq
lite3SetString'
/usr/src/AutoMakeTest/sqlite3-embedded/insert.c:854: undefined reference to `_sq
lite3VdbeChangeP3'
/usr/src/AutoMakeTest/sqlite3-embedded/insert.c:868: undefined reference to `_sq
lite3VdbeJumpHere'
/usr/src/AutoMakeTest/sqlite3-embedded/insert.c:892: undefined reference to `_sq
lite3VdbeAddOp'
/usr/src/AutoMakeTest/sqlite3-embedded/insert.c:893: undefined reference to `_sq
lite3VdbeAddOp'
/usr/src/AutoMakeTest/sqlite3-embedded/insert.c:902: undefined reference to `_sq
lite3VdbeOp3'
/usr/src/AutoMakeTest/sqlite3-embedded/insert.c:922: undefined reference to `_sq
lite3VdbeJumpHere'
/usr/src/AutoMakeTest/sqlite3-embedded/insert.c:924: undefined reference to `_sq
lite3VdbeJumpHere'
/usr/src/AutoMakeTest/sqlite3-embedded/insert.c:925: undefined reference to `_sq
lite3VdbeAddOp'
/usr/src/AutoMakeTest/sqlite3-embedded/insert.c:926: undefined reference to `_sq
lite3VdbeAddOp'
/usr/src/AutoMakeTest/sqlite3-embedded/insert.c:940: undefined reference to `_sq
lite3VdbeAddOp'
/usr/src/AutoMakeTest/sqlite3-embedded/insert.c:946: undefined reference to `_sq
lite3VdbeAddOp'
/usr/src/AutoMakeTest/sqlite3-embedded/insert.c:946: undefined reference to `_sq
lite3VdbeAddOp'
../.libs/libopenpbx.a(libopenpbx_la-insert.o):/usr/src/AutoMakeTest/sqlite3-embe
dded/insert.c:949: more undefined references to `_sqlite3VdbeAddOp' follow
../.libs/libopenpbx.a(libopenpbx_la-insert.o): In function `sqlite3GenerateConst
raintChecks':
/usr/src/AutoMakeTest/sqlite3-embedded/insert.c:999: undefined reference to `_sq
lite3VdbeOp3'
/usr/src/AutoMakeTest/sqlite3-embedded/insert.c:1019: undefined reference to `_s
qlite3VdbeJumpHere'
/usr/src/AutoMakeTest/sqlite3-embedded/insert.c:1021: undefined reference to `_s
qlite3VdbeJumpHere'
/usr/src/AutoMakeTest/sqlite3-embedded/insert.c:864: undefined reference to `_sq
lite3VdbeAddOp'
/usr/src/AutoMakeTest/sqlite3-embedded/insert.c:858: undefined reference to `_sq
lite3VdbeAddOp'
/usr/src/AutoMakeTest/sqlite3-embedded/insert.c:864: undefined reference to `_sq
lite3VdbeAddOp'
/usr/src/AutoMakeTest/sqlite3-embedded/insert.c:1004: undefined reference to `_s
qlite3VdbeAddOp'
/usr/src/AutoMakeTest/sqlite3-embedded/insert.c:1005: undefined reference to `_s
qlite3VdbeAddOp'
../.libs/libopenpbx.a(libopenpbx_la-insert.o):/usr/src/AutoMakeTest/sqlite3-embe
dded/insert.c:888: more undefined references to `_sqlite3VdbeAddOp' follow
../.libs/libopenpbx.a(libopenpbx_la-insert.o): In function `sqlite3Insert':
/usr/src/AutoMakeTest/sqlite3-embedded/insert.c:225: undefined reference to `_sq
lite3_malloc_failed'
/usr/src/AutoMakeTest/sqlite3-embedded/insert.c:248: undefined reference to `_sq
lite3TriggersExist'
/usr/src/AutoMakeTest/sqlite3-embedded/insert.c:333: undefined reference to `_sq
lite3VdbeAddOp'
/usr/src/AutoMakeTest/sqlite3-embedded/insert.c:334: undefined reference to `_sq
lite3VdbeCurrentAddr'
/usr/src/AutoMakeTest/sqlite3-embedded/insert.c:335: undefined reference to `_sq
lite3VdbeMakeLabel'
/usr/src/AutoMakeTest/sqlite3-embedded/insert.c:339: undefined reference to `_sq
lite3_malloc_failed'
/usr/src/AutoMakeTest/sqlite3-embedded/insert.c:341: undefined reference to `_sq
lite3VdbeMakeLabel'
/usr/src/AutoMakeTest/sqlite3-embedded/insert.c:342: undefined reference to `_sq
lite3VdbeAddOp'
/usr/src/AutoMakeTest/sqlite3-embedded/insert.c:363: undefined reference to `_sq
lite3VdbeResolveLabel'
/usr/src/AutoMakeTest/sqlite3-embedded/insert.c:364: undefined reference to `_sq
lite3VdbeAddOp'
/usr/src/AutoMakeTest/sqlite3-embedded/insert.c:366: undefined reference to `_sq
lite3VdbeAddOp'
/usr/src/AutoMakeTest/sqlite3-embedded/insert.c:367: undefined reference to `_sq
lite3VdbeAddOp'
/usr/src/AutoMakeTest/sqlite3-embedded/insert.c:368: undefined reference to `_sq
lite3VdbeAddOp'
/usr/src/AutoMakeTest/sqlite3-embedded/insert.c:369: undefined reference to `_sq
lite3VdbeAddOp'
/usr/src/AutoMakeTest/sqlite3-embedded/insert.c:375: undefined reference to `_sq
lite3VdbeJumpHere'
/usr/src/AutoMakeTest/sqlite3-embedded/insert.c:376: undefined reference to `_sq
lite3VdbeAddOp'
/usr/src/AutoMakeTest/sqlite3-embedded/insert.c:377: undefined reference to `_sq
lite3VdbeAddOp'
/usr/src/AutoMakeTest/sqlite3-embedded/insert.c:378: undefined reference to `_sq
lite3VdbeAddOp'
/usr/src/AutoMakeTest/sqlite3-embedded/insert.c:379: undefined reference to `_sq
lite3VdbeResolveLabel'
/usr/src/AutoMakeTest/sqlite3-embedded/insert.c:433: undefined reference to `_sq
lite3StrICmp'
/usr/src/AutoMakeTest/sqlite3-embedded/insert.c:492: undefined reference to `_sq
lite3VdbeAddOp'
/usr/src/AutoMakeTest/sqlite3-embedded/insert.c:493: undefined reference to `_sq
lite3VdbeResolveLabel'
/usr/src/AutoMakeTest/sqlite3-embedded/insert.c:498: undefined reference to `_sq
lite3VdbeMakeLabel'
/usr/src/AutoMakeTest/sqlite3-embedded/insert.c:517: undefined reference to `_sq
lite3VdbeAddOp'
/usr/src/AutoMakeTest/sqlite3-embedded/insert.c:533: undefined reference to `_sq
lite3VdbeAddOp'
/usr/src/AutoMakeTest/sqlite3-embedded/insert.c:539: undefined reference to `_sq
lite3VdbeAddOp'
/usr/src/AutoMakeTest/sqlite3-embedded/insert.c:549: undefined reference to `_sq
lite3VdbeAddOp'
/usr/src/AutoMakeTest/sqlite3-embedded/insert.c:552: undefined reference to `_sq
lite3CodeRowTrigger'
/usr/src/AutoMakeTest/sqlite3-embedded/insert.c:576: undefined reference to `_sq
lite3VdbeAddOp'
/usr/src/AutoMakeTest/sqlite3-embedded/insert.c:583: undefined reference to `_sq
lite3VdbeCurrentAddr'
/usr/src/AutoMakeTest/sqlite3-embedded/insert.c:583: undefined reference to `_sq
lite3VdbeAddOp'
/usr/src/AutoMakeTest/sqlite3-embedded/insert.c:584: undefined reference to `_sq
lite3VdbeAddOp'
/usr/src/AutoMakeTest/sqlite3-embedded/insert.c:585: undefined reference to `_sq
lite3VdbeAddOp'
/usr/src/AutoMakeTest/sqlite3-embedded/insert.c:588: undefined reference to `_sq
lite3VdbeAddOp'
/usr/src/AutoMakeTest/sqlite3-embedded/insert.c:620: undefined reference to `_sq
lite3VdbeAddOp'
/usr/src/AutoMakeTest/sqlite3-embedded/insert.c:651: undefined reference to `_sq
lite3CodeRowTrigger'
/usr/src/AutoMakeTest/sqlite3-embedded/insert.c:659: undefined reference to `_sq
lite3VdbeResolveLabel'
/usr/src/AutoMakeTest/sqlite3-embedded/insert.c:665: undefined reference to `_sq
lite3VdbeAddOp'
/usr/src/AutoMakeTest/sqlite3-embedded/insert.c:666: undefined reference to `_sq
lite3VdbeAddOp'
/usr/src/AutoMakeTest/sqlite3-embedded/insert.c:667: undefined reference to `_sq
lite3VdbeResolveLabel'
/usr/src/AutoMakeTest/sqlite3-embedded/insert.c:707: undefined reference to `_sq
lite3VdbeAddOp'
/usr/src/AutoMakeTest/sqlite3-embedded/insert.c:708: undefined reference to `_sq
lite3VdbeAddOp'
/usr/src/AutoMakeTest/sqlite3-embedded/insert.c:709: undefined reference to `_sq
lite3VdbeSetNumCols'
/usr/src/AutoMakeTest/sqlite3-embedded/insert.c:710: undefined reference to `_sq
lite3VdbeSetColName'
/usr/src/AutoMakeTest/sqlite3-embedded/insert.c:301: undefined reference to `_sq
lite3VdbeCurrentAddr'
/usr/src/AutoMakeTest/sqlite3-embedded/insert.c:304: undefined reference to `_sq
lite3VdbeAddOp'
/usr/src/AutoMakeTest/sqlite3-embedded/insert.c:305: undefined reference to `_sq
lite3VdbeAddOp'
/usr/src/AutoMakeTest/sqlite3-embedded/insert.c:306: undefined reference to `_sq
lite3VdbeAddOp'
/usr/src/AutoMakeTest/sqlite3-embedded/insert.c:307: undefined reference to `_sq
lite3VdbeAddOp'
/usr/src/AutoMakeTest/sqlite3-embedded/insert.c:308: undefined reference to `_sq
lite3VdbeAddOp'
/usr/src/AutoMakeTest/sqlite3-embedded/insert.c:309: undefined reference to `_sq
lite3VdbeOp3'
/usr/src/AutoMakeTest/sqlite3-embedded/insert.c:310: undefined reference to `_sq
lite3VdbeAddOp'
/usr/src/AutoMakeTest/sqlite3-embedded/insert.c:311: undefined reference to `_sq
lite3VdbeAddOp'
/usr/src/AutoMakeTest/sqlite3-embedded/insert.c:312: undefined reference to `_sq
lite3VdbeAddOp'
/usr/src/AutoMakeTest/sqlite3-embedded/insert.c:313: undefined reference to `_sq
lite3VdbeAddOp'
/usr/src/AutoMakeTest/sqlite3-embedded/insert.c:314: undefined reference to `_sq
lite3VdbeAddOp'
../.libs/libopenpbx.a(libopenpbx_la-insert.o):/usr/src/AutoMakeTest/sqlite3-embe
dded/insert.c:315: more undefined references to `_sqlite3VdbeAddOp' follow
../.libs/libopenpbx.a(libopenpbx_la-insert.o): In function `sqlite3Insert':
/usr/src/AutoMakeTest/sqlite3-embedded/insert.c:285: undefined reference to `_sq
lite3VdbeCountChanges'
/usr/src/AutoMakeTest/sqlite3-embedded/insert.c:412: undefined reference to `_sq
lite3ErrorMsg'
/usr/src/AutoMakeTest/sqlite3-embedded/insert.c:406: undefined reference to `_sq
lite3ErrorMsg'
/usr/src/AutoMakeTest/sqlite3-embedded/insert.c:473: undefined reference to `_sq
lite3VdbeAddOp'
/usr/src/AutoMakeTest/sqlite3-embedded/insert.c:465: undefined reference to `_sq
lite3VdbeAddOp'
/usr/src/AutoMakeTest/sqlite3-embedded/insert.c:466: undefined reference to `_sq
lite3VdbeAddOp'
/usr/src/AutoMakeTest/sqlite3-embedded/insert.c:488: undefined reference to `_sq
lite3VdbeMakeLabel'
/usr/src/AutoMakeTest/sqlite3-embedded/insert.c:489: undefined reference to `_sq
lite3VdbeAddOp'
/usr/src/AutoMakeTest/sqlite3-embedded/insert.c:490: undefined reference to `_sq
lite3VdbeCurrentAddr'
/usr/src/AutoMakeTest/sqlite3-embedded/insert.c:638: undefined reference to `_sq
lite3VdbeAddOp'
/usr/src/AutoMakeTest/sqlite3-embedded/insert.c:445: undefined reference to `_sq
lite3ErrorMsg'
/usr/src/AutoMakeTest/sqlite3-embedded/insert.c:514: undefined reference to `_sq
lite3VdbeCurrentAddr'
/usr/src/AutoMakeTest/sqlite3-embedded/insert.c:514: undefined reference to `_sq
lite3VdbeAddOp'
/usr/src/AutoMakeTest/sqlite3-embedded/insert.c:515: undefined reference to `_sq
lite3VdbeAddOp'
/usr/src/AutoMakeTest/sqlite3-embedded/insert.c:516: undefined reference to `_sq
lite3VdbeAddOp'
/usr/src/AutoMakeTest/sqlite3-embedded/insert.c:661: undefined reference to `_sq
lite3VdbeAddOp'
/usr/src/AutoMakeTest/sqlite3-embedded/insert.c:662: undefined reference to `_sq
lite3VdbeResolveLabel'
/usr/src/AutoMakeTest/sqlite3-embedded/insert.c:663: undefined reference to `_sq
lite3VdbeAddOp'
/usr/src/AutoMakeTest/sqlite3-embedded/insert.c:685: undefined reference to `_sq
lite3VdbeCurrentAddr'
/usr/src/AutoMakeTest/sqlite3-embedded/insert.c:686: undefined reference to `_sq
lite3VdbeAddOp'
/usr/src/AutoMakeTest/sqlite3-embedded/insert.c:687: undefined reference to `_sq
lite3VdbeAddOp'
/usr/src/AutoMakeTest/sqlite3-embedded/insert.c:688: undefined reference to `_sq
lite3VdbeAddOp'
/usr/src/AutoMakeTest/sqlite3-embedded/insert.c:689: undefined reference to `_sq
lite3VdbeAddOp'
/usr/src/AutoMakeTest/sqlite3-embedded/insert.c:690: undefined reference to `_sq
lite3VdbeAddOp'
../.libs/libopenpbx.a(libopenpbx_la-insert.o):/usr/src/AutoMakeTest/sqlite3-embe
dded/insert.c:691: more undefined references to `_sqlite3VdbeAddOp' follow
../.libs/libopenpbx.a(libopenpbx_la-insert.o): In function `sqlite3Insert':
/usr/src/AutoMakeTest/sqlite3-embedded/insert.c:693: undefined reference to `_sq
lite3VdbeOp3'
/usr/src/AutoMakeTest/sqlite3-embedded/insert.c:694: undefined reference to `_sq
lite3VdbeAddOp'
/usr/src/AutoMakeTest/sqlite3-embedded/insert.c:695: undefined reference to `_sq
lite3VdbeAddOp'
/usr/src/AutoMakeTest/sqlite3-embedded/insert.c:696: undefined reference to `_sq
lite3VdbeAddOp'
/usr/src/AutoMakeTest/sqlite3-embedded/insert.c:697: undefined reference to `_sq
lite3VdbeAddOp'
/usr/src/AutoMakeTest/sqlite3-embedded/insert.c:672: undefined reference to `_sq
lite3VdbeAddOp'
../.libs/libopenpbx.a(libopenpbx_la-insert.o):/usr/src/AutoMakeTest/sqlite3-embe
dded/insert.c:674: more undefined references to `_sqlite3VdbeAddOp' follow
../.libs/libopenpbx.a(libopenpbx_la-insert.o): In function `sqlite3Insert':
/usr/src/AutoMakeTest/sqlite3-embedded/insert.c:381: undefined reference to `_sq
lite3VdbeJumpHere'
../.libs/libopenpbx.a(libopenpbx_la-insert.o): In function `sqlite3CompleteInser
tion':
/usr/src/AutoMakeTest/sqlite3-embedded/insert.c:1075: undefined reference to `_s
qlite3VdbeAddOp'
../.libs/libopenpbx.a(libopenpbx_la-legacy.o): In function `sqlite3_exec':
/usr/src/AutoMakeTest/sqlite3-embedded/legacy.c:56: undefined reference to `_sql
ite3_prepare'
/usr/src/AutoMakeTest/sqlite3-embedded/legacy.c:123: undefined reference to `_sq
lite3FreeX'
/usr/src/AutoMakeTest/sqlite3-embedded/legacy.c:125: undefined reference to `_sq
lite3_malloc_failed'
/usr/src/AutoMakeTest/sqlite3-embedded/legacy.c:70: undefined reference to `_sql
ite3_column_count'
/usr/src/AutoMakeTest/sqlite3-embedded/legacy.c:71: undefined reference to `_sql
ite3Malloc'
/usr/src/AutoMakeTest/sqlite3-embedded/legacy.c:79: undefined reference to `_sql
ite3_step'
/usr/src/AutoMakeTest/sqlite3-embedded/legacy.c:86: undefined reference to `_sql
ite3_column_name'
/usr/src/AutoMakeTest/sqlite3-embedded/legacy.c:117: undefined reference to `_sq
lite3FreeX'
/usr/src/AutoMakeTest/sqlite3-embedded/legacy.c:93: undefined reference to `_sql
ite3_column_text'
../.libs/libopenpbx.a(libopenpbx_la-sqlite3main.o): In function `sqlite3GetTrans
ientValue':
/usr/src/AutoMakeTest/sqlite3-embedded/sqlite3main.c:45: undefined reference to
`_sqlite3ValueNew'
../.libs/libopenpbx.a(libopenpbx_la-sqlite3main.o): In function `nocaseCollating
Func':
/usr/src/AutoMakeTest/sqlite3-embedded/sqlite3main.c:91: undefined reference to
`_sqlite3StrNICmp'
../.libs/libopenpbx.a(libopenpbx_la-sqlite3main.o): In function `sqlite3_close':

/usr/src/AutoMakeTest/sqlite3-embedded/sqlite3main.c:130: undefined reference to
 `_sqlite3SafetyCheck'
/usr/src/AutoMakeTest/sqlite3-embedded/sqlite3main.c:151: undefined reference to
 `_sqlite3SafetyOn'
/usr/src/AutoMakeTest/sqlite3-embedded/sqlite3main.c:170: undefined reference to
 `_sqlite3FreeX'
/usr/src/AutoMakeTest/sqlite3-embedded/sqlite3main.c:176: undefined reference to
 `_sqlite3FreeX'
/usr/src/AutoMakeTest/sqlite3-embedded/sqlite3main.c:181: undefined reference to
 `_sqlite3Error'
/usr/src/AutoMakeTest/sqlite3-embedded/sqlite3main.c:208: undefined reference to
 `_sqlite3FreeX'
/usr/src/AutoMakeTest/sqlite3-embedded/sqlite3main.c:186: undefined reference to
 `_sqlite3ValueFree'
/usr/src/AutoMakeTest/sqlite3-embedded/sqlite3main.c:183: undefined reference to
 `_sqlite3ValueFree'
/usr/src/AutoMakeTest/sqlite3-embedded/sqlite3main.c:140: undefined reference to
 `_sqlite3Error'
../.libs/libopenpbx.a(libopenpbx_la-sqlite3main.o): In function `sqlite3_busy_ha
ndler':
/usr/src/AutoMakeTest/sqlite3-embedded/sqlite3main.c:335: undefined reference to
 `_sqlite3SafetyCheck'
../.libs/libopenpbx.a(libopenpbx_la-sqlite3main.o): In function `sqlite3_progres
s_handler':
/usr/src/AutoMakeTest/sqlite3-embedded/sqlite3main.c:356: undefined reference to
 `_sqlite3SafetyCheck'
../.libs/libopenpbx.a(libopenpbx_la-sqlite3main.o): In function `sqlite3_interru
pt':
/usr/src/AutoMakeTest/sqlite3-embedded/sqlite3main.c:389: undefined reference to
 `_sqlite3SafetyCheck'
../.libs/libopenpbx.a(libopenpbx_la-sqlite3main.o): In function `sqlite3_create_
function':
/usr/src/AutoMakeTest/sqlite3-embedded/sqlite3main.c:420: undefined reference to
 `_sqlite3SafetyCheck'
/usr/src/AutoMakeTest/sqlite3-embedded/sqlite3main.c:468: undefined reference to
 `_sqlite3ExpirePreparedStatements'
/usr/src/AutoMakeTest/sqlite3-embedded/sqlite3main.c:464: undefined reference to
 `_sqlite3Error'
../.libs/libopenpbx.a(libopenpbx_la-sqlite3main.o): In function `sqlite3_create_
function16':
/usr/src/AutoMakeTest/sqlite3-embedded/sqlite3main.c:496: undefined reference to
 `_sqlite3SafetyCheck'
/usr/src/AutoMakeTest/sqlite3-embedded/sqlite3main.c:500: undefined reference to
 `_sqlite3ValueSetStr'
/usr/src/AutoMakeTest/sqlite3-embedded/sqlite3main.c:501: undefined reference to
 `_sqlite3ValueText'
../.libs/libopenpbx.a(libopenpbx_la-sqlite3main.o): In function `sqlite3_errmsg'
:
/usr/src/AutoMakeTest/sqlite3-embedded/sqlite3main.c:638: undefined reference to
 `_sqlite3_malloc_failed'
/usr/src/AutoMakeTest/sqlite3-embedded/sqlite3main.c:641: undefined reference to
 `_sqlite3SafetyCheck'
/usr/src/AutoMakeTest/sqlite3-embedded/sqlite3main.c:644: undefined reference to
 `_sqlite3_value_text'
../.libs/libopenpbx.a(libopenpbx_la-sqlite3main.o): In function `sqlite3_errmsg1
6':
/usr/src/AutoMakeTest/sqlite3-embedded/sqlite3main.c:677: undefined reference to
 `_sqlite3_malloc_failed'
/usr/src/AutoMakeTest/sqlite3-embedded/sqlite3main.c:680: undefined reference to
 `_sqlite3SafetyCheck'
/usr/src/AutoMakeTest/sqlite3-embedded/sqlite3main.c:683: undefined reference to
 `_sqlite3_value_text16'
/usr/src/AutoMakeTest/sqlite3-embedded/sqlite3main.c:685: undefined reference to
 `_sqlite3ValueSetStr'
/usr/src/AutoMakeTest/sqlite3-embedded/sqlite3main.c:687: undefined reference to
 `_sqlite3_value_text16'
../.libs/libopenpbx.a(libopenpbx_la-sqlite3main.o): In function `sqlite3_errcode
':
/usr/src/AutoMakeTest/sqlite3-embedded/sqlite3main.c:697: undefined reference to
 `_sqlite3_malloc_failed'
/usr/src/AutoMakeTest/sqlite3-embedded/sqlite3main.c:700: undefined reference to
 `_sqlite3SafetyCheck'
../.libs/libopenpbx.a(libopenpbx_la-sqlite3main.o): In function `sqlite3_create_
collation':
/usr/src/AutoMakeTest/sqlite3-embedded/sqlite3main.c:896: undefined reference to
 `_sqlite3SafetyCheck'
/usr/src/AutoMakeTest/sqlite3-embedded/sqlite3main.c:927: undefined reference to
 `_sqlite3ExpirePreparedStatements'
/usr/src/AutoMakeTest/sqlite3-embedded/sqlite3main.c:938: undefined reference to
 `_sqlite3Error'
/usr/src/AutoMakeTest/sqlite3-embedded/sqlite3main.c:909: undefined reference to
 `_sqlite3Error'
/usr/src/AutoMakeTest/sqlite3-embedded/sqlite3main.c:923: undefined reference to
 `_sqlite3Error'
../.libs/libopenpbx.a(libopenpbx_la-sqlite3main.o): In function `openDatabase':
/usr/src/AutoMakeTest/sqlite3-embedded/sqlite3main.c:720: undefined reference to
 `_sqlite3Malloc'
/usr/src/AutoMakeTest/sqlite3-embedded/sqlite3main.c:789: undefined reference to
 `_sqlite3_malloc_failed'
/usr/src/AutoMakeTest/sqlite3-embedded/sqlite3main.c:790: undefined reference to
 `_sqlite3Error'
/usr/src/AutoMakeTest/sqlite3-embedded/sqlite3main.c:785: undefined reference to
 `_sqlite3Error'
/usr/src/AutoMakeTest/sqlite3-embedded/sqlite3main.c:764: undefined reference to
 `_sqlite3Error'
../.libs/libopenpbx.a(libopenpbx_la-sqlite3main.o): In function `sqlite3_open16'
:
/usr/src/AutoMakeTest/sqlite3-embedded/sqlite3main.c:828: undefined reference to
 `_sqlite3ValueNew'
/usr/src/AutoMakeTest/sqlite3-embedded/sqlite3main.c:829: undefined reference to
 `_sqlite3ValueSetStr'
/usr/src/AutoMakeTest/sqlite3-embedded/sqlite3main.c:830: undefined reference to
 `_sqlite3ValueText'
/usr/src/AutoMakeTest/sqlite3-embedded/sqlite3main.c:838: undefined reference to
 `_sqlite3ValueFree'
../.libs/libopenpbx.a(libopenpbx_la-sqlite3main.o): In function `sqlite3_finaliz
e':
/usr/src/AutoMakeTest/sqlite3-embedded/sqlite3main.c:859: undefined reference to
 `_sqlite3VdbeFinalize'
../.libs/libopenpbx.a(libopenpbx_la-sqlite3main.o): In function `sqlite3_reset':

/usr/src/AutoMakeTest/sqlite3-embedded/sqlite3main.c:877: undefined reference to
 `_sqlite3VdbeReset'
/usr/src/AutoMakeTest/sqlite3-embedded/sqlite3main.c:878: undefined reference to
 `_sqlite3VdbeMakeReady'
../.libs/libopenpbx.a(libopenpbx_la-sqlite3main.o): In function `sqlite3_create_
collation16':
/usr/src/AutoMakeTest/sqlite3-embedded/sqlite3main.c:955: undefined reference to
 `_sqlite3SafetyCheck'
/usr/src/AutoMakeTest/sqlite3-embedded/sqlite3main.c:959: undefined reference to
 `_sqlite3ValueSetStr'
/usr/src/AutoMakeTest/sqlite3-embedded/sqlite3main.c:960: undefined reference to
 `_sqlite3ValueText'
../.libs/libopenpbx.a(libopenpbx_la-sqlite3main.o): In function `sqlite3_collati
on_needed':
/usr/src/AutoMakeTest/sqlite3-embedded/sqlite3main.c:974: undefined reference to
 `_sqlite3SafetyCheck'
../.libs/libopenpbx.a(libopenpbx_la-sqlite3main.o): In function `sqlite3_collati
on_needed16':
/usr/src/AutoMakeTest/sqlite3-embedded/sqlite3main.c:993: undefined reference to
 `_sqlite3SafetyCheck'
../.libs/libopenpbx.a(libopenpbx_la-sqlite3main.o): In function `sqlite3_global_
recover':
/usr/src/AutoMakeTest/sqlite3-embedded/sqlite3main.c:1015: undefined reference t
o `_sqlite3_malloc_failed'
/usr/src/AutoMakeTest/sqlite3-embedded/sqlite3main.c:1018: undefined reference t
o `_sqlite3_malloc_failed'
/usr/src/AutoMakeTest/sqlite3-embedded/sqlite3main.c:1020: undefined reference t
o `_sqlite3ExpirePreparedStatements'
/usr/src/AutoMakeTest/sqlite3-embedded/sqlite3main.c:1033: undefined reference t
o `_sqlite3_malloc_failed'
../.libs/libopenpbx.a(libopenpbx_la-os_win.o): In function `utf8ToUnicode':
/usr/src/AutoMakeTest/sqlite3-embedded/os_win.c:91: undefined reference to `_sql
ite3Malloc'
/usr/src/AutoMakeTest/sqlite3-embedded/os_win.c:97: undefined reference to `_sql
ite3FreeX'
../.libs/libopenpbx.a(libopenpbx_la-os_win.o): In function `sqlite3OsDelete':
/usr/src/AutoMakeTest/sqlite3-embedded/os_win.c:133: undefined reference to `_sq
lite3FreeX'
../.libs/libopenpbx.a(libopenpbx_la-os_win.o): In function `sqlite3OsFileExists'
:
/usr/src/AutoMakeTest/sqlite3-embedded/os_win.c:149: undefined reference to `_sq
lite3FreeX'
../.libs/libopenpbx.a(libopenpbx_la-os_win.o): In function `sqlite3OsOpenReadWri
te':
/usr/src/AutoMakeTest/sqlite3-embedded/os_win.c:203: undefined reference to `_sq
lite3FreeX'
/usr/src/AutoMakeTest/sqlite3-embedded/os_win.c:196: undefined reference to `_sq
lite3FreeX'
../.libs/libopenpbx.a(libopenpbx_la-os_win.o):/usr/src/AutoMakeTest/sqlite3-embe
dded/os_win.c:274: more undefined references to `_sqlite3FreeX' follow
../.libs/libopenpbx.a(libopenpbx_la-os_win.o): In function `sqlite3OsTempFileNam
e':
/usr/src/AutoMakeTest/sqlite3-embedded/os_win.c:112: undefined reference to `_sq
lite3Malloc'
/usr/src/AutoMakeTest/sqlite3-embedded/os_win.c:119: undefined reference to `_sq
lite3FreeX'
/usr/src/AutoMakeTest/sqlite3-embedded/os_win.c:392: undefined reference to `_sq
lite3FreeX'
../.libs/libopenpbx.a(libopenpbx_la-os_win.o): In function `sqlite3OsIsDirWritab
le':
/usr/src/AutoMakeTest/sqlite3-embedded/os_win.c:590: undefined reference to `_sq
lite3FreeX'
../.libs/libopenpbx.a(libopenpbx_la-os_win.o): In function `sqlite3OsFullPathnam
e':
/usr/src/AutoMakeTest/sqlite3-embedded/os_win.c:808: undefined reference to `_sq
lite3Malloc'
../.libs/libopenpbx.a(libopenpbx_la-vdbefifo.o): In function `allocatePage':
/usr/src/AutoMakeTest/sqlite3-embedded/vdbefifo.c:27: undefined reference to `_s
qlite3MallocRaw'
../.libs/libopenpbx.a(libopenpbx_la-vdbefifo.o): In function `sqlite3VdbeFifoPop
':
/usr/src/AutoMakeTest/sqlite3-embedded/vdbefifo.c:90: undefined reference to `_s
qlite3FreeX'
../.libs/libopenpbx.a(libopenpbx_la-vdbefifo.o): In function `sqlite3VdbeFifoCle
ar':
/usr/src/AutoMakeTest/sqlite3-embedded/vdbefifo.c:111: undefined reference to `_
sqlite3FreeX'
../.libs/libopenpbx.a(libopenpbx_la-analyze.o): In function `openStatTable':
/usr/src/AutoMakeTest/sqlite3-embedded/analyze.c:66: undefined reference to `_sq
lite3VdbeAddOp'
/usr/src/AutoMakeTest/sqlite3-embedded/analyze.c:67: undefined reference to `_sq
lite3VdbeAddOp'
/usr/src/AutoMakeTest/sqlite3-embedded/analyze.c:68: undefined reference to `_sq
lite3VdbeAddOp'
/usr/src/AutoMakeTest/sqlite3-embedded/analyze.c:61: undefined reference to `_sq
lite3VdbeAddOp'
../.libs/libopenpbx.a(libopenpbx_la-analyze.o): In function `analyzeOneTable':
/usr/src/AutoMakeTest/sqlite3-embedded/analyze.c:107: undefined reference to `_s
qlite3VdbeAddOp'
/usr/src/AutoMakeTest/sqlite3-embedded/analyze.c:109: undefined reference to `_s
qlite3VdbeOp3'
/usr/src/AutoMakeTest/sqlite3-embedded/analyze.c:115: undefined reference to `_s
qlite3VdbeAddOp'
/usr/src/AutoMakeTest/sqlite3-embedded/analyze.c:139: undefined reference to `_s
qlite3VdbeMakeLabel'
/usr/src/AutoMakeTest/sqlite3-embedded/analyze.c:140: undefined reference to `_s
qlite3VdbeAddOp'
/usr/src/AutoMakeTest/sqlite3-embedded/analyze.c:141: undefined reference to `_s
qlite3VdbeCurrentAddr'
/usr/src/AutoMakeTest/sqlite3-embedded/analyze.c:142: undefined reference to `_s
qlite3VdbeAddOp'
/usr/src/AutoMakeTest/sqlite3-embedded/analyze.c:144: undefined reference to `_s
qlite3VdbeAddOp'
/usr/src/AutoMakeTest/sqlite3-embedded/analyze.c:145: undefined reference to `_s
qlite3VdbeAddOp'
/usr/src/AutoMakeTest/sqlite3-embedded/analyze.c:146: undefined reference to `_s
qlite3VdbeAddOp'
/usr/src/AutoMakeTest/sqlite3-embedded/analyze.c:148: undefined reference to `_s
qlite3VdbeAddOp'
../.libs/libopenpbx.a(libopenpbx_la-analyze.o):/usr/src/AutoMakeTest/sqlite3-emb
edded/analyze.c:150: more undefined references to `_sqlite3VdbeAddOp' follow
../.libs/libopenpbx.a(libopenpbx_la-analyze.o): In function `analyzeOneTable':
/usr/src/AutoMakeTest/sqlite3-embedded/analyze.c:151: undefined reference to `_s
qlite3VdbeChangeP2'
/usr/src/AutoMakeTest/sqlite3-embedded/analyze.c:152: undefined reference to `_s
qlite3VdbeAddOp'
/usr/src/AutoMakeTest/sqlite3-embedded/analyze.c:153: undefined reference to `_s
qlite3VdbeAddOp'
/usr/src/AutoMakeTest/sqlite3-embedded/analyze.c:155: undefined reference to `_s
qlite3VdbeResolveLabel'
/usr/src/AutoMakeTest/sqlite3-embedded/analyze.c:156: undefined reference to `_s
qlite3VdbeAddOp'
/usr/src/AutoMakeTest/sqlite3-embedded/analyze.c:157: undefined reference to `_s
qlite3VdbeAddOp'
/usr/src/AutoMakeTest/sqlite3-embedded/analyze.c:177: undefined reference to `_s
qlite3VdbeAddOp'
/usr/src/AutoMakeTest/sqlite3-embedded/analyze.c:178: undefined reference to `_s
qlite3VdbeAddOp'
/usr/src/AutoMakeTest/sqlite3-embedded/analyze.c:179: undefined reference to `_s
qlite3VdbeAddOp'
/usr/src/AutoMakeTest/sqlite3-embedded/analyze.c:180: undefined reference to `_s
qlite3VdbeOp3'
/usr/src/AutoMakeTest/sqlite3-embedded/analyze.c:181: undefined reference to `_s
qlite3VdbeOp3'
/usr/src/AutoMakeTest/sqlite3-embedded/analyze.c:182: undefined reference to `_s
qlite3VdbeAddOp'
/usr/src/AutoMakeTest/sqlite3-embedded/analyze.c:183: undefined reference to `_s
qlite3VdbeOp3'
/usr/src/AutoMakeTest/sqlite3-embedded/analyze.c:194: undefined reference to `_s
qlite3VdbeAddOp'
/usr/src/AutoMakeTest/sqlite3-embedded/analyze.c:185: undefined reference to `_s
qlite3VdbeAddOp'
/usr/src/AutoMakeTest/sqlite3-embedded/analyze.c:186: undefined reference to `_s
qlite3VdbeAddOp'
/usr/src/AutoMakeTest/sqlite3-embedded/analyze.c:187: undefined reference to `_s
qlite3VdbeAddOp'
/usr/src/AutoMakeTest/sqlite3-embedded/analyze.c:188: undefined reference to `_s
qlite3VdbeAddOp'
../.libs/libopenpbx.a(libopenpbx_la-analyze.o):/usr/src/AutoMakeTest/sqlite3-emb
edded/analyze.c:189: more undefined references to `_sqlite3VdbeAddOp' follow
../.libs/libopenpbx.a(libopenpbx_la-analyze.o): In function `analyzeOneTable':
/usr/src/AutoMakeTest/sqlite3-embedded/analyze.c:197: undefined reference to `_s
qlite3VdbeOp3'
/usr/src/AutoMakeTest/sqlite3-embedded/analyze.c:198: undefined reference to `_s
qlite3VdbeAddOp'
/usr/src/AutoMakeTest/sqlite3-embedded/analyze.c:199: undefined reference to `_s
qlite3VdbeJumpHere'
/usr/src/AutoMakeTest/sqlite3-embedded/analyze.c:131: undefined reference to `_s
qlite3VdbeAddOp'
/usr/src/AutoMakeTest/sqlite3-embedded/analyze.c:134: undefined reference to `_s
qlite3VdbeAddOp'
../.libs/libopenpbx.a(libopenpbx_la-analyze.o): In function `loadAnalysis':
/usr/src/AutoMakeTest/sqlite3-embedded/analyze.c:209: undefined reference to `_s
qlite3VdbeAddOp'
../.libs/libopenpbx.a(libopenpbx_la-analyze.o): In function `sqlite3Analyze':
/usr/src/AutoMakeTest/sqlite3-embedded/analyze.c:271: undefined reference to `_s
qlite3ReadSchema'
/usr/src/AutoMakeTest/sqlite3-embedded/analyze.c:301: undefined reference to `_s
qlite3FreeX'
../.libs/libopenpbx.a(libopenpbx_la-analyze.o): In function `sqlite3AnalysisLoad
':
/usr/src/AutoMakeTest/sqlite3-embedded/analyze.c:379: undefined reference to `_s
qlite3SafetyOff'
/usr/src/AutoMakeTest/sqlite3-embedded/analyze.c:381: undefined reference to `_s
qlite3SafetyOn'
/usr/src/AutoMakeTest/sqlite3-embedded/analyze.c:382: undefined reference to `_s
qlite3FreeX'
../.libs/libopenpbx.a(libopenpbx_la-alter.o): In function `renameTableFunc':
/usr/src/AutoMakeTest/sqlite3-embedded/alter.c:45: undefined reference to `_sqli
te3_value_text'
/usr/src/AutoMakeTest/sqlite3-embedded/alter.c:46: undefined reference to `_sqli
te3_value_text'
/usr/src/AutoMakeTest/sqlite3-embedded/alter.c:76: undefined reference to `_sqli
te3FreeX'
/usr/src/AutoMakeTest/sqlite3-embedded/alter.c:76: undefined reference to `_sqli
te3_result_text'
../.libs/libopenpbx.a(libopenpbx_la-alter.o): In function `renameTriggerFunc':
/usr/src/AutoMakeTest/sqlite3-embedded/alter.c:93: undefined reference to `_sqli
te3_value_text'
/usr/src/AutoMakeTest/sqlite3-embedded/alter.c:94: undefined reference to `_sqli
te3_value_text'
/usr/src/AutoMakeTest/sqlite3-embedded/alter.c:143: undefined reference to `_sql
ite3FreeX'
/usr/src/AutoMakeTest/sqlite3-embedded/alter.c:143: undefined reference to `_sql
ite3_result_text'
../.libs/libopenpbx.a(libopenpbx_la-alter.o): In function `whereTempTriggers':
/usr/src/AutoMakeTest/sqlite3-embedded/alter.c:188: undefined reference to `_sql
ite3FreeX'
../.libs/libopenpbx.a(libopenpbx_la-alter.o): In function `reloadTableSchema':
/usr/src/AutoMakeTest/sqlite3-embedded/alter.c:220: undefined reference to `_sql
ite3VdbeOp3'
/usr/src/AutoMakeTest/sqlite3-embedded/alter.c:225: undefined reference to `_sql
ite3VdbeOp3'
/usr/src/AutoMakeTest/sqlite3-embedded/alter.c:230: undefined reference to `_sql
ite3VdbeOp3'
/usr/src/AutoMakeTest/sqlite3-embedded/alter.c:237: undefined reference to `_sql
ite3VdbeOp3'
../.libs/libopenpbx.a(libopenpbx_la-alter.o): In function `sqlite3AlterRenameTab
le':
/usr/src/AutoMakeTest/sqlite3-embedded/alter.c:261: undefined reference to `_sql
ite3_malloc_failed'
/usr/src/AutoMakeTest/sqlite3-embedded/alter.c:286: undefined reference to `_sql
ite3ErrorMsg'
/usr/src/AutoMakeTest/sqlite3-embedded/alter.c:285: undefined reference to `_sql
ite3StrNICmp'
/usr/src/AutoMakeTest/sqlite3-embedded/alter.c:358: undefined reference to `_sql
ite3FreeX'
../.libs/libopenpbx.a(libopenpbx_la-alter.o): In function `sqlite3AlterFinishAdd
Column':
/usr/src/AutoMakeTest/sqlite3-embedded/alter.c:433: undefined reference to `_sql
ite3ValueFromExpr'
/usr/src/AutoMakeTest/sqlite3-embedded/alter.c:438: undefined reference to `_sql
ite3ErrorMsg'
/usr/src/AutoMakeTest/sqlite3-embedded/alter.c:441: undefined reference to `_sql
ite3ValueFree'
/usr/src/AutoMakeTest/sqlite3-embedded/alter.c:445: undefined reference to `_sql
ite3StrNDup'
/usr/src/AutoMakeTest/sqlite3-embedded/alter.c:458: undefined reference to `_sql
ite3FreeX'
/usr/src/AutoMakeTest/sqlite3-embedded/alter.c:469: undefined reference to `_sql
ite3VdbeAddOp'
/usr/src/AutoMakeTest/sqlite3-embedded/alter.c:470: undefined reference to `_sql
ite3VdbeAddOp'
/usr/src/AutoMakeTest/sqlite3-embedded/alter.c:471: undefined reference to `_sql
ite3VdbeCurrentAddr'
/usr/src/AutoMakeTest/sqlite3-embedded/alter.c:471: undefined reference to `_sql
ite3VdbeAddOp'
/usr/src/AutoMakeTest/sqlite3-embedded/alter.c:472: undefined reference to `_sql
ite3VdbeAddOp'
/usr/src/AutoMakeTest/sqlite3-embedded/alter.c:473: undefined reference to `_sql
ite3VdbeAddOp'
../.libs/libopenpbx.a(libopenpbx_la-alter.o): In function `sqlite3AlterBeginAddC
olumn':
/usr/src/AutoMakeTest/sqlite3-embedded/alter.c:507: undefined reference to `_sql
ite3_malloc_failed'
/usr/src/AutoMakeTest/sqlite3-embedded/alter.c:523: undefined reference to `_sql
ite3Malloc'
/usr/src/AutoMakeTest/sqlite3-embedded/alter.c:531: undefined reference to `_sql
ite3Malloc'
/usr/src/AutoMakeTest/sqlite3-embedded/alter.c:532: undefined reference to `_sql
ite3StrDup'
/usr/src/AutoMakeTest/sqlite3-embedded/alter.c:539: undefined reference to `_sql
ite3StrDup'
/usr/src/AutoMakeTest/sqlite3-embedded/alter.c:513: undefined reference to `_sql
ite3ErrorMsg'
../.libs/libopenpbx.a(libopenpbx_la-alter.o): In function `sqlite3AlterRenameTab
le':
/usr/src/AutoMakeTest/sqlite3-embedded/alter.c:367: undefined reference to `_sql
ite3FreeX'
../.libs/libopenpbx.a(libopenpbx_la-pager.o): In function `readMasterJournal':
/usr/src/AutoMakeTest/sqlite3-embedded/pager.c:545: undefined reference to `_sql
ite3Malloc'
/usr/src/AutoMakeTest/sqlite3-embedded/pager.c:551: undefined reference to `_sql
ite3FreeX'
/usr/src/AutoMakeTest/sqlite3-embedded/pager.c:566: undefined reference to `_sql
ite3FreeX'
../.libs/libopenpbx.a(libopenpbx_la-pager.o): In function `sqlite3pager_stmt_com
mit':
/usr/src/AutoMakeTest/sqlite3-embedded/pager.c:3306: undefined reference to `_sq
lite3FreeX'
/usr/src/AutoMakeTest/sqlite3-embedded/pager.c:3296: undefined reference to `_sq
lite3FreeX'
../.libs/libopenpbx.a(libopenpbx_la-pager.o): In function `pager_unwritelock':
/usr/src/AutoMakeTest/sqlite3-embedded/pager.c:917: undefined reference to `_sql
ite3FreeX'
../.libs/libopenpbx.a(libopenpbx_la-pager.o):/usr/src/AutoMakeTest/sqlite3-embed
ded/pager.c:1289: more undefined references to `_sqlite3FreeX' follow
../.libs/libopenpbx.a(libopenpbx_la-pager.o): In function `pager_playback':
/usr/src/AutoMakeTest/sqlite3-embedded/pager.c:1106: undefined reference to `_sq
lite3Malloc'
/usr/src/AutoMakeTest/sqlite3-embedded/pager.c:1151: undefined reference to `_sq
lite3FreeX'
/usr/src/AutoMakeTest/sqlite3-embedded/pager.c:1374: undefined reference to `_sq
lite3FreeX'
/usr/src/AutoMakeTest/sqlite3-embedded/pager.c:1137: undefined reference to `_sq
lite3FreeX'
../.libs/libopenpbx.a(libopenpbx_la-pager.o): In function `sqlite3pager_open':
/usr/src/AutoMakeTest/sqlite3-embedded/pager.c:1610: undefined reference to `_sq
lite3_malloc_failed'
/usr/src/AutoMakeTest/sqlite3-embedded/pager.c:1641: undefined reference to `_sq
lite3FreeX'
/usr/src/AutoMakeTest/sqlite3-embedded/pager.c:1617: undefined reference to `_sq
lite3StrDup'
/usr/src/AutoMakeTest/sqlite3-embedded/pager.c:1645: undefined reference to `_sq
lite3Malloc'
/usr/src/AutoMakeTest/sqlite3-embedded/pager.c:1660: undefined reference to `_sq
lite3FreeX'
/usr/src/AutoMakeTest/sqlite3-embedded/pager.c:1648: undefined reference to `_sq
lite3FreeX'
../.libs/libopenpbx.a(libopenpbx_la-pager.o): In function `memoryTruncate':
/usr/src/AutoMakeTest/sqlite3-embedded/pager.c:1874: undefined reference to `_sq
lite3FreeX'
../.libs/libopenpbx.a(libopenpbx_la-pager.o): In function `sqlite3pager_stmt_beg
in':
/usr/src/AutoMakeTest/sqlite3-embedded/pager.c:3255: undefined reference to `_sq
lite3Malloc'
/usr/src/AutoMakeTest/sqlite3-embedded/pager.c:3280: undefined reference to `_sq
lite3FreeX'
../.libs/libopenpbx.a(libopenpbx_la-pager.o): In function `pager_open_journal':
/usr/src/AutoMakeTest/sqlite3-embedded/pager.c:2649: undefined reference to `_sq
lite3Malloc'
/usr/src/AutoMakeTest/sqlite3-embedded/pager.c:2689: undefined reference to `_sq
lite3FreeX'
../.libs/libopenpbx.a(libopenpbx_la-pager.o): In function `clearHistory':
/usr/src/AutoMakeTest/sqlite3-embedded/pager.c:3040: undefined reference to `_sq
lite3FreeX'
/usr/src/AutoMakeTest/sqlite3-embedded/pager.c:3041: undefined reference to `_sq
lite3FreeX'
../.libs/libopenpbx.a(libopenpbx_la-pager.o): In function `sqlite3pager_write':
/usr/src/AutoMakeTest/sqlite3-embedded/pager.c:2830: undefined reference to `_sq
lite3MallocRaw'
/usr/src/AutoMakeTest/sqlite3-embedded/pager.c:2887: undefined reference to `_sq
lite3MallocRaw'
../.libs/libopenpbx.a(libopenpbx_la-pager.o): In function `pager_reset':
/usr/src/AutoMakeTest/sqlite3-embedded/pager.c:850: undefined reference to `_sql
ite3FreeX'
../.libs/libopenpbx.a(libopenpbx_la-pager.o): In function `sqlite3pager_get':
/usr/src/AutoMakeTest/sqlite3-embedded/pager.c:2400: undefined reference to `_sq
lite3MallocRaw'
../.libs/libopenpbx.a(libopenpbx_la-pager.o): In function `sqlite3pager_close':
/usr/src/AutoMakeTest/sqlite3-embedded/pager.c:2000: undefined reference to `_sq
lite3FreeX'
/usr/src/AutoMakeTest/sqlite3-embedded/pager.c:2007: undefined reference to `_sq
lite3FreeX'
/usr/src/AutoMakeTest/sqlite3-embedded/pager.c:2018: undefined reference to `_sq
lite3FreeX'
/usr/src/AutoMakeTest/sqlite3-embedded/pager.c:2007: undefined reference to `_sq
lite3FreeX'
/usr/src/AutoMakeTest/sqlite3-embedded/pager.c:2018: undefined reference to `_sq
lite3FreeX'
../.libs/libopenpbx.a(libopenpbx_la-pager.o):/usr/src/AutoMakeTest/sqlite3-embed
ded/pager.c:3331: more undefined references to `_sqlite3FreeX' follow
../.libs/libopenpbx.a(libopenpbx_la-parse.o): In function `yy_destructor':
/usr/src/AutoMakeTest/parse.y:969: undefined reference to `_sqlite3DeleteTrigger
Step'
../.libs/libopenpbx.a(libopenpbx_la-parse.o): In function `yy_syntax_error':
/usr/src/AutoMakeTest/parse.y:37: undefined reference to `_sqlite3ErrorMsg'
/usr/src/AutoMakeTest/parse.y:39: undefined reference to `_sqlite3ErrorMsg'
../.libs/libopenpbx.a(libopenpbx_la-parse.o): In function `sqlite3Parser':
/usr/src/AutoMakeTest/parse.y:585: undefined reference to `_sqlite3Update'
/usr/src/AutoMakeTest/parse.y:443: undefined reference to `_sqlite3Malloc'
/usr/src/AutoMakeTest/parse.y:942: undefined reference to `_sqlite3BeginTrigger'

/usr/src/AutoMakeTest/parse.y:936: undefined reference to `_sqlite3FinishTrigger
'
/usr/src/AutoMakeTest/parse.y:906: undefined reference to `_sqlite3Vacuum'
/usr/src/AutoMakeTest/parse.y:995: undefined reference to `_sqlite3TriggerSelect
Step'
/usr/src/AutoMakeTest/parse.y:992: undefined reference to `_sqlite3TriggerDelete
Step'
/usr/src/AutoMakeTest/parse.y:988: undefined reference to `_sqlite3TriggerInsert
Step'
/usr/src/AutoMakeTest/parse.y:985: undefined reference to `_sqlite3TriggerInsert
Step'
/usr/src/AutoMakeTest/parse.y:980: undefined reference to `_sqlite3TriggerUpdate
Step'
/usr/src/AutoMakeTest/parse.y:1019: undefined reference to `_sqlite3DropTrigger'

../.libs/libopenpbx.a(libopenpbx_la-callback.o): In function `sqlite3FindCollSeq
':
/usr/src/AutoMakeTest/sqlite3-embedded/callback.c:161: undefined reference to `_
sqlite3Malloc'
/usr/src/AutoMakeTest/sqlite3-embedded/callback.c:179: undefined reference to `_
sqlite3FreeX'
../.libs/libopenpbx.a(libopenpbx_la-callback.o): In function `sqlite3GetCollSeq'
:
/usr/src/AutoMakeTest/sqlite3-embedded/callback.c:30: undefined reference to `_s
qlite3StrNDup'
/usr/src/AutoMakeTest/sqlite3-embedded/callback.c:33: undefined reference to `_s
qlite3FreeX'
/usr/src/AutoMakeTest/sqlite3-embedded/callback.c:39: undefined reference to `_s
qlite3ValueSetStr'
/usr/src/AutoMakeTest/sqlite3-embedded/callback.c:40: undefined reference to `_s
qlite3ValueText'
../.libs/libopenpbx.a(libopenpbx_la-callback.o): In function `sqlite3CheckCollSe
q':
/usr/src/AutoMakeTest/sqlite3-embedded/callback.c:126: undefined reference to `_
sqlite3ErrorMsg'
../.libs/libopenpbx.a(libopenpbx_la-callback.o): In function `sqlite3FindFunctio
n':
/usr/src/AutoMakeTest/sqlite3-embedded/callback.c:288: undefined reference to `_
sqlite3Malloc'
/usr/src/AutoMakeTest/sqlite3-embedded/callback.c:296: undefined reference to `_
sqlite3FreeX'
../.libs/libopenpbx.a(libopenpbx_la-pragma.o): In function `getSafetyLevel':
/usr/src/AutoMakeTest/sqlite3-embedded/pragma.c:51: undefined reference to `_sql
ite3StrNICmp'
../.libs/libopenpbx.a(libopenpbx_la-pragma.o): In function `invalidateTempStorag
e':
/usr/src/AutoMakeTest/sqlite3-embedded/pragma.c:93: undefined reference to `_sql
ite3ErrorMsg'
../.libs/libopenpbx.a(libopenpbx_la-pragma.o): In function `returnSingleInt':
/usr/src/AutoMakeTest/sqlite3-embedded/pragma.c:128: undefined reference to `_sq
lite3VdbeAddOp'
/usr/src/AutoMakeTest/sqlite3-embedded/pragma.c:133: undefined reference to `_sq
lite3VdbeAddOp'
/usr/src/AutoMakeTest/sqlite3-embedded/pragma.c:130: undefined reference to `_sq
lite3VdbeSetNumCols'
/usr/src/AutoMakeTest/sqlite3-embedded/pragma.c:131: undefined reference to `_sq
lite3VdbeSetColName'
../.libs/libopenpbx.a(libopenpbx_la-pragma.o): In function `sqlite3Pragma':
/usr/src/AutoMakeTest/sqlite3-embedded/pragma.c:255: undefined reference to `_sq
lite3StrICmp'
/usr/src/AutoMakeTest/sqlite3-embedded/pragma.c:266: undefined reference to `_sq
lite3ReadSchema'
/usr/src/AutoMakeTest/sqlite3-embedded/pragma.c:277: undefined reference to `_sq
lite3VdbeAddOp'
/usr/src/AutoMakeTest/sqlite3-embedded/pragma.c:278: undefined reference to `_sq
lite3VdbeAddOp'
/usr/src/AutoMakeTest/sqlite3-embedded/pragma.c:279: undefined reference to `_sq
lite3VdbeAddOp'
/usr/src/AutoMakeTest/sqlite3-embedded/pragma.c:280: undefined reference to `_sq
lite3VdbeAddOp'
/usr/src/AutoMakeTest/sqlite3-embedded/pragma.c:281: undefined reference to `_sq
lite3VdbeAddOp'
../.libs/libopenpbx.a(libopenpbx_la-pragma.o):/usr/src/AutoMakeTest/sqlite3-embe
dded/pragma.c:282: more undefined references to `_sqlite3VdbeAddOp' follow
../.libs/libopenpbx.a(libopenpbx_la-pragma.o): In function `sqlite3Pragma':
/usr/src/AutoMakeTest/sqlite3-embedded/pragma.c:931: undefined reference to `_sq
lite3FreeX'
/usr/src/AutoMakeTest/sqlite3-embedded/pragma.c:932: undefined reference to `_sq
lite3FreeX'
/usr/src/AutoMakeTest/sqlite3-embedded/pragma.c:297: undefined reference to `_sq
lite3StrICmp'
/usr/src/AutoMakeTest/sqlite3-embedded/pragma.c:268: undefined reference to `_sq
lite3VdbeSetNumCols'
/usr/src/AutoMakeTest/sqlite3-embedded/pragma.c:269: undefined reference to `_sq
lite3VdbeSetColName'
/usr/src/AutoMakeTest/sqlite3-embedded/pragma.c:270: undefined reference to `_sq
lite3VdbeAddOpList'
/usr/src/AutoMakeTest/sqlite3-embedded/pragma.c:271: undefined reference to `_sq
lite3VdbeChangeP1'
/usr/src/AutoMakeTest/sqlite3-embedded/pragma.c:272: undefined reference to `_sq
lite3VdbeChangeP1'
/usr/src/AutoMakeTest/sqlite3-embedded/pragma.c:315: undefined reference to `_sq
lite3StrICmp'
/usr/src/AutoMakeTest/sqlite3-embedded/pragma.c:342: undefined reference to `_sq
lite3StrICmp'
/usr/src/AutoMakeTest/sqlite3-embedded/pragma.c:343: undefined reference to `_sq
lite3ReadSchema'
/usr/src/AutoMakeTest/sqlite3-embedded/pragma.c:365: undefined reference to `_sq
lite3StrICmp'
/usr/src/AutoMakeTest/sqlite3-embedded/pragma.c:383: undefined reference to `_sq
lite3StrICmp'
/usr/src/AutoMakeTest/sqlite3-embedded/pragma.c:402: undefined reference to `_sq
lite3FreeX'
/usr/src/AutoMakeTest/sqlite3-embedded/pragma.c:74: undefined reference to `_sql
ite3StrICmp'
/usr/src/AutoMakeTest/sqlite3-embedded/pragma.c:76: undefined reference to `_sql
ite3StrICmp'
/usr/src/AutoMakeTest/sqlite3-embedded/pragma.c:421: undefined reference to `_sq
lite3StrICmp'
/usr/src/AutoMakeTest/sqlite3-embedded/pragma.c:161: undefined reference to `_sq
lite3StrICmp'
/usr/src/AutoMakeTest/sqlite3-embedded/pragma.c:457: undefined reference to `_sq
lite3StrICmp'
/usr/src/AutoMakeTest/sqlite3-embedded/pragma.c:459: undefined reference to `_sq
lite3ReadSchema'
/usr/src/AutoMakeTest/sqlite3-embedded/pragma.c:463: undefined reference to `_sq
lite3VdbeSetNumCols'
/usr/src/AutoMakeTest/sqlite3-embedded/pragma.c:464: undefined reference to `_sq
lite3VdbeSetColName'
/usr/src/AutoMakeTest/sqlite3-embedded/pragma.c:465: undefined reference to `_sq
lite3VdbeSetColName'
/usr/src/AutoMakeTest/sqlite3-embedded/pragma.c:466: undefined reference to `_sq
lite3VdbeSetColName'
/usr/src/AutoMakeTest/sqlite3-embedded/pragma.c:467: undefined reference to `_sq
lite3VdbeSetColName'
/usr/src/AutoMakeTest/sqlite3-embedded/pragma.c:468: undefined reference to `_sq
lite3VdbeSetColName'
../.libs/libopenpbx.a(libopenpbx_la-pragma.o):/usr/src/AutoMakeTest/sqlite3-embe
dded/pragma.c:469: more undefined references to `_sqlite3VdbeSetColName' follow
../.libs/libopenpbx.a(libopenpbx_la-pragma.o): In function `sqlite3Pragma':
/usr/src/AutoMakeTest/sqlite3-embedded/pragma.c:472: undefined reference to `_sq
lite3VdbeAddOp'
/usr/src/AutoMakeTest/sqlite3-embedded/pragma.c:473: undefined reference to `_sq
lite3VdbeOp3'
/usr/src/AutoMakeTest/sqlite3-embedded/pragma.c:474: undefined reference to `_sq
lite3VdbeOp3'
/usr/src/AutoMakeTest/sqlite3-embedded/pragma.c:476: undefined reference to `_sq
lite3VdbeAddOp'
/usr/src/AutoMakeTest/sqlite3-embedded/pragma.c:478: undefined reference to `_sq
lite3VdbeAddOp'
/usr/src/AutoMakeTest/sqlite3-embedded/pragma.c:479: undefined reference to `_sq
lite3VdbeAddOp'
/usr/src/AutoMakeTest/sqlite3-embedded/pragma.c:393: undefined reference to `_sq
lite3ErrorMsg'
/usr/src/AutoMakeTest/sqlite3-embedded/pragma.c:484: undefined reference to `_sq
lite3StrICmp'
/usr/src/AutoMakeTest/sqlite3-embedded/pragma.c:487: undefined reference to `_sq
lite3ReadSchema'
/usr/src/AutoMakeTest/sqlite3-embedded/pragma.c:492: undefined reference to `_sq
lite3VdbeSetNumCols'
/usr/src/AutoMakeTest/sqlite3-embedded/pragma.c:493: undefined reference to `_sq
lite3VdbeSetColName'
/usr/src/AutoMakeTest/sqlite3-embedded/pragma.c:494: undefined reference to `_sq
lite3VdbeSetColName'
/usr/src/AutoMakeTest/sqlite3-embedded/pragma.c:495: undefined reference to `_sq
lite3VdbeSetColName'
/usr/src/AutoMakeTest/sqlite3-embedded/pragma.c:498: undefined reference to `_sq
lite3VdbeAddOp'
/usr/src/AutoMakeTest/sqlite3-embedded/pragma.c:499: undefined reference to `_sq
lite3VdbeAddOp'
/usr/src/AutoMakeTest/sqlite3-embedded/pragma.c:501: undefined reference to `_sq
lite3VdbeOp3'
/usr/src/AutoMakeTest/sqlite3-embedded/pragma.c:502: undefined reference to `_sq
lite3VdbeAddOp'
/usr/src/AutoMakeTest/sqlite3-embedded/pragma.c:386: undefined reference to `_sq
lite3VdbeSetNumCols'
/usr/src/AutoMakeTest/sqlite3-embedded/pragma.c:387: undefined reference to `_sq
lite3VdbeSetColName'
/usr/src/AutoMakeTest/sqlite3-embedded/pragma.c:388: undefined reference to `_sq
lite3VdbeOp3'
/usr/src/AutoMakeTest/sqlite3-embedded/pragma.c:795: undefined reference to `_sq
lite3VdbeAddOp'
/usr/src/AutoMakeTest/sqlite3-embedded/pragma.c:795: undefined reference to `_sq
lite3VdbeAddOp'
/usr/src/AutoMakeTest/sqlite3-embedded/pragma.c:422: undefined reference to `_sq
lite3ReadSchema'
/usr/src/AutoMakeTest/sqlite3-embedded/pragma.c:427: undefined reference to `_sq
lite3ErrorMsg'
/usr/src/AutoMakeTest/sqlite3-embedded/pragma.c:507: undefined reference to `_sq
lite3StrICmp'
/usr/src/AutoMakeTest/sqlite3-embedded/pragma.c:510: undefined reference to `_sq
lite3ReadSchema'
/usr/src/AutoMakeTest/sqlite3-embedded/pragma.c:517: undefined reference to `_sq
lite3VdbeSetNumCols'
/usr/src/AutoMakeTest/sqlite3-embedded/pragma.c:518: undefined reference to `_sq
lite3VdbeSetColName'
/usr/src/AutoMakeTest/sqlite3-embedded/pragma.c:519: undefined reference to `_sq
lite3VdbeSetColName'
/usr/src/AutoMakeTest/sqlite3-embedded/pragma.c:520: undefined reference to `_sq
lite3VdbeSetColName'
/usr/src/AutoMakeTest/sqlite3-embedded/pragma.c:522: undefined reference to `_sq
lite3VdbeAddOp'
/usr/src/AutoMakeTest/sqlite3-embedded/pragma.c:523: undefined reference to `_sq
lite3VdbeOp3'
/usr/src/AutoMakeTest/sqlite3-embedded/pragma.c:524: undefined reference to `_sq
lite3VdbeAddOp'
/usr/src/AutoMakeTest/sqlite3-embedded/pragma.c:525: undefined reference to `_sq
lite3VdbeAddOp'
/usr/src/AutoMakeTest/sqlite3-embedded/pragma.c:533: undefined reference to `_sq
lite3StrICmp'
/usr/src/AutoMakeTest/sqlite3-embedded/pragma.c:535: undefined reference to `_sq
lite3ReadSchema'
/usr/src/AutoMakeTest/sqlite3-embedded/pragma.c:536: undefined reference to `_sq
lite3VdbeSetNumCols'
/usr/src/AutoMakeTest/sqlite3-embedded/pragma.c:537: undefined reference to `_sq
lite3VdbeSetColName'
/usr/src/AutoMakeTest/sqlite3-embedded/pragma.c:538: undefined reference to `_sq
lite3VdbeSetColName'
/usr/src/AutoMakeTest/sqlite3-embedded/pragma.c:539: undefined reference to `_sq
lite3VdbeSetColName'
/usr/src/AutoMakeTest/sqlite3-embedded/pragma.c:543: undefined reference to `_sq
lite3VdbeAddOp'
/usr/src/AutoMakeTest/sqlite3-embedded/pragma.c:544: undefined reference to `_sq
lite3VdbeOp3'
/usr/src/AutoMakeTest/sqlite3-embedded/pragma.c:545: undefined reference to `_sq
lite3VdbeOp3'
/usr/src/AutoMakeTest/sqlite3-embedded/pragma.c:547: undefined reference to `_sq
lite3VdbeAddOp'
/usr/src/AutoMakeTest/sqlite3-embedded/pragma.c:551: undefined reference to `_sq
lite3StrICmp'
/usr/src/AutoMakeTest/sqlite3-embedded/pragma.c:554: undefined reference to `_sq
lite3VdbeSetNumCols'
/usr/src/AutoMakeTest/sqlite3-embedded/pragma.c:555: undefined reference to `_sq
lite3VdbeSetColName'
/usr/src/AutoMakeTest/sqlite3-embedded/pragma.c:556: undefined reference to `_sq
lite3VdbeSetColName'
/usr/src/AutoMakeTest/sqlite3-embedded/pragma.c:559: undefined reference to `_sq
lite3VdbeAddOp'
/usr/src/AutoMakeTest/sqlite3-embedded/pragma.c:560: undefined reference to `_sq
lite3VdbeOp3'
/usr/src/AutoMakeTest/sqlite3-embedded/pragma.c:561: undefined reference to `_sq
lite3VdbeAddOp'
/usr/src/AutoMakeTest/sqlite3-embedded/pragma.c:567: undefined reference to `_sq
lite3StrICmp'
/usr/src/AutoMakeTest/sqlite3-embedded/pragma.c:570: undefined reference to `_sq
lite3ReadSchema'
/usr/src/AutoMakeTest/sqlite3-embedded/pragma.c:577: undefined reference to `_sq
lite3VdbeSetNumCols'
/usr/src/AutoMakeTest/sqlite3-embedded/pragma.c:578: undefined reference to `_sq
lite3VdbeSetColName'
/usr/src/AutoMakeTest/sqlite3-embedded/pragma.c:579: undefined reference to `_sq
lite3VdbeSetColName'
/usr/src/AutoMakeTest/sqlite3-embedded/pragma.c:580: undefined reference to `_sq
lite3VdbeSetColName'
/usr/src/AutoMakeTest/sqlite3-embedded/pragma.c:581: undefined reference to `_sq
lite3VdbeSetColName'
/usr/src/AutoMakeTest/sqlite3-embedded/pragma.c:582: undefined reference to `_sq
lite3VdbeSetColName'
/usr/src/AutoMakeTest/sqlite3-embedded/pragma.c:587: undefined reference to `_sq
lite3VdbeAddOp'
/usr/src/AutoMakeTest/sqlite3-embedded/pragma.c:588: undefined reference to `_sq
lite3VdbeAddOp'
/usr/src/AutoMakeTest/sqlite3-embedded/pragma.c:589: undefined reference to `_sq
lite3VdbeOp3'
/usr/src/AutoMakeTest/sqlite3-embedded/pragma.c:590: undefined reference to `_sq
lite3VdbeOp3'
/usr/src/AutoMakeTest/sqlite3-embedded/pragma.c:592: undefined reference to `_sq
lite3VdbeOp3'
/usr/src/AutoMakeTest/sqlite3-embedded/pragma.c:593: undefined reference to `_sq
lite3VdbeAddOp'
/usr/src/AutoMakeTest/sqlite3-embedded/pragma.c:619: undefined reference to `_sq
lite3StrICmp'
/usr/src/AutoMakeTest/sqlite3-embedded/pragma.c:626: undefined reference to `_sq
lite3StrICmp'
/usr/src/AutoMakeTest/sqlite3-embedded/pragma.c:642: undefined reference to `_sq
lite3ReadSchema'
/usr/src/AutoMakeTest/sqlite3-embedded/pragma.c:643: undefined reference to `_sq
lite3VdbeSetNumCols'
/usr/src/AutoMakeTest/sqlite3-embedded/pragma.c:644: undefined reference to `_sq
lite3VdbeSetColName'
/usr/src/AutoMakeTest/sqlite3-embedded/pragma.c:645: undefined reference to `_sq
lite3VdbeAddOp'
/usr/src/AutoMakeTest/sqlite3-embedded/pragma.c:661: undefined reference to `_sq
lite3VdbeAddOp'
/usr/src/AutoMakeTest/sqlite3-embedded/pragma.c:665: undefined reference to `_sq
lite3VdbeAddOp'
/usr/src/AutoMakeTest/sqlite3-embedded/pragma.c:767: undefined reference to `_sq
lite3StrICmp'
/usr/src/AutoMakeTest/sqlite3-embedded/pragma.c:804: undefined reference to `_sq
lite3StrICmp'
/usr/src/AutoMakeTest/sqlite3-embedded/pragma.c:810: undefined reference to `_sq
lite3ErrorMsg'
/usr/src/AutoMakeTest/sqlite3-embedded/pragma.c:843: undefined reference to `_sq
lite3StrICmp'
/usr/src/AutoMakeTest/sqlite3-embedded/pragma.c:860: undefined reference to `_sq
lite3VdbeAddOpList'
/usr/src/AutoMakeTest/sqlite3-embedded/pragma.c:861: undefined reference to `_sq
lite3VdbeChangeP1'
/usr/src/AutoMakeTest/sqlite3-embedded/pragma.c:862: undefined reference to `_sq
lite3VdbeChangeP1'
/usr/src/AutoMakeTest/sqlite3-embedded/pragma.c:863: undefined reference to `_sq
lite3VdbeChangeP1'
/usr/src/AutoMakeTest/sqlite3-embedded/pragma.c:864: undefined reference to `_sq
lite3VdbeChangeP2'
/usr/src/AutoMakeTest/sqlite3-embedded/pragma.c:871: undefined reference to `_sq
lite3VdbeAddOpList'
/usr/src/AutoMakeTest/sqlite3-embedded/pragma.c:872: undefined reference to `_sq
lite3VdbeChangeP1'
/usr/src/AutoMakeTest/sqlite3-embedded/pragma.c:873: undefined reference to `_sq
lite3VdbeChangeP2'
/usr/src/AutoMakeTest/sqlite3-embedded/pragma.c:874: undefined reference to `_sq
lite3VdbeSetNumCols'
/usr/src/AutoMakeTest/sqlite3-embedded/pragma.c:843: undefined reference to `_sq
lite3StrICmp'
/usr/src/AutoMakeTest/sqlite3-embedded/pragma.c:670: undefined reference to `_sq
lite3VdbeAddOp'
/usr/src/AutoMakeTest/sqlite3-embedded/pragma.c:671: undefined reference to `_sq
lite3VdbeAddOp'
/usr/src/AutoMakeTest/sqlite3-embedded/pragma.c:672: undefined reference to `_sq
lite3VdbeOp3'
/usr/src/AutoMakeTest/sqlite3-embedded/pragma.c:673: undefined reference to `_sq
lite3VdbeAddOp'
/usr/src/AutoMakeTest/sqlite3-embedded/pragma.c:674: undefined reference to `_sq
lite3VdbeOp3'
/usr/src/AutoMakeTest/sqlite3-embedded/pragma.c:677: undefined reference to `_sq
lite3VdbeAddOp'
/usr/src/AutoMakeTest/sqlite3-embedded/pragma.c:678: undefined reference to `_sq
lite3VdbeAddOp'
/usr/src/AutoMakeTest/sqlite3-embedded/pragma.c:679: undefined reference to `_sq
lite3VdbeAddOp'
/usr/src/AutoMakeTest/sqlite3-embedded/pragma.c:739: undefined reference to `_sq
lite3VdbeAddOpList'
/usr/src/AutoMakeTest/sqlite3-embedded/pragma.c:740: undefined reference to `_sq
lite3VdbeJumpHere'
/usr/src/AutoMakeTest/sqlite3-embedded/pragma.c:691: undefined reference to `_sq
lite3VdbeAddOp'
/usr/src/AutoMakeTest/sqlite3-embedded/pragma.c:692: undefined reference to `_sq
lite3VdbeAddOp'
/usr/src/AutoMakeTest/sqlite3-embedded/pragma.c:693: undefined reference to `_sq
lite3VdbeAddOp'
/usr/src/AutoMakeTest/sqlite3-embedded/pragma.c:706: undefined reference to `_sq
lite3VdbeAddOp'
/usr/src/AutoMakeTest/sqlite3-embedded/pragma.c:707: undefined reference to `_sq
lite3VdbeAddOpList'
/usr/src/AutoMakeTest/sqlite3-embedded/pragma.c:708: undefined reference to `_sq
lite3VdbeChangeP3'
/usr/src/AutoMakeTest/sqlite3-embedded/pragma.c:709: undefined reference to `_sq
lite3VdbeJumpHere'
/usr/src/AutoMakeTest/sqlite3-embedded/pragma.c:711: undefined reference to `_sq
lite3VdbeAddOp'
/usr/src/AutoMakeTest/sqlite3-embedded/pragma.c:712: undefined reference to `_sq
lite3VdbeJumpHere'
/usr/src/AutoMakeTest/sqlite3-embedded/pragma.c:729: undefined reference to `_sq
lite3VdbeAddOpList'
/usr/src/AutoMakeTest/sqlite3-embedded/pragma.c:730: undefined reference to `_sq
lite3VdbeChangeP1'
/usr/src/AutoMakeTest/sqlite3-embedded/pragma.c:731: undefined reference to `_sq
lite3VdbeChangeP2'
/usr/src/AutoMakeTest/sqlite3-embedded/pragma.c:732: undefined reference to `_sq
lite3VdbeChangeP1'
/usr/src/AutoMakeTest/sqlite3-embedded/pragma.c:733: undefined reference to `_sq
lite3VdbeChangeP2'
/usr/src/AutoMakeTest/sqlite3-embedded/pragma.c:734: undefined reference to `_sq
lite3VdbeJumpHere'
/usr/src/AutoMakeTest/sqlite3-embedded/pragma.c:735: undefined reference to `_sq
lite3VdbeChangeP3'
/usr/src/AutoMakeTest/sqlite3-embedded/pragma.c:785: undefined reference to `_sq
lite3ReadSchema'
/usr/src/AutoMakeTest/sqlite3-embedded/pragma.c:786: undefined reference to `_sq
lite3VdbeSetNumCols'
/usr/src/AutoMakeTest/sqlite3-embedded/pragma.c:787: undefined reference to `_sq
lite3VdbeSetColName'
/usr/src/AutoMakeTest/sqlite3-embedded/pragma.c:788: undefined reference to `_sq
lite3VdbeAddOp'
/usr/src/AutoMakeTest/sqlite3-embedded/pragma.c:791: undefined reference to `_sq
lite3VdbeChangeP3'
../.libs/libopenpbx.a(libopenpbx_la-printf.o): In function `base_vprintf':
/usr/src/AutoMakeTest/sqlite3-embedded/printf.c:690: undefined reference to `_sq
lite3FreeX'
/usr/src/AutoMakeTest/sqlite3-embedded/printf.c:608: undefined reference to `_sq
lite3Malloc'
../.libs/libopenpbx.a(libopenpbx_la-printf.o): In function `printf_realloc':
/usr/src/AutoMakeTest/sqlite3-embedded/printf.c:784: undefined reference to `_sq
lite3Realloc'
../.libs/libopenpbx.a(libopenpbx_la-select.o): In function `sqlite3SelectNew':
/usr/src/AutoMakeTest/sqlite3-embedded/select.c:36: undefined reference to `_sql
ite3Malloc'
../.libs/libopenpbx.a(libopenpbx_la-select.o): In function `sqlite3JoinType':
/usr/src/AutoMakeTest/sqlite3-embedded/select.c:111: undefined reference to `_sq
lite3StrNICmp'
/usr/src/AutoMakeTest/sqlite3-embedded/select.c:130: undefined reference to `_sq
lite3ErrorMsg'
/usr/src/AutoMakeTest/sqlite3-embedded/select.c:134: undefined reference to `_sq
lite3ErrorMsg'
../.libs/libopenpbx.a(libopenpbx_la-select.o): In function `columnIndex':
/usr/src/AutoMakeTest/sqlite3-embedded/select.c:148: undefined reference to `_sq
lite3StrICmp'
../.libs/libopenpbx.a(libopenpbx_la-select.o): In function `pushOntoSorter':
/usr/src/AutoMakeTest/sqlite3-embedded/select.c:356: undefined reference to `_sq
lite3VdbeAddOp'
/usr/src/AutoMakeTest/sqlite3-embedded/select.c:357: undefined reference to `_sq
lite3VdbeAddOp'
/usr/src/AutoMakeTest/sqlite3-embedded/select.c:358: undefined reference to `_sq
lite3VdbeAddOp'
/usr/src/AutoMakeTest/sqlite3-embedded/select.c:359: undefined reference to `_sq
lite3VdbeAddOp'
../.libs/libopenpbx.a(libopenpbx_la-select.o): In function `codeLimiter':
/usr/src/AutoMakeTest/sqlite3-embedded/select.c:373: undefined reference to `_sq
lite3VdbeCurrentAddr'
/usr/src/AutoMakeTest/sqlite3-embedded/select.c:375: undefined reference to `_sq
lite3VdbeAddOp'
/usr/src/AutoMakeTest/sqlite3-embedded/select.c:376: undefined reference to `_sq
lite3VdbeAddOp'
/usr/src/AutoMakeTest/sqlite3-embedded/select.c:378: undefined reference to `_sq
lite3VdbeAddOp'
/usr/src/AutoMakeTest/sqlite3-embedded/select.c:380: undefined reference to `_sq
lite3VdbeAddOp'
/usr/src/AutoMakeTest/sqlite3-embedded/select.c:384: undefined reference to `_sq
lite3VdbeAddOp'
../.libs/libopenpbx.a(libopenpbx_la-select.o):/usr/src/AutoMakeTest/sqlite3-embe
dded/select.c:408: more undefined references to `_sqlite3VdbeAddOp' follow
../.libs/libopenpbx.a(libopenpbx_la-select.o): In function `codeDistinct':
/usr/src/AutoMakeTest/sqlite3-embedded/select.c:409: undefined reference to `_sq
lite3VdbeCurrentAddr'
/usr/src/AutoMakeTest/sqlite3-embedded/select.c:409: undefined reference to `_sq
lite3VdbeAddOp'
/usr/src/AutoMakeTest/sqlite3-embedded/select.c:410: undefined reference to `_sq
lite3VdbeAddOp'
/usr/src/AutoMakeTest/sqlite3-embedded/select.c:411: undefined reference to `_sq
lite3VdbeAddOp'
/usr/src/AutoMakeTest/sqlite3-embedded/select.c:413: undefined reference to `_sq
lite3VdbeAddOp'
../.libs/libopenpbx.a(libopenpbx_la-select.o): In function `selectInnerLoop':
/usr/src/AutoMakeTest/sqlite3-embedded/select.c:459: undefined reference to `_sq
lite3VdbeAddOp'
../.libs/libopenpbx.a(libopenpbx_la-select.o):/usr/src/AutoMakeTest/sqlite3-embe
dded/select.c:592: more undefined references to `_sqlite3VdbeAddOp' follow
../.libs/libopenpbx.a(libopenpbx_la-select.o): In function `selectInnerLoop':
/usr/src/AutoMakeTest/sqlite3-embedded/select.c:527: undefined reference to `_sq
lite3VdbeCurrentAddr'
/usr/src/AutoMakeTest/sqlite3-embedded/select.c:531: undefined reference to `_sq
lite3VdbeAddOp'
/usr/src/AutoMakeTest/sqlite3-embedded/select.c:532: undefined reference to `_sq
lite3VdbeAddOp'
/usr/src/AutoMakeTest/sqlite3-embedded/select.c:533: undefined reference to `_sq
lite3VdbeAddOp'
/usr/src/AutoMakeTest/sqlite3-embedded/select.c:546: undefined reference to `_sq
lite3VdbeJumpHere'
/usr/src/AutoMakeTest/sqlite3-embedded/select.c:498: undefined reference to `_sq
lite3VdbeAddOp'
/usr/src/AutoMakeTest/sqlite3-embedded/select.c:499: undefined reference to `_sq
lite3VdbeChangeP3'
/usr/src/AutoMakeTest/sqlite3-embedded/select.c:500: undefined reference to `_sq
lite3VdbeAddOp'
/usr/src/AutoMakeTest/sqlite3-embedded/select.c:484: undefined reference to `_sq
lite3VdbeAddOp'
/usr/src/AutoMakeTest/sqlite3-embedded/select.c:486: undefined reference to `_sq
lite3VdbeChangeP3'
/usr/src/AutoMakeTest/sqlite3-embedded/select.c:543: undefined reference to `_sq
lite3VdbeOp3'
/usr/src/AutoMakeTest/sqlite3-embedded/select.c:544: undefined reference to `_sq
lite3VdbeAddOp'
/usr/src/AutoMakeTest/sqlite3-embedded/select.c:560: undefined reference to `_sq
lite3VdbeAddOp'
../.libs/libopenpbx.a(libopenpbx_la-select.o): In function `keyInfoFromExprList'
:
/usr/src/AutoMakeTest/sqlite3-embedded/select.c:623: undefined reference to `_sq
lite3Malloc'
../.libs/libopenpbx.a(libopenpbx_la-select.o): In function `generateSortTail':
/usr/src/AutoMakeTest/sqlite3-embedded/select.c:656: undefined reference to `_sq
lite3VdbeMakeLabel'
/usr/src/AutoMakeTest/sqlite3-embedded/select.c:657: undefined reference to `_sq
lite3VdbeMakeLabel'
/usr/src/AutoMakeTest/sqlite3-embedded/select.c:663: undefined reference to `_sq
lite3VdbeAddOp'
/usr/src/AutoMakeTest/sqlite3-embedded/select.c:665: undefined reference to `_sq
lite3VdbeAddOp'
/usr/src/AutoMakeTest/sqlite3-embedded/select.c:677: undefined reference to `_sq
lite3VdbeCurrentAddr'
/usr/src/AutoMakeTest/sqlite3-embedded/select.c:677: undefined reference to `_sq
lite3VdbeAddOp'
/usr/src/AutoMakeTest/sqlite3-embedded/select.c:678: undefined reference to `_sq
lite3VdbeAddOp'
/usr/src/AutoMakeTest/sqlite3-embedded/select.c:679: undefined reference to `_sq
lite3VdbeCurrentAddr'
/usr/src/AutoMakeTest/sqlite3-embedded/select.c:679: undefined reference to `_sq
lite3VdbeAddOp'
/usr/src/AutoMakeTest/sqlite3-embedded/select.c:680: undefined reference to `_sq
lite3VdbeOp3'
/usr/src/AutoMakeTest/sqlite3-embedded/select.c:705: undefined reference to `_sq
lite3VdbeAddOp'
/usr/src/AutoMakeTest/sqlite3-embedded/select.c:713: undefined reference to `_sq
lite3VdbeResolveLabel'
/usr/src/AutoMakeTest/sqlite3-embedded/select.c:714: undefined reference to `_sq
lite3VdbeAddOp'
/usr/src/AutoMakeTest/sqlite3-embedded/select.c:687: undefined reference to `_sq
lite3VdbeAddOp'
/usr/src/AutoMakeTest/sqlite3-embedded/select.c:669: undefined reference to `_sq
lite3VdbeAddOp'
/usr/src/AutoMakeTest/sqlite3-embedded/select.c:670: undefined reference to `_sq
lite3VdbeAddOp'
/usr/src/AutoMakeTest/sqlite3-embedded/select.c:695: undefined reference to `_sq
lite3VdbeAddOp'
../.libs/libopenpbx.a(libopenpbx_la-select.o):/usr/src/AutoMakeTest/sqlite3-embe
dded/select.c:696: more undefined references to `_sqlite3VdbeAddOp' follow
../.libs/libopenpbx.a(libopenpbx_la-select.o): In function `generateColumnNames'
:
/usr/src/AutoMakeTest/sqlite3-embedded/select.c:840: undefined reference to `_sq
lite3_malloc_failed'
/usr/src/AutoMakeTest/sqlite3-embedded/select.c:844: undefined reference to `_sq
lite3VdbeSetNumCols'
/usr/src/AutoMakeTest/sqlite3-embedded/select.c:876: undefined reference to `_sq
lite3SetString'
/usr/src/AutoMakeTest/sqlite3-embedded/select.c:877: undefined reference to `_sq
lite3VdbeSetColName'
/usr/src/AutoMakeTest/sqlite3-embedded/select.c:888: undefined reference to `_sq
lite3VdbeSetColName'
/usr/src/AutoMakeTest/sqlite3-embedded/select.c:813: undefined reference to `_sq
lite3VdbeSetColName'
/usr/src/AutoMakeTest/sqlite3-embedded/select.c:879: undefined reference to `_sq
lite3VdbeSetColName'
/usr/src/AutoMakeTest/sqlite3-embedded/select.c:882: undefined reference to `_sq
lite3VdbeSetColName'
../.libs/libopenpbx.a(libopenpbx_la-select.o): In function `sqlite3GetVdbe':
/usr/src/AutoMakeTest/sqlite3-embedded/select.c:1324: undefined reference to `_s
qlite3VdbeCreate'
../.libs/libopenpbx.a(libopenpbx_la-select.o): In function `computeLimitRegister
s':
/usr/src/AutoMakeTest/sqlite3-embedded/select.c:1359: undefined reference to `_s
qlite3VdbeAddOp'
/usr/src/AutoMakeTest/sqlite3-embedded/select.c:1360: undefined reference to `_s
qlite3VdbeAddOp'
/usr/src/AutoMakeTest/sqlite3-embedded/select.c:1361: undefined reference to `_s
qlite3VdbeAddOp'
/usr/src/AutoMakeTest/sqlite3-embedded/select.c:1370: undefined reference to `_s
qlite3VdbeAddOp'
/usr/src/AutoMakeTest/sqlite3-embedded/select.c:1371: undefined reference to `_s
qlite3VdbeAddOp'
../.libs/libopenpbx.a(libopenpbx_la-select.o):/usr/src/AutoMakeTest/sqlite3-embe
dded/select.c:1372: more undefined references to `_sqlite3VdbeAddOp' follow
../.libs/libopenpbx.a(libopenpbx_la-select.o): In function `uncreateSortingIndex
':
/usr/src/AutoMakeTest/sqlite3-embedded/select.c:1400: undefined reference to `_s
qlite3VdbeGetOp'
/usr/src/AutoMakeTest/sqlite3-embedded/select.c:1401: undefined reference to `_s
qlite3VdbeChangeP3'
../.libs/libopenpbx.a(libopenpbx_la-select.o): In function `processOrderGroupBy'
:
/usr/src/AutoMakeTest/sqlite3-embedded/select.c:2313: undefined reference to `_s
qlite3ErrorMsg'
/usr/src/AutoMakeTest/sqlite3-embedded/select.c:2303: undefined reference to `_s
qlite3ErrorMsg'
../.libs/libopenpbx.a(libopenpbx_la-select.o): In function `sqlite3SelectResolve
':
/usr/src/AutoMakeTest/sqlite3-embedded/select.c:2431: undefined reference to `_s
qlite3ErrorMsg'
../.libs/libopenpbx.a(libopenpbx_la-select.o): In function `sqlite3ResultSetOfSe
lect':
/usr/src/AutoMakeTest/sqlite3-embedded/select.c:931: undefined reference to `_sq
lite3Malloc'
/usr/src/AutoMakeTest/sqlite3-embedded/select.c:936: undefined reference to `_sq
lite3StrDup'
/usr/src/AutoMakeTest/sqlite3-embedded/select.c:940: undefined reference to `_sq
lite3Malloc'
/usr/src/AutoMakeTest/sqlite3-embedded/select.c:955: undefined reference to `_sq
lite3StrDup'
/usr/src/AutoMakeTest/sqlite3-embedded/select.c:967: undefined reference to `_sq
lite3Dequote'
/usr/src/AutoMakeTest/sqlite3-embedded/select.c:968: undefined reference to `_sq
lite3_malloc_failed'
/usr/src/AutoMakeTest/sqlite3-embedded/select.c:979: undefined reference to `_sq
lite3StrICmp'
/usr/src/AutoMakeTest/sqlite3-embedded/select.c:986: undefined reference to `_sq
lite3FreeX'
/usr/src/AutoMakeTest/sqlite3-embedded/select.c:995: undefined reference to `_sq
lite3StrDup'
/usr/src/AutoMakeTest/sqlite3-embedded/select.c:967: undefined reference to `_sq
lite3Dequote'
/usr/src/AutoMakeTest/sqlite3-embedded/select.c:968: undefined reference to `_sq
lite3_malloc_failed'
/usr/src/AutoMakeTest/sqlite3-embedded/select.c:969: undefined reference to `_sq
lite3FreeX'
../.libs/libopenpbx.a(libopenpbx_la-select.o): In function `prepSelectStmt':
/usr/src/AutoMakeTest/sqlite3-embedded/select.c:1040: undefined reference to `_s
qlite3_malloc_failed'
/usr/src/AutoMakeTest/sqlite3-embedded/select.c:1167: undefined reference to `_s
qlite3StrICmp'
/usr/src/AutoMakeTest/sqlite3-embedded/select.c:1216: undefined reference to `_s
qlite3ErrorMsg'
/usr/src/AutoMakeTest/sqlite3-embedded/select.c:1222: undefined reference to `_s
qlite3FreeX'
/usr/src/AutoMakeTest/sqlite3-embedded/select.c:320: undefined reference to `_sq
lite3ErrorMsg'
/usr/src/AutoMakeTest/sqlite3-embedded/select.c:1218: undefined reference to `_s
qlite3ErrorMsg'
/usr/src/AutoMakeTest/sqlite3-embedded/select.c:320: undefined reference to `_sq
lite3ErrorMsg'
/usr/src/AutoMakeTest/sqlite3-embedded/select.c:294: undefined reference to `_sq
lite3ErrorMsg'
../.libs/libopenpbx.a(libopenpbx_la-select.o): In function `matchOrderbyToColumn
':
/usr/src/AutoMakeTest/sqlite3-embedded/select.c:1307: undefined reference to `_s
qlite3ErrorMsg'
/usr/src/AutoMakeTest/sqlite3-embedded/select.c:1290: undefined reference to `_s
qlite3StrICmp'
/usr/src/AutoMakeTest/sqlite3-embedded/select.c:1293: undefined reference to `_s
qlite3FreeX'
/usr/src/AutoMakeTest/sqlite3-embedded/select.c:1275: undefined reference to `_s
qlite3ErrorMsg'
../.libs/libopenpbx.a(libopenpbx_la-select.o): In function `resetAccumulator':
/usr/src/AutoMakeTest/sqlite3-embedded/select.c:2456: undefined reference to `_s
qlite3VdbeAddOp'
/usr/src/AutoMakeTest/sqlite3-embedded/select.c:2459: undefined reference to `_s
qlite3VdbeAddOp'
/usr/src/AutoMakeTest/sqlite3-embedded/select.c:2463: undefined reference to `_s
qlite3ErrorMsg'
/usr/src/AutoMakeTest/sqlite3-embedded/select.c:2468: undefined reference to `_s
qlite3VdbeOp3'
../.libs/libopenpbx.a(libopenpbx_la-select.o): In function `finalizeAggFunctions
':
/usr/src/AutoMakeTest/sqlite3-embedded/select.c:2485: undefined reference to `_s
qlite3VdbeOp3'
../.libs/libopenpbx.a(libopenpbx_la-select.o): In function `updateAccumulator':
/usr/src/AutoMakeTest/sqlite3-embedded/select.c:2512: undefined reference to `_s
qlite3VdbeMakeLabel'
/usr/src/AutoMakeTest/sqlite3-embedded/select.c:2526: undefined reference to `_s
qlite3VdbeOp3'
/usr/src/AutoMakeTest/sqlite3-embedded/select.c:2528: undefined reference to `_s
qlite3VdbeOp3'
/usr/src/AutoMakeTest/sqlite3-embedded/select.c:2535: undefined reference to `_s
qlite3VdbeAddOp'
/usr/src/AutoMakeTest/sqlite3-embedded/select.c:2530: undefined reference to `_s
qlite3VdbeResolveLabel'
../.libs/libopenpbx.a(libopenpbx_la-select.o): In function `sqlite3Select':
/usr/src/AutoMakeTest/sqlite3-embedded/select.c:2619: undefined reference to `_s
qlite3_malloc_failed'
/usr/src/AutoMakeTest/sqlite3-embedded/select.c:3124: undefined reference to `_s
qlite3FreeX'
/usr/src/AutoMakeTest/sqlite3-embedded/select.c:3125: undefined reference to `_s
qlite3FreeX'
/usr/src/AutoMakeTest/sqlite3-embedded/select.c:1736: undefined reference to `_s
qlite3VdbeChangeP2'
/usr/src/AutoMakeTest/sqlite3-embedded/select.c:1757: undefined reference to `_s
qlite3Malloc'
/usr/src/AutoMakeTest/sqlite3-embedded/select.c:1726: undefined reference to `_s
qlite3ErrorMsg'
/usr/src/AutoMakeTest/sqlite3-embedded/select.c:2051: undefined reference to `_s
qlite3FreeX'
/usr/src/AutoMakeTest/sqlite3-embedded/select.c:2052: undefined reference to `_s
qlite3FreeX'
/usr/src/AutoMakeTest/sqlite3-embedded/select.c:2053: undefined reference to `_s
qlite3FreeX'
/usr/src/AutoMakeTest/sqlite3-embedded/select.c:2088: undefined reference to `_s
qlite3StrNDup'
/usr/src/AutoMakeTest/sqlite3-embedded/select.c:2766: undefined reference to `_s
qlite3VdbeOp3'
/usr/src/AutoMakeTest/sqlite3-embedded/select.c:2809: undefined reference to `_s
qlite3WhereBegin'
/usr/src/AutoMakeTest/sqlite3-embedded/select.c:2830: undefined reference to `_s
qlite3WhereEnd'
/usr/src/AutoMakeTest/sqlite3-embedded/select.c:1566: undefined reference to `_s
qlite3VdbeAddOp'
/usr/src/AutoMakeTest/sqlite3-embedded/select.c:1623: undefined reference to `_s
qlite3VdbeMakeLabel'
/usr/src/AutoMakeTest/sqlite3-embedded/select.c:1624: undefined reference to `_s
qlite3VdbeMakeLabel'
/usr/src/AutoMakeTest/sqlite3-embedded/select.c:1625: undefined reference to `_s
qlite3VdbeAddOp'
/usr/src/AutoMakeTest/sqlite3-embedded/select.c:1627: undefined reference to `_s
qlite3VdbeCurrentAddr'
/usr/src/AutoMakeTest/sqlite3-embedded/select.c:1635: undefined reference to `_s
qlite3VdbeResolveLabel'
/usr/src/AutoMakeTest/sqlite3-embedded/select.c:1636: undefined reference to `_s
qlite3VdbeAddOp'
/usr/src/AutoMakeTest/sqlite3-embedded/select.c:1637: undefined reference to `_s
qlite3VdbeResolveLabel'
/usr/src/AutoMakeTest/sqlite3-embedded/select.c:1716: undefined reference to `_s
qlite3VdbeAddOp'
/usr/src/AutoMakeTest/sqlite3-embedded/select.c:2855: undefined reference to `_s
qlite3VdbeMakeLabel'
/usr/src/AutoMakeTest/sqlite3-embedded/select.c:2882: undefined reference to `_s
qlite3_malloc_failed'
/usr/src/AutoMakeTest/sqlite3-embedded/select.c:2893: undefined reference to `_s
qlite3VdbeMakeLabel'
/usr/src/AutoMakeTest/sqlite3-embedded/select.c:2894: undefined reference to `_s
qlite3VdbeMakeLabel'
/usr/src/AutoMakeTest/sqlite3-embedded/select.c:2895: undefined reference to `_s
qlite3VdbeMakeLabel'
/usr/src/AutoMakeTest/sqlite3-embedded/select.c:2904: undefined reference to `_s
qlite3VdbeOp3'
/usr/src/AutoMakeTest/sqlite3-embedded/select.c:2917: undefined reference to `_s
qlite3VdbeAddOp'
/usr/src/AutoMakeTest/sqlite3-embedded/select.c:2919: undefined reference to `_s
qlite3VdbeAddOp'
/usr/src/AutoMakeTest/sqlite3-embedded/select.c:2921: undefined reference to `_s
qlite3VdbeAddOp'
/usr/src/AutoMakeTest/sqlite3-embedded/select.c:2930: undefined reference to `_s
qlite3VdbeCurrentAddr'
/usr/src/AutoMakeTest/sqlite3-embedded/select.c:2931: undefined reference to `_s
qlite3VdbeAddOp'
/usr/src/AutoMakeTest/sqlite3-embedded/select.c:2933: undefined reference to `_s
qlite3VdbeAddOp'
/usr/src/AutoMakeTest/sqlite3-embedded/select.c:2934: undefined reference to `_s
qlite3VdbeCurrentAddr'
/usr/src/AutoMakeTest/sqlite3-embedded/select.c:2935: undefined reference to `_s
qlite3VdbeAddOp'
/usr/src/AutoMakeTest/sqlite3-embedded/select.c:2937: undefined reference to `_s
qlite3VdbeAddOp'
/usr/src/AutoMakeTest/sqlite3-embedded/select.c:2948: undefined reference to `_s
qlite3VdbeAddOp'
/usr/src/AutoMakeTest/sqlite3-embedded/select.c:2953: undefined reference to `_s
qlite3VdbeCurrentAddr'
/usr/src/AutoMakeTest/sqlite3-embedded/select.c:2955: undefined reference to `_s
qlite3VdbeAddOp'
/usr/src/AutoMakeTest/sqlite3-embedded/select.c:2962: undefined reference to `_s
qlite3VdbeResolveLabel'
/usr/src/AutoMakeTest/sqlite3-embedded/select.c:2963: undefined reference to `_s
qlite3VdbeAddOp'
/usr/src/AutoMakeTest/sqlite3-embedded/select.c:2964: undefined reference to `_s
qlite3WhereBegin'
/usr/src/AutoMakeTest/sqlite3-embedded/select.c:3006: undefined reference to `_s
qlite3VdbeCurrentAddr'
/usr/src/AutoMakeTest/sqlite3-embedded/select.c:3009: undefined reference to `_s
qlite3VdbeAddOp'
/usr/src/AutoMakeTest/sqlite3-embedded/select.c:3014: undefined reference to `_s
qlite3VdbeAddOp'
/usr/src/AutoMakeTest/sqlite3-embedded/select.c:1782: undefined reference to `_s
qlite3VdbeChangeP2'
/usr/src/AutoMakeTest/sqlite3-embedded/select.c:1783: undefined reference to `_s
qlite3VdbeChangeP3'
/usr/src/AutoMakeTest/sqlite3-embedded/select.c:1811: undefined reference to `_s
qlite3VdbeChangeP2'
/usr/src/AutoMakeTest/sqlite3-embedded/select.c:1813: undefined reference to `_s
qlite3VdbeChangeP3'
/usr/src/AutoMakeTest/sqlite3-embedded/select.c:1818: undefined reference to `_s
qlite3FreeX'
/usr/src/AutoMakeTest/sqlite3-embedded/select.c:1726: undefined reference to `_s
qlite3ErrorMsg'
/usr/src/AutoMakeTest/sqlite3-embedded/select.c:1726: undefined reference to `_s
qlite3ErrorMsg'
/usr/src/AutoMakeTest/sqlite3-embedded/select.c:2798: undefined reference to `_s
qlite3VdbeOp3'
/usr/src/AutoMakeTest/sqlite3-embedded/select.c:1512: undefined reference to `_s
qlite3VdbeAddOp'
/usr/src/AutoMakeTest/sqlite3-embedded/select.c:1660: undefined reference to `_s
qlite3VdbeAddOp'
/usr/src/AutoMakeTest/sqlite3-embedded/select.c:1675: undefined reference to `_s
qlite3VdbeAddOp'
/usr/src/AutoMakeTest/sqlite3-embedded/select.c:1699: undefined reference to `_s
qlite3VdbeMakeLabel'
/usr/src/AutoMakeTest/sqlite3-embedded/select.c:1700: undefined reference to `_s
qlite3VdbeMakeLabel'
/usr/src/AutoMakeTest/sqlite3-embedded/select.c:1701: undefined reference to `_s
qlite3VdbeAddOp'
/usr/src/AutoMakeTest/sqlite3-embedded/select.c:1703: undefined reference to `_s
qlite3VdbeAddOp'
/usr/src/AutoMakeTest/sqlite3-embedded/select.c:1704: undefined reference to `_s
qlite3VdbeAddOp'
/usr/src/AutoMakeTest/sqlite3-embedded/select.c:1712: undefined reference to `_s
qlite3VdbeResolveLabel'
/usr/src/AutoMakeTest/sqlite3-embedded/select.c:1713: undefined reference to `_s
qlite3VdbeAddOp'
/usr/src/AutoMakeTest/sqlite3-embedded/select.c:1714: undefined reference to `_s
qlite3VdbeResolveLabel'
/usr/src/AutoMakeTest/sqlite3-embedded/select.c:1715: undefined reference to `_s
qlite3VdbeAddOp'
/usr/src/AutoMakeTest/sqlite3-embedded/select.c:2789: undefined reference to `_s
qlite3VdbeAddOp'
/usr/src/AutoMakeTest/sqlite3-embedded/select.c:2669: undefined reference to `_s
qlite3ErrorMsg'
/usr/src/AutoMakeTest/sqlite3-embedded/select.c:2789: undefined reference to `_s
qlite3VdbeAddOp'
/usr/src/AutoMakeTest/sqlite3-embedded/select.c:2187: undefined reference to `_s
qlite3StrNICmp'
/usr/src/AutoMakeTest/sqlite3-embedded/select.c:3078: undefined reference to `_s
qlite3WhereBegin'
/usr/src/AutoMakeTest/sqlite3-embedded/select.c:3081: undefined reference to `_s
qlite3WhereEnd'
/usr/src/AutoMakeTest/sqlite3-embedded/select.c:3090: undefined reference to `_s
qlite3VdbeResolveLabel'
/usr/src/AutoMakeTest/sqlite3-embedded/select.c:3024: undefined reference to `_s
qlite3VdbeAddOp'
/usr/src/AutoMakeTest/sqlite3-embedded/select.c:3026: undefined reference to `_s
qlite3VdbeChangeP3'
/usr/src/AutoMakeTest/sqlite3-embedded/select.c:3018: undefined reference to `_s
qlite3VdbeAddOp'
/usr/src/AutoMakeTest/sqlite3-embedded/select.c:3020: undefined reference to `_s
qlite3VdbeAddOp'
/usr/src/AutoMakeTest/sqlite3-embedded/select.c:3038: undefined reference to `_s
qlite3VdbeResolveLabel'
/usr/src/AutoMakeTest/sqlite3-embedded/select.c:3040: undefined reference to `_s
qlite3VdbeAddOp'
/usr/src/AutoMakeTest/sqlite3-embedded/select.c:3042: undefined reference to `_s
qlite3VdbeAddOp'
/usr/src/AutoMakeTest/sqlite3-embedded/select.c:3044: undefined reference to `_s
qlite3VdbeAddOp'
/usr/src/AutoMakeTest/sqlite3-embedded/select.c:3046: undefined reference to `_s
qlite3VdbeAddOp'
/usr/src/AutoMakeTest/sqlite3-embedded/select.c:3052: undefined reference to `_s
qlite3VdbeResolveLabel'
/usr/src/AutoMakeTest/sqlite3-embedded/select.c:3054: undefined reference to `_s
qlite3VdbeAddOp'
/usr/src/AutoMakeTest/sqlite3-embedded/select.c:3060: undefined reference to `_s
qlite3VdbeAddOp'
/usr/src/AutoMakeTest/sqlite3-embedded/select.c:3068: undefined reference to `_s
qlite3VdbeAddOp'
/usr/src/AutoMakeTest/sqlite3-embedded/select.c:2981: undefined reference to `_s
qlite3VdbeAddOp'
/usr/src/AutoMakeTest/sqlite3-embedded/select.c:2989: undefined reference to `_s
qlite3VdbeAddOp'
../.libs/libopenpbx.a(libopenpbx_la-select.o):/usr/src/AutoMakeTest/sqlite3-embe
dded/select.c:2993: more undefined references to `_sqlite3VdbeAddOp' follow
../.libs/libopenpbx.a(libopenpbx_la-select.o): In function `sqlite3Select':
/usr/src/AutoMakeTest/sqlite3-embedded/select.c:2995: undefined reference to `_s
qlite3WhereEnd'
/usr/src/AutoMakeTest/sqlite3-embedded/select.c:2996: undefined reference to `_s
qlite3VdbeAddOp'
/usr/src/AutoMakeTest/sqlite3-embedded/select.c:2226: undefined reference to `_s
qlite3VdbeAddOp'
/usr/src/AutoMakeTest/sqlite3-embedded/select.c:2240: undefined reference to `_s
qlite3VdbeMakeLabel'
/usr/src/AutoMakeTest/sqlite3-embedded/select.c:2252: undefined reference to `_s
qlite3VdbeAddOp'
/usr/src/AutoMakeTest/sqlite3-embedded/select.c:2253: undefined reference to `_s
qlite3VdbeOp3'
/usr/src/AutoMakeTest/sqlite3-embedded/select.c:2256: undefined reference to `_s
qlite3VdbeAddOp'
/usr/src/AutoMakeTest/sqlite3-embedded/select.c:2257: undefined reference to `_s
qlite3VdbeAddOp'
/usr/src/AutoMakeTest/sqlite3-embedded/select.c:2260: undefined reference to `_s
qlite3VdbeAddOp'
/usr/src/AutoMakeTest/sqlite3-embedded/select.c:2261: undefined reference to `_s
qlite3VdbeAddOp'
/usr/src/AutoMakeTest/sqlite3-embedded/select.c:2262: undefined reference to `_s
qlite3VdbeAddOp'
../.libs/libopenpbx.a(libopenpbx_la-select.o):/usr/src/AutoMakeTest/sqlite3-embe
dded/select.c:2263: more undefined references to `_sqlite3VdbeAddOp' follow
../.libs/libopenpbx.a(libopenpbx_la-select.o): In function `sqlite3Select':
/usr/src/AutoMakeTest/sqlite3-embedded/select.c:2270: undefined reference to `_s
qlite3VdbeResolveLabel'
/usr/src/AutoMakeTest/sqlite3-embedded/select.c:2271: undefined reference to `_s
qlite3VdbeAddOp'
/usr/src/AutoMakeTest/sqlite3-embedded/select.c:2189: undefined reference to `_s
qlite3StrNICmp'
/usr/src/AutoMakeTest/sqlite3-embedded/select.c:3062: undefined reference to `_s
qlite3WhereEnd'
../.libs/libopenpbx.a(libopenpbx_la-select.o): In function `sqlite3SelectDelete'
:
/usr/src/AutoMakeTest/sqlite3-embedded/select.c:347: undefined reference to `_sq
lite3FreeX'
../.libs/libopenpbx.a(libopenpbx_la-select.o): In function `generateSortTail':
/usr/src/AutoMakeTest/sqlite3-embedded/select.c:715: undefined reference to `_sq
lite3VdbeResolveLabel'
../.libs/libopenpbx.a(libopenpbx_la-complete.o): In function `sqlite3_complete':

/usr/src/AutoMakeTest/sqlite3-embedded/complete.c:213: undefined reference to `_
sqlite3StrNICmp'
/usr/src/AutoMakeTest/sqlite3-embedded/complete.c:189: undefined reference to `_
sqlite3StrNICmp'
/usr/src/AutoMakeTest/sqlite3-embedded/complete.c:201: undefined reference to `_
sqlite3StrNICmp'
/usr/src/AutoMakeTest/sqlite3-embedded/complete.c:209: undefined reference to `_
sqlite3StrNICmp'
/usr/src/AutoMakeTest/sqlite3-embedded/complete.c:197: undefined reference to `_
sqlite3StrNICmp'
../.libs/libopenpbx.a(libopenpbx_la-complete.o): In function `sqlite3_complete16
':
/usr/src/AutoMakeTest/sqlite3-embedded/complete.c:253: undefined reference to `_
sqlite3ValueNew'
/usr/src/AutoMakeTest/sqlite3-embedded/complete.c:254: undefined reference to `_
sqlite3ValueSetStr'
/usr/src/AutoMakeTest/sqlite3-embedded/complete.c:255: undefined reference to `_
sqlite3ValueText'
/usr/src/AutoMakeTest/sqlite3-embedded/complete.c:259: undefined reference to `_
sqlite3ValueFree'
../.libs/libopenpbx.a(libopenpbx_la-table.o): In function `sqlite3_get_table_cb'
:
/usr/src/AutoMakeTest/sqlite3-embedded/table.c:81: undefined reference to `_sqli
te3SetString'
../.libs/libopenpbx.a(libopenpbx_la-table.o): In function `sqlite3_get_table':
/usr/src/AutoMakeTest/sqlite3-embedded/table.c:160: undefined reference to `_sql
ite3FreeX'
/usr/src/AutoMakeTest/sqlite3-embedded/table.c:155: undefined reference to `_sql
ite3FreeX'
../.libs/libopenpbx.a(libopenpbx_la-tokenize.o): In function `keywordCode':
/usr/src/AutoMakeTest/sqlite3-embedded/keywordhash.h:85: undefined reference to
`_sqlite3UpperToLower'
/usr/src/AutoMakeTest/sqlite3-embedded/keywordhash.h:85: undefined reference to
`_sqlite3UpperToLower'
/usr/src/AutoMakeTest/sqlite3-embedded/keywordhash.h:89: undefined reference to
`_sqlite3StrNICmp'
../.libs/libopenpbx.a(libopenpbx_la-tokenize.o): In function `sqlite3RunParser':

/usr/src/AutoMakeTest/sqlite3-embedded/tokenize.c:345: undefined reference to `_
sqlite3Malloc'
/usr/src/AutoMakeTest/sqlite3-embedded/tokenize.c:393: undefined reference to `_
sqlite3_malloc_failed'
/usr/src/AutoMakeTest/sqlite3-embedded/tokenize.c:393: undefined reference to `_
sqlite3_malloc_failed'
/usr/src/AutoMakeTest/sqlite3-embedded/tokenize.c:405: undefined reference to `_
sqlite3FreeX'
/usr/src/AutoMakeTest/sqlite3-embedded/tokenize.c:406: undefined reference to `_
sqlite3_malloc_failed'
/usr/src/AutoMakeTest/sqlite3-embedded/tokenize.c:427: undefined reference to `_
sqlite3DeleteTrigger'
/usr/src/AutoMakeTest/sqlite3-embedded/tokenize.c:428: undefined reference to `_
sqlite3FreeX'
/usr/src/AutoMakeTest/sqlite3-embedded/tokenize.c:369: undefined reference to `_
sqlite3SetString'
/usr/src/AutoMakeTest/sqlite3-embedded/tokenize.c:410: undefined reference to `_
sqlite3SetString'
/usr/src/AutoMakeTest/sqlite3-embedded/tokenize.c:417: undefined reference to `_
sqlite3FreeX'
/usr/src/AutoMakeTest/sqlite3-embedded/tokenize.c:423: undefined reference to `_
sqlite3VdbeDelete'
/usr/src/AutoMakeTest/sqlite3-embedded/tokenize.c:376: undefined reference to `_
sqlite3FreeX'
/usr/src/AutoMakeTest/sqlite3-embedded/tokenize.c:347: undefined reference to `_
sqlite3SetString'
collect2: ld returned 1 exit status
make[1]: *** [pbx_spool.la] Error 1
make[1]: Leaving directory `/usr/src/AutoMakeTest/pbx'
make: *** [all-recursive] Error 1