All pastes #260110 Raw Edit

Dreamglider

public text v1 · immutable
#260110 ·published 2006-11-28 00:58 UTC
rendered paste body
regin@gericom:~/Desktop/zd1211-driver-r83$ sudo make install
Password:
/lib/modules/2.6.17-10-generic/build
/home/regin/Desktop/zd1211-driver-r83
-I/home/regin/Desktop/zd1211-driver-r83/src/include -fomit-frame-pointer -O2 -Wall -Wstrict-prototypes -pipe -DZDCONF_WE_STAT_SUPPORT=1 -DHOST_IF_USB -DAMAC -DGCCK -DOFDM -DHOSTAPD_SUPPORT -DUSE_EP4_SET_REG -DDOWNLOADFIRMWARE -DfTX_GAIN_OFDM=0 -DfNEW_CODE_MAP=1 -DfWRITE_WORD_REG=1 -DfREAD_MUL_REG=1 -DENHANCE_RX=1 -DZD1211
src/zd1205.o src/zdasocsvc.o src/zdauthreq.o src/zdauthrsp.o src/zdmmrx.o src/zdshared.o src/zdhci.o src/zdglobal.o src/zdencrypt.o src/zdpmfilter.o src/zdpsmon.o src/zdsynch.o src/zdbuf.o src/zd1205_proc.o src/zdhw.o src/zddebug.o src/zdtkipseed.o src/zdmic.o src/zdusb.o src/zd1211.o
make -C /lib/modules/2.6.17-10-generic/build SUBDIRS=/home/regin/Desktop/zd1211-driver-r83 modules
make[1]: Entering directory `/usr/src/linux-headers-2.6.17-10-generic'
  Building modules, stage 2.
  MODPOST
make[1]: Leaving directory `/usr/src/linux-headers-2.6.17-10-generic'
mkdir -p /lib/modules/2.6.17-10-generic/net
cp zd1211.ko /lib/modules/2.6.17-10-generic/net
depmod -a 2.6.17-10-generic
gcc -o apdbg apdbg.c
apdbg.c:1:19: error: stdio.h: No such file or directory
apdbg.c:2:20: error: stdlib.h: No such file or directory
apdbg.c:3:20: error: unistd.h: No such file or directory
apdbg.c:4:20: error: string.h: No such file or directory
apdbg.c:5:19: error: errno.h: No such file or directory
apdbg.c:6:19: error: ctype.h: No such file or directory
apdbg.c:7:23: error: sys/types.h: No such file or directory
apdbg.c:8:24: error: sys/socket.h: No such file or directory
apdbg.c:9:23: error: sys/ioctl.h: No such file or directory
apdbg.c:10:20: error: net/if.h: No such file or directory
apdbg.c:11:24: error: netinet/in.h: No such file or directory
apdbg.c:13:27: error: linux/sockios.h: No such file or directory
apdbg.c:78: warning: ‘struct ifreq’ declared inside parameter list
apdbg.c:78: warning: its scope is only this definition or declaration, which is probably not what you want
apdbg.c: In function ‘set_ioctl’:
apdbg.c:80: error: ‘SIOCDEVPRIVATE’ undeclared (first use in this function)
apdbg.c:80: error: (Each undeclared identifier is reported only once
apdbg.c:80: error: for each function it appears in.)
apdbg.c:82: warning: incompatible implicit declaration of built-in function ‘fprintf’
apdbg.c:82: error: ‘stderr’ undeclared (first use in this function)
apdbg.c:83: error: ‘errno’ undeclared (first use in this function)
apdbg.c: At top level:
apdbg.c:91: warning: ‘struct ifreq’ declared inside parameter list
apdbg.c: In function ‘read_reg’:
apdbg.c:95: warning: passing argument 2 of ‘set_ioctl’ from incompatible pointer type
apdbg.c: At top level:
apdbg.c:105: warning: ‘struct ifreq’ declared inside parameter list
apdbg.c: In function ‘read_mem’:
apdbg.c:110: warning: passing argument 2 of ‘set_ioctl’ from incompatible pointer type
apdbg.c: In function ‘main’:
apdbg.c:132: error: storage size of ‘req’ isn’t known
apdbg.c:133: error: ‘NULL’ undeclared (first use in this function)
apdbg.c:140: warning: incompatible implicit declaration of built-in function ‘printf’
apdbg.c:161: warning: incompatible implicit declaration of built-in function ‘exit’
apdbg.c:164: warning: incompatible implicit declaration of built-in function ‘strcpy’
apdbg.c:169: error: ‘AF_INET’ undeclared (first use in this function)
apdbg.c:169: error: ‘SOCK_RAW’ undeclared (first use in this function)
apdbg.c:169: error: ‘IPPROTO_RAW’ undeclared (first use in this function)
apdbg.c:171: warning: incompatible implicit declaration of built-in function ‘fprintf’
apdbg.c:171: error: ‘stderr’ undeclared (first use in this function)
apdbg.c:171: error: ‘errno’ undeclared (first use in this function)
apdbg.c:172: warning: incompatible implicit declaration of built-in function ‘exit’
apdbg.c:175: warning: incompatible implicit declaration of built-in function ‘sscanf’
apdbg.c:262: warning: incompatible implicit declaration of built-in function ‘fprintf’
apdbg.c:263: warning: incompatible implicit declaration of built-in function ‘exit’
apdbg.c:281: warning: incompatible implicit declaration of built-in function ‘exit’
make: *** [install] Error 1
regin@gericom:~/Desktop/zd1211-driver-r83$