rendered paste body+++ making chrome /var/tmp/pisi/firefox-2.0-34/work/mozilla/extensions/reporter => ../../dist/bin/chrome/reporter.jar
+++ updating chrome ../../dist/bin/chrome/reporter.manifest
gmake[3]: `/var/tmp/pisi/firefox-2.0-34/work/mozilla/extensions/reporter' dizininden çıkılıyor
gmake[3]:`/var/tmp/pisi/firefox-2.0-34/work/mozilla/extensions/spellcheck' dizinine giriliyor
gmake[4]:`/var/tmp/pisi/firefox-2.0-34/work/mozilla/extensions/spellcheck/src' dizinine giriliyor
rm -f libspellchecker.so
c++ -fno-rtti -fno-exceptions -Wall -Wconversion -Wpointer-arith -Wcast-align -Woverloaded-virtual -Wsynth -Wno-ctor-dtor-privacy -Wno-non-virtual-dtor -Wno-long-long -pedantic -mtune=i686 -O2 -pipe -fomit-frame-pointer -fshort-wchar -pthread -pipe -DNDEBUG -DTRIMMED -ffunction-sections -mtune=i686 -Os -fno-strict-aliasing -pipe -fPIC -shared -Wl,-z,defs -Wl,-h,libspellchecker.so -o libspellchecker.so mozSpellCheckerFactory.o mozSpellChecker.o mozPersonalDictionary.o mozEnglishWordUtils.o mozGenericWordUtils.o mozSpellI18NManager.o mozInlineSpellChecker.o mozInlineSpellWordUtil.o -L../../../dist/bin -L../../../dist/lib -L../../../dist/bin -lxpcom -lxpcom_core -L../../../dist/bin -L/usr/lib -lplds4 -lplc4 -lnspr4 -lpthread -ldl ../../../dist/lib/libunicharutil_s.a -Wl,--version-script -Wl,../../../build/unix/gnu-ld-scripts/components-version-script -Wl,-Bsymbolic -ldl -lm
/usr/bin/ld: warning: creating a DT_TEXTREL in object.
/usr/bin/ld: mozInlineSpellChecker.o(.text._ZN21mozInlineSpellChecker11ResumeCheckEP20mozInlineSpellStatus+0x90): unresolvable relocation against symbol `nsTArray_base::sEmptyHdr'
/usr/bin/ld: final link failed: Nonrepresentable section on output
collect2: ld returned 1 exit status
gmake[4]: *** [libspellchecker.so] Hata 1
gmake[4]: `/var/tmp/pisi/firefox-2.0-34/work/mozilla/extensions/spellcheck/src' dizininden çıkılıyor
gmake[3]: *** [libs] Hata 2
gmake[3]: `/var/tmp/pisi/firefox-2.0-34/work/mozilla/extensions/spellcheck' dizininden çıkılıyor
gmake[2]: *** [libs] Hata 2
gmake[2]: `/var/tmp/pisi/firefox-2.0-34/work/mozilla/extensions' dizininden çıkılıyor
gmake[1]: *** [tier_99] Hata 2
gmake[1]: `/var/tmp/pisi/firefox-2.0-34/work/mozilla' dizininden çıkılıyor
make: *** [default] Hata 2