All pastes #259658 Raw Edit

Untitled

public text v1 · immutable
#259658 ·published 2006-11-27 17:00 UTC
rendered paste body
i686-pc-linux-gnu-ranlib .libs/libgncmod-test-engine.a
creating libgncmod-test-engine.la
(cd .libs && rm -f libgncmod-test-engine.la && ln -s ../libgncmod-test-engine.la libgncmod-test-engine.la)
make[5]: Leaving directory `/var/tmp/portage/gnucash-2.0.2/work/gnucash-2.0.2/src/engine/test-core'
Making all in test
make[5]: Entering directory `/var/tmp/portage/gnucash-2.0.2/work/gnucash-2.0.2/src/engine/test'
if i686-pc-linux-gnu-gcc -DHAVE_CONFIG_H -I. -I. -I../../.. -I../../.. -I../../.. -I../../..    -I../../.. -I../../../src -I../../../src/gnc-module -I../../../src/test-core -I../../../src/engine -I../../../src/engine/test-core  -I../../../lib/libqof/qof -I../../../lib/libqof/qof -pthread -I/usr/include/glib-2.0 -I/usr/lib/glib-2.0/include    -march=athlon-mp -pipe -ggdb -m3dnow -msse -mmmx -mfpmath=sse -g -g -g -g -Wall -Wunused -Wmissing-prototypes -Wmissing-declarations   -Wdeclaration-after-statement -Wno-pointer-sign -D_FORTIFY_SOURCE=2 -MT test-link.o -MD -MP -MF ".deps/test-link.Tpo" -c -o test-link.o test-link.c; \
	then mv -f ".deps/test-link.Tpo" ".deps/test-link.Po"; else rm -f ".deps/test-link.Tpo"; exit 1; fi
/bin/sh ../../../libtool --tag=CC --mode=link i686-pc-linux-gnu-gcc -I../../.. -I../../../src -I../../../src/gnc-module -I../../../src/test-core -I../../../src/engine -I../../../src/engine/test-core  -I../../../lib/libqof/qof -I../../../lib/libqof/qof -pthread -I/usr/include/glib-2.0 -I/usr/lib/glib-2.0/include    -march=athlon-mp -pipe -ggdb -m3dnow -msse -mmmx -mfpmath=sse -g -g -g -g -Wall -Wunused -Wmissing-prototypes -Wmissing-declarations   -Wdeclaration-after-statement -Wno-pointer-sign -D_FORTIFY_SOURCE=2  -g -o test-link  test-link.o ../libgncmod-engine.la ../../../lib/libqof/qof/libgncqof.la -lpopt -lm  -lm
mkdir .libs
i686-pc-linux-gnu-gcc -I../../.. -I../../../src -I../../../src/gnc-module -I../../../src/test-core -I../../../src/engine -I../../../src/engine/test-core -I../../../lib/libqof/qof -I../../../lib/libqof/qof -pthread -I/usr/include/glib-2.0 -I/usr/lib/glib-2.0/include -march=athlon-mp -pipe -ggdb -m3dnow -msse -mmmx -mfpmath=sse -g -g -g -g -Wall -Wunused -Wmissing-prototypes -Wmissing-declarations -Wdeclaration-after-statement -Wno-pointer-sign -D_FORTIFY_SOURCE=2 -g -o .libs/test-link test-link.o  ../.libs/libgncmod-engine.so /var/tmp/portage/gnucash-2.0.2/work/gnucash-2.0.2/src/gnc-module/.libs/libgncmodule.so /usr/lib/libltdl.so /var/tmp/portage/gnucash-2.0.2/work/gnucash-2.0.2/src/core-utils/.libs/libcore-utils.so /usr/lib/libgconf-2.so /usr/lib/libORBit-2.so /usr/lib/libgtk-x11-2.0.so /usr/lib/libgdk-x11-2.0.so /usr/lib/libatk-1.0.so /usr/lib/libgdk_pixbuf-2.0.so /usr/lib/libpangocairo-1.0.so /usr/lib/libpangoft2-1.0.so /usr/lib/libpango-1.0.so /usr/lib/libcairo.so /usr/lib/libfontconfig.so /usr/lib/libfreetype.so /usr/lib/libxml2.so /usr/lib/libdirectfb.so /usr/lib/libfusion.so /usr/lib/libdirect.so /usr/lib/libpng12.so -lz /usr/lib/libXrender.so /usr/lib/libX11.so /usr/lib/libXau.so /usr/lib/libXdmcp.so /usr/lib/libgwrap-wct.so /usr/lib/libgwrap-glib.so /usr/lib/libguile.so /usr/lib/libguile-ltdl.so /usr/lib/libqthreads.so -lcrypt /var/tmp/portage/gnucash-2.0.2/work/gnucash-2.0.2/lib/libqof/qof/.libs/libgncqof.so ../../../lib/libqof/qof/.libs/libgncqof.so /usr/lib/libgthread-2.0.so -lpthread /usr/lib/libgobject-2.0.so /usr/lib/libgmodule-2.0.so -ldl /usr/lib/libglib-2.0.so -lrt /usr/lib/libpopt.so -lm -Wl,--rpath -Wl,/usr/lib/gnucash
../.libs/libgncmod-engine.so: undefined reference to `acc_free'
../.libs/libgncmod-engine.so: undefined reference to `commit_err'
../.libs/libgncmod-engine.so: undefined reference to `on_done'
../.libs/libgncmod-engine.so: undefined reference to `noop'
../.libs/libgncmod-engine.so: undefined reference to `on_err'
collect2: ld returned 1 exit status
make[5]: *** [test-link] Error 1
make[5]: Leaving directory `/var/tmp/portage/gnucash-2.0.2/work/gnucash-2.0.2/src/engine/test'
make[4]: *** [all-recursive] Error 1
make[4]: Leaving directory `/var/tmp/portage/gnucash-2.0.2/work/gnucash-2.0.2/src/engine'
make[3]: *** [all] Error 2
make[3]: Leaving directory `/var/tmp/portage/gnucash-2.0.2/work/gnucash-2.0.2/src/engine'
make[2]: *** [all-recursive] Error 1
make[2]: Leaving directory `/var/tmp/portage/gnucash-2.0.2/work/gnucash-2.0.2/src'
make[1]: *** [all-recursive] Error 1
make[1]: Leaving directory `/var/tmp/portage/gnucash-2.0.2/work/gnucash-2.0.2'
make: *** [all] Error 2

!!! ERROR: app-office/gnucash-2.0.2 failed.
Call stack:
  ebuild.sh, line 1546:   Called dyn_compile
  ebuild.sh, line 937:   Called src_compile
  gnucash-2.0.2.ebuild, line 77:   Called die

!!! emake failed
!!! If you need support, post the topmost build error, and the call stack if relevant.

 ... done!