rendered paste bodyThis file contains any messages produced by compilers while
running configure, to aid debugging if configure makes a mistake.
It was created by configure, which was
generated by GNU Autoconf 2.59. Invocation command line was
$ ./configure
## --------- ##
## Platform. ##
## --------- ##
hostname = localhost.localdomain
uname -m = i686
uname -r = 2.6.5-1.358
uname -s = Linux
uname -v = #1 Sat May 8 09:04:50 EDT 2004
/usr/bin/uname -p = unknown
/bin/uname -X = unknown
/bin/arch = i686
/usr/bin/arch -k = unknown
/usr/convex/getsysinfo = unknown
hostinfo = unknown
/bin/machine = unknown
/usr/bin/oslevel = unknown
/bin/universe = unknown
PATH: /usr/kerberos/sbin
PATH: /usr/kerberos/bin
PATH: /usr/local/sbin
PATH: /usr/local/bin
PATH: /sbin
PATH: /bin
PATH: /usr/sbin
PATH: /usr/bin
PATH: /usr/X11R6/bin
PATH: /root/bin
## ----------- ##
## Core tests. ##
## ----------- ##
configure:1591: checking for a BSD-compatible install
configure:1646: result: /usr/bin/install -c
configure:1657: checking whether build environment is sane
configure:1700: result: yes
configure:1715: checking whether make sets $(MAKE)
configure:1735: result: yes
configure:1767: checking for working aclocal-1.4
configure:1774: result: found
configure:1782: checking for working autoconf
configure:1789: result: found
configure:1797: checking for working automake-1.4
configure:1804: result: found
configure:1812: checking for working autoheader
configure:1819: result: found
configure:1827: checking for working makeinfo
configure:1834: result: found
configure:1844: checking whether to enable maintainer-specific portions of Makefiles
configure:1853: result: no
configure:1914: checking for gcc
configure:1930: found /usr/bin/gcc
configure:1940: result: gcc
configure:2184: checking for C compiler version
configure:2187: gcc --version </dev/null >&5
gcc (GCC) 3.3.3 20040412 (Red Hat Linux 3.3.3-7)
Copyright (C) 2003 Free Software Foundation, Inc.
This is free software; see the source for copying conditions. There is NO
warranty; not even for MERCHANTABILITY or FITNESS FOR A PARTICULAR PURPOSE.
configure:2190: $? = 0
configure:2192: gcc -v </dev/null >&5
Reading specs from /usr/lib/gcc-lib/i386-redhat-linux/3.3.3/specs
Configured with: ../configure --prefix=/usr --mandir=/usr/share/man --infodir=/usr/share/info --enable-shared --enable-threads=posix --disable-checking --disable-libunwind-exceptions --with-system-zlib --enable-__cxa_atexit --host=i386-redhat-linux
Thread model: posix
gcc version 3.3.3 20040412 (Red Hat Linux 3.3.3-7)
configure:2195: $? = 0
configure:2197: gcc -V </dev/null >&5
gcc: `-V' option must have argument
configure:2200: $? = 1
configure:2223: checking for C compiler default output file name
configure:2226: gcc conftest.c >&5
configure:2229: $? = 0
configure:2275: result: a.out
configure:2280: checking whether the C compiler works
configure:2286: ./a.out
configure:2289: $? = 0
configure:2306: result: yes
configure:2313: checking whether we are cross compiling
configure:2315: result: no
configure:2318: checking for suffix of executables
configure:2320: gcc -o conftest conftest.c >&5
configure:2323: $? = 0
configure:2348: result:
configure:2354: checking for suffix of object files
configure:2375: gcc -c conftest.c >&5
configure:2378: $? = 0
configure:2400: result: o
configure:2404: checking whether we are using the GNU C compiler
configure:2428: gcc -c conftest.c >&5
configure:2434: $? = 0
configure:2437: test -z || test ! -s conftest.err
configure:2440: $? = 0
configure:2443: test -s conftest.o
configure:2446: $? = 0
configure:2459: result: yes
configure:2465: checking whether gcc accepts -g
configure:2486: gcc -c -g conftest.c >&5
configure:2492: $? = 0
configure:2495: test -z || test ! -s conftest.err
configure:2498: $? = 0
configure:2501: test -s conftest.o
configure:2504: $? = 0
configure:2515: result: yes
configure:2532: checking for gcc option to accept ANSI C
configure:2602: gcc -c -g -O2 conftest.c >&5
configure:2608: $? = 0
configure:2611: test -z || test ! -s conftest.err
configure:2614: $? = 0
configure:2617: test -s conftest.o
configure:2620: $? = 0
configure:2638: result: none needed
configure:2656: gcc -c -g -O2 conftest.c >&5
conftest.c:2: error: syntax error before "me"
configure:2662: $? = 1
configure: failed program was:
| #ifndef __cplusplus
| choke me
| #endif
configure:2794: checking for strerror in -lcposix
configure:2824: gcc -o conftest -g -O2 conftest.c -lcposix >&5
/usr/bin/ld: cannot find -lcposix
collect2: ld returned 1 exit status
configure:2830: $? = 1
configure: failed program was:
| /* confdefs.h. */
|
| #define PACKAGE_NAME ""
| #define PACKAGE_TARNAME ""
| #define PACKAGE_VERSION ""
| #define PACKAGE_STRING ""
| #define PACKAGE_BUGREPORT ""
| #define PACKAGE "irssi"
| #define VERSION "0.8.10"
| /* end confdefs.h. */
|
| /* Override any gcc2 internal prototype to avoid an error. */
| #ifdef __cplusplus
| extern "C"
| #endif
| /* We use char because int might match the return type of a gcc2
| builtin and then its argument prototype would still apply. */
| char strerror ();
| int
| main ()
| {
| strerror ();
| ;
| return 0;
| }
configure:2855: result: no
configure:2909: checking for gcc
configure:2935: result: gcc
configure:3179: checking for C compiler version
configure:3182: gcc --version </dev/null >&5
gcc (GCC) 3.3.3 20040412 (Red Hat Linux 3.3.3-7)
Copyright (C) 2003 Free Software Foundation, Inc.
This is free software; see the source for copying conditions. There is NO
warranty; not even for MERCHANTABILITY or FITNESS FOR A PARTICULAR PURPOSE.
configure:3185: $? = 0
configure:3187: gcc -v </dev/null >&5
Reading specs from /usr/lib/gcc-lib/i386-redhat-linux/3.3.3/specs
Configured with: ../configure --prefix=/usr --mandir=/usr/share/man --infodir=/usr/share/info --enable-shared --enable-threads=posix --disable-checking --disable-libunwind-exceptions --with-system-zlib --enable-__cxa_atexit --host=i386-redhat-linux
Thread model: posix
gcc version 3.3.3 20040412 (Red Hat Linux 3.3.3-7)
configure:3190: $? = 0
configure:3192: gcc -V </dev/null >&5
gcc: `-V' option must have argument
configure:3195: $? = 1
configure:3198: checking whether we are using the GNU C compiler
configure:3253: result: yes
configure:3259: checking whether gcc accepts -g
configure:3309: result: yes
configure:3326: checking for gcc option to accept ANSI C
configure:3432: result: none needed
configure:3450: gcc -c -g -O2 conftest.c >&5
conftest.c:2: error: syntax error before "me"
configure:3456: $? = 1
configure: failed program was:
| #ifndef __cplusplus
| choke me
| #endif
configure:3591: checking how to run the C preprocessor
configure:3626: gcc -E conftest.c
configure:3632: $? = 0
configure:3664: gcc -E conftest.c
conftest.c:11:28: ac_nonexistent.h: No such file or directory
configure:3670: $? = 1
configure: failed program was:
| /* confdefs.h. */
|
| #define PACKAGE_NAME ""
| #define PACKAGE_TARNAME ""
| #define PACKAGE_VERSION ""
| #define PACKAGE_STRING ""
| #define PACKAGE_BUGREPORT ""
| #define PACKAGE "irssi"
| #define VERSION "0.8.10"
| /* end confdefs.h. */
| #include <ac_nonexistent.h>
configure:3709: result: gcc -E
configure:3733: gcc -E conftest.c
configure:3739: $? = 0
configure:3771: gcc -E conftest.c
conftest.c:11:28: ac_nonexistent.h: No such file or directory
configure:3777: $? = 1
configure: failed program was:
| /* confdefs.h. */
|
| #define PACKAGE_NAME ""
| #define PACKAGE_TARNAME ""
| #define PACKAGE_VERSION ""
| #define PACKAGE_STRING ""
| #define PACKAGE_BUGREPORT ""
| #define PACKAGE "irssi"
| #define VERSION "0.8.10"
| /* end confdefs.h. */
| #include <ac_nonexistent.h>
configure:3821: checking for egrep
configure:3831: result: grep -E
configure:3836: checking for ANSI C header files
configure:3861: gcc -c -g -O2 conftest.c >&5
configure:3867: $? = 0
configure:3870: test -z || test ! -s conftest.err
configure:3873: $? = 0
configure:3876: test -s conftest.o
configure:3879: $? = 0
configure:3965: gcc -o conftest -g -O2 conftest.c >&5
configure:3968: $? = 0
configure:3970: ./conftest
configure:3973: $? = 0
configure:3988: result: yes
configure:4077: checking build system type
configure:4095: result: i686-pc-linux-gnu
configure:4103: checking host system type
configure:4117: result: i686-pc-linux-gnu
configure:4125: checking for a sed that does not truncate output
configure:4179: result: /bin/sed
configure:4193: checking for ld used by gcc
configure:4260: result: /usr/bin/ld
configure:4269: checking if the linker (/usr/bin/ld) is GNU ld
configure:4284: result: yes
configure:4289: checking for /usr/bin/ld option to reload object files
configure:4296: result: -r
configure:4305: checking for BSD-compatible nm
configure:4347: result: /usr/bin/nm -B
configure:4351: checking whether ln -s works
configure:4355: result: yes
configure:4362: checking how to recognise dependent libraries
configure:4536: result: pass_all
configure:4757: checking for sys/types.h
configure:4773: gcc -c -g -O2 conftest.c >&5
configure:4779: $? = 0
configure:4782: test -z || test ! -s conftest.err
configure:4785: $? = 0
configure:4788: test -s conftest.o
configure:4791: $? = 0
configure:4802: result: yes
configure:4757: checking for sys/stat.h
configure:4773: gcc -c -g -O2 conftest.c >&5
configure:4779: $? = 0
configure:4782: test -z || test ! -s conftest.err
configure:4785: $? = 0
configure:4788: test -s conftest.o
configure:4791: $? = 0
configure:4802: result: yes
configure:4757: checking for stdlib.h
configure:4773: gcc -c -g -O2 conftest.c >&5
configure:4779: $? = 0
configure:4782: test -z || test ! -s conftest.err
configure:4785: $? = 0
configure:4788: test -s conftest.o
configure:4791: $? = 0
configure:4802: result: yes
configure:4757: checking for string.h
configure:4773: gcc -c -g -O2 conftest.c >&5
configure:4779: $? = 0
configure:4782: test -z || test ! -s conftest.err
configure:4785: $? = 0
configure:4788: test -s conftest.o
configure:4791: $? = 0
configure:4802: result: yes
configure:4757: checking for memory.h
configure:4773: gcc -c -g -O2 conftest.c >&5
configure:4779: $? = 0
configure:4782: test -z || test ! -s conftest.err
configure:4785: $? = 0
configure:4788: test -s conftest.o
configure:4791: $? = 0
configure:4802: result: yes
configure:4757: checking for strings.h
configure:4773: gcc -c -g -O2 conftest.c >&5
configure:4779: $? = 0
configure:4782: test -z || test ! -s conftest.err
configure:4785: $? = 0
configure:4788: test -s conftest.o
configure:4791: $? = 0
configure:4802: result: yes
configure:4757: checking for inttypes.h
configure:4773: gcc -c -g -O2 conftest.c >&5
configure:4779: $? = 0
configure:4782: test -z || test ! -s conftest.err
configure:4785: $? = 0
configure:4788: test -s conftest.o
configure:4791: $? = 0
configure:4802: result: yes
configure:4757: checking for stdint.h
configure:4773: gcc -c -g -O2 conftest.c >&5
configure:4779: $? = 0
configure:4782: test -z || test ! -s conftest.err
configure:4785: $? = 0
configure:4788: test -s conftest.o
configure:4791: $? = 0
configure:4802: result: yes
configure:4757: checking for unistd.h
configure:4773: gcc -c -g -O2 conftest.c >&5
configure:4779: $? = 0
configure:4782: test -z || test ! -s conftest.err
configure:4785: $? = 0
configure:4788: test -s conftest.o
configure:4791: $? = 0
configure:4802: result: yes
configure:4828: checking dlfcn.h usability
configure:4840: gcc -c -g -O2 conftest.c >&5
configure:4846: $? = 0
configure:4849: test -z || test ! -s conftest.err
configure:4852: $? = 0
configure:4855: test -s conftest.o
configure:4858: $? = 0
configure:4868: result: yes
configure:4872: checking dlfcn.h presence
configure:4882: gcc -E conftest.c
configure:4888: $? = 0
configure:4908: result: yes
configure:4943: checking for dlfcn.h
configure:4950: result: yes
configure:5015: checking for g++
configure:5031: found /usr/bin/g++
configure:5041: result: g++
configure:5057: checking for C++ compiler version
configure:5060: g++ --version </dev/null >&5
g++ (GCC) 3.3.3 20040412 (Red Hat Linux 3.3.3-7)
Copyright (C) 2003 Free Software Foundation, Inc.
This is free software; see the source for copying conditions. There is NO
warranty; not even for MERCHANTABILITY or FITNESS FOR A PARTICULAR PURPOSE.
configure:5063: $? = 0
configure:5065: g++ -v </dev/null >&5
Reading specs from /usr/lib/gcc-lib/i386-redhat-linux/3.3.3/specs
Configured with: ../configure --prefix=/usr --mandir=/usr/share/man --infodir=/usr/share/info --enable-shared --enable-threads=posix --disable-checking --disable-libunwind-exceptions --with-system-zlib --enable-__cxa_atexit --host=i386-redhat-linux
Thread model: posix
gcc version 3.3.3 20040412 (Red Hat Linux 3.3.3-7)
configure:5068: $? = 0
configure:5070: g++ -V </dev/null >&5
g++: `-V' option must have argument
configure:5073: $? = 1
configure:5076: checking whether we are using the GNU C++ compiler
configure:5100: g++ -c conftest.cc >&5
configure:5106: $? = 0
configure:5109: test -z || test ! -s conftest.err
configure:5112: $? = 0
configure:5115: test -s conftest.o
configure:5118: $? = 0
configure:5131: result: yes
configure:5137: checking whether g++ accepts -g
configure:5158: g++ -c -g conftest.cc >&5
configure:5164: $? = 0
configure:5167: test -z || test ! -s conftest.err
configure:5170: $? = 0
configure:5173: test -s conftest.o
configure:5176: $? = 0
configure:5187: result: yes
configure:5229: g++ -c -g -O2 conftest.cc >&5
configure:5235: $? = 0
configure:5238: test -z || test ! -s conftest.err
configure:5241: $? = 0
configure:5244: test -s conftest.o
configure:5247: $? = 0
configure:5273: g++ -c -g -O2 conftest.cc >&5
conftest.cc: In function `int main()':
conftest.cc:26: error: `exit' undeclared (first use this function)
conftest.cc:26: error: (Each undeclared identifier is reported only once for
each function it appears in.)
configure:5279: $? = 1
configure: failed program was:
| /* confdefs.h. */
|
| #define PACKAGE_NAME ""
| #define PACKAGE_TARNAME ""
| #define PACKAGE_VERSION ""
| #define PACKAGE_STRING ""
| #define PACKAGE_BUGREPORT ""
| #define PACKAGE "irssi"
| #define VERSION "0.8.10"
| #define STDC_HEADERS 1
| #define HAVE_SYS_TYPES_H 1
| #define HAVE_SYS_STAT_H 1
| #define HAVE_STDLIB_H 1
| #define HAVE_STRING_H 1
| #define HAVE_MEMORY_H 1
| #define HAVE_STRINGS_H 1
| #define HAVE_INTTYPES_H 1
| #define HAVE_STDINT_H 1
| #define HAVE_UNISTD_H 1
| #define HAVE_DLFCN_H 1
| /* end confdefs.h. */
|
| int
| main ()
| {
| exit (42);
| ;
| return 0;
| }
configure:5229: g++ -c -g -O2 conftest.cc >&5
configure:5235: $? = 0
configure:5238: test -z || test ! -s conftest.err
configure:5241: $? = 0
configure:5244: test -s conftest.o
configure:5247: $? = 0
configure:5273: g++ -c -g -O2 conftest.cc >&5
configure:5279: $? = 0
configure:5282: test -z || test ! -s conftest.err
configure:5285: $? = 0
configure:5288: test -s conftest.o
configure:5291: $? = 0
configure:5319: checking how to run the C++ preprocessor
configure:5350: g++ -E conftest.cc
configure:5356: $? = 0
configure:5388: g++ -E conftest.cc
conftest.cc:25:28: ac_nonexistent.h: No such file or directory
configure:5394: $? = 1
configure: failed program was:
| /* confdefs.h. */
|
| #define PACKAGE_NAME ""
| #define PACKAGE_TARNAME ""
| #define PACKAGE_VERSION ""
| #define PACKAGE_STRING ""
| #define PACKAGE_BUGREPORT ""
| #define PACKAGE "irssi"
| #define VERSION "0.8.10"
| #define STDC_HEADERS 1
| #define HAVE_SYS_TYPES_H 1
| #define HAVE_SYS_STAT_H 1
| #define HAVE_STDLIB_H 1
| #define HAVE_STRING_H 1
| #define HAVE_MEMORY_H 1
| #define HAVE_STRINGS_H 1
| #define HAVE_INTTYPES_H 1
| #define HAVE_STDINT_H 1
| #define HAVE_UNISTD_H 1
| #define HAVE_DLFCN_H 1
| #ifdef __cplusplus
| extern "C" void std::exit (int) throw (); using std::exit;
| #endif
| /* end confdefs.h. */
| #include <ac_nonexistent.h>
configure:5433: result: g++ -E
configure:5457: g++ -E conftest.cc
configure:5463: $? = 0
configure:5495: g++ -E conftest.cc
conftest.cc:25:28: ac_nonexistent.h: No such file or directory
configure:5501: $? = 1
configure: failed program was:
| /* confdefs.h. */
|
| #define PACKAGE_NAME ""
| #define PACKAGE_TARNAME ""
| #define PACKAGE_VERSION ""
| #define PACKAGE_STRING ""
| #define PACKAGE_BUGREPORT ""
| #define PACKAGE "irssi"
| #define VERSION "0.8.10"
| #define STDC_HEADERS 1
| #define HAVE_SYS_TYPES_H 1
| #define HAVE_SYS_STAT_H 1
| #define HAVE_STDLIB_H 1
| #define HAVE_STRING_H 1
| #define HAVE_MEMORY_H 1
| #define HAVE_STRINGS_H 1
| #define HAVE_INTTYPES_H 1
| #define HAVE_STDINT_H 1
| #define HAVE_UNISTD_H 1
| #define HAVE_DLFCN_H 1
| #ifdef __cplusplus
| extern "C" void std::exit (int) throw (); using std::exit;
| #endif
| /* end confdefs.h. */
| #include <ac_nonexistent.h>
configure:5596: checking for g77
configure:5612: found /usr/bin/g77
configure:5622: result: g77
configure:5640: checking for Fortran 77 compiler version
configure:5640: g77 --version </dev/null >&5
GNU Fortran (GCC) 3.3.3 20040412 (Red Hat Linux 3.3.3-7)
Copyright (C) 2002 Free Software Foundation, Inc.
GNU Fortran comes with NO WARRANTY, to the extent permitted by law.
You may redistribute copies of GNU Fortran
under the terms of the GNU General Public License.
For more information about these matters, see the file named COPYING
or type the command `info -f g77 Copying'.
configure:5643: $? = 0
configure:5645: g77 -v </dev/null >&5
Reading specs from /usr/lib/gcc-lib/i386-redhat-linux/3.3.3/specs
Configured with: ../configure --prefix=/usr --mandir=/usr/share/man --infodir=/usr/share/info --enable-shared --enable-threads=posix --disable-checking --disable-libunwind-exceptions --with-system-zlib --enable-__cxa_atexit --host=i386-redhat-linux
Thread model: posix
gcc version 3.3.3 20040412 (Red Hat Linux 3.3.3-7)
configure:5648: $? = 0
configure:5650: g77 -V </dev/null >&5
g77: `-V' option must have argument
configure:5653: $? = 1
configure:5661: checking whether we are using the GNU Fortran 77 compiler
configure:5675: g77 -c conftest.F >&5
configure:5681: $? = 0
configure:5684: test -z || test ! -s conftest.err
configure:5687: $? = 0
configure:5690: test -s conftest.o
configure:5693: $? = 0
configure:5706: result: yes
configure:5712: checking whether g77 accepts -g
configure:5724: g77 -c -g conftest.f >&5
configure:5730: $? = 0
configure:5733: test -z || test ! -s conftest.err
configure:5736: $? = 0
configure:5739: test -s conftest.o
configure:5742: $? = 0
configure:5754: result: yes
configure:5784: checking the maximum length of command line arguments
configure:5849: result: 32768
configure:5860: checking command to parse /usr/bin/nm -B output from gcc object
configure:5949: gcc -c -g -O2 conftest.c >&5
configure:5952: $? = 0
configure:5956: /usr/bin/nm -B conftest.o \| sed -n -e 's/^.*[ ]\([ABCDGIRSTW][ABCDGIRSTW]*\)[ ][ ]*\(\)\([_A-Za-z][_A-Za-z0-9]*\)$/\1 \2\3 \3/p' \> conftest.nm
configure:5959: $? = 0
configure:6011: gcc -o conftest -g -O2 conftest.c conftstm.o >&5
configure:6014: $? = 0
configure:6052: result: ok
configure:6056: checking for objdir
configure:6071: result: .libs
configure:6161: checking for ar
configure:6177: found /usr/bin/ar
configure:6188: result: ar
configure:6241: checking for ranlib
configure:6257: found /usr/bin/ranlib
configure:6268: result: ranlib
configure:6321: checking for strip
configure:6337: found /usr/bin/strip
configure:6348: result: strip
configure:6610: checking if gcc static flag works
configure:6633: result: yes
configure:6651: checking if gcc supports -fno-rtti -fno-exceptions
configure:6672: gcc -c -g -O2 -fno-rtti -fno-exceptions conftest.c >&5
cc1: warning: "-fno-rtti" is valid for C++ but not for C/ObjC
configure:6676: $? = 0
configure:6684: result: no
configure:6699: checking for gcc option to produce PIC
configure:6876: result: -fPIC
configure:6884: checking if gcc PIC flag -fPIC works
configure:6905: gcc -c -g -O2 -fPIC -DPIC conftest.c >&5
configure:6909: $? = 0
configure:6917: result: yes
configure:6941: checking if gcc supports -c -o file.o
configure:6965: gcc -c -g -O2 -o out/conftest2.o conftest.c >&5
configure:6969: $? = 0
configure:6986: result: yes
configure:7012: checking whether the gcc linker (/usr/bin/ld) supports shared libraries
configure:7859: result: yes
configure:7885: checking whether -lc should be explicitly linked in
configure:7890: gcc -c -g -O2 conftest.c >&5
configure:7893: $? = 0
configure:7907: gcc -shared conftest.o -v -Wl,-soname -Wl,conftest -o conftest 2\>\&1 \| grep -lc \>/dev/null 2\>\&1
configure:7910: $? = 0
configure:7922: result: no
configure:7930: checking dynamic linker characteristics
configure:8482: result: GNU/Linux ld.so
configure:8486: checking how to hardcode library paths into programs
configure:8511: result: immediate
configure:8525: checking whether stripping libraries is possible
configure:8530: result: yes
configure:9353: checking if libtool supports shared libraries
configure:9355: result: yes
configure:9358: checking whether to build shared libraries
configure:9416: result: yes
configure:9419: checking whether to build static libraries
configure:9423: result: yes
configure:9515: creating libtool
configure:10062: checking for ld used by g++
configure:10129: result: /usr/bin/ld
configure:10138: checking if the linker (/usr/bin/ld) is GNU ld
configure:10153: result: yes
configure:10204: checking whether the g++ linker (/usr/bin/ld) supports shared libraries
configure:11030: result: yes
configure:11048: g++ -c -g -O2 conftest.cc >&5
configure:11051: $? = 0
configure:11147: checking for g++ option to produce PIC
configure:11399: result: -fPIC
configure:11407: checking if g++ PIC flag -fPIC works
configure:11428: g++ -c -g -O2 -fPIC -DPIC conftest.cc >&5
configure:11432: $? = 0
configure:11440: result: yes
configure:11464: checking if g++ supports -c -o file.o
configure:11488: g++ -c -g -O2 -o out/conftest2.o conftest.cc >&5
configure:11492: $? = 0
configure:11509: result: yes
configure:11535: checking whether the g++ linker (/usr/bin/ld) supports shared libraries
configure:11563: result: yes
configure:11634: checking dynamic linker characteristics
configure:12186: result: GNU/Linux ld.so
configure:12190: checking how to hardcode library paths into programs
configure:12215: result: immediate
configure:12229: checking whether stripping libraries is possible
configure:12234: result: yes
configure:13534: checking if libtool supports shared libraries
configure:13536: result: yes
configure:13539: checking whether to build shared libraries
configure:13557: result: yes
configure:13560: checking whether to build static libraries
configure:13564: result: yes
configure:13576: checking for g77 option to produce PIC
configure:13753: result: -fPIC
configure:13761: checking if g77 PIC flag -fPIC works
configure:13782: g77 -c -g -O2 -fPIC conftest.f >&5
configure:13786: $? = 0
configure:13794: result: yes
configure:13818: checking if g77 supports -c -o file.o
configure:13842: g77 -c -g -O2 -o out/conftest2.o conftest.f >&5
configure:13846: $? = 0
configure:13863: result: yes
configure:13889: checking whether the g77 linker (/usr/bin/ld) supports shared libraries
configure:14716: result: yes
configure:14787: checking dynamic linker characteristics
configure:15339: result: GNU/Linux ld.so
configure:15343: checking how to hardcode library paths into programs
configure:15368: result: immediate
configure:15382: checking whether stripping libraries is possible
configure:15387: result: yes
configure:19480: checking for sed
configure:19498: found /bin/sed
configure:19510: result: /bin/sed
configure:19519: checking for perl
configure:19537: found /usr/bin/perl
configure:19549: result: /usr/bin/perl
configure:19573: checking for string.h
configure:19578: result: yes
configure:19573: checking for stdlib.h
configure:19578: result: yes
configure:19573: checking for unistd.h
configure:19578: result: yes
configure:19582: checking dirent.h usability
configure:19594: gcc -c -g -O2 conftest.c >&5
configure:19600: $? = 0
configure:19603: test -z || test ! -s conftest.err
configure:19606: $? = 0
configure:19609: test -s conftest.o
configure:19612: $? = 0
configure:19622: result: yes
configure:19626: checking dirent.h presence
configure:19636: gcc -E conftest.c
configure:19642: $? = 0
configure:19662: result: yes
configure:19697: checking for dirent.h
configure:19704: result: yes
configure:19582: checking sys/ioctl.h usability
configure:19594: gcc -c -g -O2 conftest.c >&5
configure:19600: $? = 0
configure:19603: test -z || test ! -s conftest.err
configure:19606: $? = 0
configure:19609: test -s conftest.o
configure:19612: $? = 0
configure:19622: result: yes
configure:19626: checking sys/ioctl.h presence
configure:19636: gcc -E conftest.c
configure:19642: $? = 0
configure:19662: result: yes
configure:19697: checking for sys/ioctl.h
configure:19704: result: yes
configure:19582: checking sys/resource.h usability
configure:19594: gcc -c -g -O2 conftest.c >&5
configure:19600: $? = 0
configure:19603: test -z || test ! -s conftest.err
configure:19606: $? = 0
configure:19609: test -s conftest.o
configure:19612: $? = 0
configure:19622: result: yes
configure:19626: checking sys/resource.h presence
configure:19636: gcc -E conftest.c
configure:19642: $? = 0
configure:19662: result: yes
configure:19697: checking for sys/resource.h
configure:19704: result: yes
configure:19735: checking sys/time.h usability
configure:19747: gcc -c -g -O2 conftest.c >&5
configure:19753: $? = 0
configure:19756: test -z || test ! -s conftest.err
configure:19759: $? = 0
configure:19762: test -s conftest.o
configure:19765: $? = 0
configure:19775: result: yes
configure:19779: checking sys/time.h presence
configure:19789: gcc -E conftest.c
configure:19795: $? = 0
configure:19815: result: yes
configure:19850: checking for sys/time.h
configure:19857: result: yes
configure:19735: checking sys/utsname.h usability
configure:19747: gcc -c -g -O2 conftest.c >&5
configure:19753: $? = 0
configure:19756: test -z || test ! -s conftest.err
configure:19759: $? = 0
configure:19762: test -s conftest.o
configure:19765: $? = 0
configure:19775: result: yes
configure:19779: checking sys/utsname.h presence
configure:19789: gcc -E conftest.c
configure:19795: $? = 0
configure:19815: result: yes
configure:19850: checking for sys/utsname.h
configure:19857: result: yes
configure:19735: checking regex.h usability
configure:19747: gcc -c -g -O2 conftest.c >&5
configure:19753: $? = 0
configure:19756: test -z || test ! -s conftest.err
configure:19759: $? = 0
configure:19762: test -s conftest.o
configure:19765: $? = 0
configure:19775: result: yes
configure:19779: checking regex.h presence
configure:19789: gcc -E conftest.c
configure:19795: $? = 0
configure:19815: result: yes
configure:19850: checking for regex.h
configure:19857: result: yes
configure:20125: checking for mkfifo
configure:20182: gcc -o conftest -g -O2 conftest.c >&5
configure:20188: $? = 0
configure:20191: test -z || test ! -s conftest.err
configure:20194: $? = 0
configure:20197: test -s conftest
configure:20200: $? = 0
configure:20212: result: yes
configure:20125: checking for fcntl
configure:20182: gcc -o conftest -g -O2 conftest.c >&5
configure:20188: $? = 0
configure:20191: test -z || test ! -s conftest.err
configure:20194: $? = 0
configure:20197: test -s conftest
configure:20200: $? = 0
configure:20212: result: yes
configure:20125: checking for nl_langinfo
configure:20182: gcc -o conftest -g -O2 conftest.c >&5
configure:20188: $? = 0
configure:20191: test -z || test ! -s conftest.err
configure:20194: $? = 0
configure:20197: test -s conftest
configure:20200: $? = 0
configure:20212: result: yes
configure:20223: checking for socket
configure:20280: gcc -o conftest -g -O2 conftest.c >&5
configure:20286: $? = 0
configure:20289: test -z || test ! -s conftest.err
configure:20292: $? = 0
configure:20295: test -s conftest
configure:20298: $? = 0
configure:20310: result: yes
configure:20389: checking for inet_addr
configure:20446: gcc -o conftest -g -O2 conftest.c >&5
configure:20452: $? = 0
configure:20455: test -z || test ! -s conftest.err
configure:20458: $? = 0
configure:20461: test -s conftest
configure:20464: $? = 0
configure:20476: result: yes
configure:20559: checking for socklen_t
configure:20582: gcc -c -g -O2 -Wall conftest.c >&5
conftest.c: In function `main':
conftest.c:43: warning: unused variable `t'
configure:20588: $? = 0
configure:20591: test -z || test ! -s conftest.err
configure:20594: $? = 0
configure:20597: test -s conftest.o
configure:20600: $? = 0
configure:20619: result: yes
configure:20627: checking for int
configure:20651: gcc -c -g -O2 -Wall conftest.c >&5
configure:20657: $? = 0
configure:20660: test -z || test ! -s conftest.err
configure:20663: $? = 0
configure:20666: test -s conftest.o
configure:20669: $? = 0
configure:20680: result: yes
configure:20683: checking size of int
configure:20995: gcc -o conftest -g -O2 -Wall conftest.c >&5
configure:20998: $? = 0
configure:21000: ./conftest
configure:21003: $? = 0
configure:21026: result: 4
configure:21033: checking for long
configure:21057: gcc -c -g -O2 -Wall conftest.c >&5
configure:21063: $? = 0
configure:21066: test -z || test ! -s conftest.err
configure:21069: $? = 0
configure:21072: test -s conftest.o
configure:21075: $? = 0
configure:21086: result: yes
configure:21089: checking size of long
configure:21401: gcc -o conftest -g -O2 -Wall conftest.c >&5
configure:21404: $? = 0
configure:21406: ./conftest
configure:21409: $? = 0
configure:21432: result: 4
configure:21439: checking for long long
configure:21463: gcc -c -g -O2 -Wall conftest.c >&5
configure:21469: $? = 0
configure:21472: test -z || test ! -s conftest.err
configure:21475: $? = 0
configure:21478: test -s conftest.o
configure:21481: $? = 0
configure:21492: result: yes
configure:21495: checking size of long long
configure:21807: gcc -o conftest -g -O2 -Wall conftest.c >&5
configure:21810: $? = 0
configure:21812: ./conftest
configure:21815: $? = 0
configure:21838: result: 8
configure:21846: checking size of off_t
configure:21873: gcc -o conftest -g -O2 -Wall conftest.c >&5
conftest.c: In function `main':
conftest.c:46: warning: implicit declaration of function `exit'
configure:21876: $? = 0
configure:21878: ./conftest
configure:21881: $? = 0
configure:21901: result: 8
configure:22183: checking whether GLib is unpacked to irssi dir
configure:22231: result: no
configure:22593: checking for pkg-config
configure:22611: found /usr/bin/pkg-config
configure:22624: result: /usr/bin/pkg-config
configure:22647: checking for GLIB - version >= 2.0.0
configure:22796: result: no
configure:22827: gcc -o conftest -g -O2 -Wall conftest.c >&5
conftest.c:44:18: glib.h: No such file or directory
conftest.c: In function `main':
conftest.c:50: error: `glib_major_version' undeclared (first use in this function)
conftest.c:50: error: (Each undeclared identifier is reported only once
conftest.c:50: error: for each function it appears in.)
conftest.c:50: error: `glib_minor_version' undeclared (first use in this function)
conftest.c:50: error: `glib_micro_version' undeclared (first use in this function)
configure:22833: $? = 1
configure: failed program was:
| /* confdefs.h. */
|
| #define PACKAGE_NAME ""
| #define PACKAGE_TARNAME ""
| #define PACKAGE_VERSION ""
| #define PACKAGE_STRING ""
| #define PACKAGE_BUGREPORT ""
| #define PACKAGE "irssi"
| #define VERSION "0.8.10"
| #define STDC_HEADERS 1
| #define HAVE_SYS_TYPES_H 1
| #define HAVE_SYS_STAT_H 1
| #define HAVE_STDLIB_H 1
| #define HAVE_STRING_H 1
| #define HAVE_MEMORY_H 1
| #define HAVE_STRINGS_H 1
| #define HAVE_INTTYPES_H 1
| #define HAVE_STDINT_H 1
| #define HAVE_UNISTD_H 1
| #define HAVE_DLFCN_H 1
| #ifdef __cplusplus
| extern "C" void std::exit (int) throw (); using std::exit;
| #endif
| #define HAVE_STRING_H 1
| #define HAVE_STDLIB_H 1
| #define HAVE_UNISTD_H 1
| #define HAVE_DIRENT_H 1
| #define HAVE_SYS_IOCTL_H 1
| #define HAVE_SYS_RESOURCE_H 1
| #define HAVE_SYS_TIME_H 1
| #define HAVE_SYS_UTSNAME_H 1
| #define HAVE_REGEX_H 1
| #define HAVE_MKFIFO 1
| #define HAVE_FCNTL 1
| #define HAVE_NL_LANGINFO 1
| #define _FILE_OFFSET_BITS 64
| #define SIZEOF_INT 4
| #define SIZEOF_LONG 4
| #define SIZEOF_LONG_LONG 8
| #define PRIuUOFF_T "llu"
| #define UOFF_T_LONG_LONG 1
| /* end confdefs.h. */
|
| #include <glib.h>
| #include <stdio.h>
|
| int
| main ()
| {
| return ((glib_major_version) || (glib_minor_version) || (glib_micro_version));
| ;
| return 0;
| }
configure:22593: checking for pkg-config
configure:22624: result: /usr/bin/pkg-config
configure:22647: checking for GLIB - version >= 2.0.0
configure:22796: result: no
configure:22827: gcc -o conftest -g -O2 conftest.c >&5
conftest.c:44:18: glib.h: No such file or directory
conftest.c: In function `main':
conftest.c:50: error: `glib_major_version' undeclared (first use in this function)
conftest.c:50: error: (Each undeclared identifier is reported only once
conftest.c:50: error: for each function it appears in.)
conftest.c:50: error: `glib_minor_version' undeclared (first use in this function)
conftest.c:50: error: `glib_micro_version' undeclared (first use in this function)
configure:22833: $? = 1
configure: failed program was:
| /* confdefs.h. */
|
| #define PACKAGE_NAME ""
| #define PACKAGE_TARNAME ""
| #define PACKAGE_VERSION ""
| #define PACKAGE_STRING ""
| #define PACKAGE_BUGREPORT ""
| #define PACKAGE "irssi"
| #define VERSION "0.8.10"
| #define STDC_HEADERS 1
| #define HAVE_SYS_TYPES_H 1
| #define HAVE_SYS_STAT_H 1
| #define HAVE_STDLIB_H 1
| #define HAVE_STRING_H 1
| #define HAVE_MEMORY_H 1
| #define HAVE_STRINGS_H 1
| #define HAVE_INTTYPES_H 1
| #define HAVE_STDINT_H 1
| #define HAVE_UNISTD_H 1
| #define HAVE_DLFCN_H 1
| #ifdef __cplusplus
| extern "C" void std::exit (int) throw (); using std::exit;
| #endif
| #define HAVE_STRING_H 1
| #define HAVE_STDLIB_H 1
| #define HAVE_UNISTD_H 1
| #define HAVE_DIRENT_H 1
| #define HAVE_SYS_IOCTL_H 1
| #define HAVE_SYS_RESOURCE_H 1
| #define HAVE_SYS_TIME_H 1
| #define HAVE_SYS_UTSNAME_H 1
| #define HAVE_REGEX_H 1
| #define HAVE_MKFIFO 1
| #define HAVE_FCNTL 1
| #define HAVE_NL_LANGINFO 1
| #define _FILE_OFFSET_BITS 64
| #define SIZEOF_INT 4
| #define SIZEOF_LONG 4
| #define SIZEOF_LONG_LONG 8
| #define PRIuUOFF_T "llu"
| #define UOFF_T_LONG_LONG 1
| /* end confdefs.h. */
|
| #include <glib.h>
| #include <stdio.h>
|
| int
| main ()
| {
| return ((glib_major_version) || (glib_minor_version) || (glib_micro_version));
| ;
| return 0;
| }
configure:22303: checking for glib-config
configure:22334: result: no
configure:22342: checking for GLIB - version >= 1.2.0
configure:22476: result: no
configure:22303: checking for glib-config
configure:22334: result: no
configure:22342: checking for GLIB - version >= 1.2.0
configure:22476: result: no
## ---------------- ##
## Cache variables. ##
## ---------------- ##
ac_cv_build=i686-pc-linux-gnu
ac_cv_build_alias=i686-pc-linux-gnu
ac_cv_c_compiler_gnu=yes
ac_cv_cxx_compiler_gnu=yes
ac_cv_env_CC_set=
ac_cv_env_CC_value=
ac_cv_env_CFLAGS_set=
ac_cv_env_CFLAGS_value=
ac_cv_env_CPPFLAGS_set=
ac_cv_env_CPPFLAGS_value=
ac_cv_env_CPP_set=
ac_cv_env_CPP_value=
ac_cv_env_CXXCPP_set=
ac_cv_env_CXXCPP_value=
ac_cv_env_CXXFLAGS_set=
ac_cv_env_CXXFLAGS_value=
ac_cv_env_CXX_set=
ac_cv_env_CXX_value=
ac_cv_env_F77_set=
ac_cv_env_F77_value=
ac_cv_env_FFLAGS_set=
ac_cv_env_FFLAGS_value=
ac_cv_env_LDFLAGS_set=
ac_cv_env_LDFLAGS_value=
ac_cv_env_PKG_CONFIG_set=
ac_cv_env_PKG_CONFIG_value=
ac_cv_env_SSL_CFLAGS_set=
ac_cv_env_SSL_CFLAGS_value=
ac_cv_env_SSL_LIBS_set=
ac_cv_env_SSL_LIBS_value=
ac_cv_env_build_alias_set=
ac_cv_env_build_alias_value=
ac_cv_env_host_alias_set=
ac_cv_env_host_alias_value=
ac_cv_env_target_alias_set=
ac_cv_env_target_alias_value=
ac_cv_exeext=
ac_cv_f77_compiler_gnu=yes
ac_cv_func_fcntl=yes
ac_cv_func_inet_addr=yes
ac_cv_func_mkfifo=yes
ac_cv_func_nl_langinfo=yes
ac_cv_func_socket=yes
ac_cv_header_dirent_h=yes
ac_cv_header_dlfcn_h=yes
ac_cv_header_inttypes_h=yes
ac_cv_header_memory_h=yes
ac_cv_header_regex_h=yes
ac_cv_header_stdc=yes
ac_cv_header_stdint_h=yes
ac_cv_header_stdlib_h=yes
ac_cv_header_string_h=yes
ac_cv_header_strings_h=yes
ac_cv_header_sys_ioctl_h=yes
ac_cv_header_sys_resource_h=yes
ac_cv_header_sys_stat_h=yes
ac_cv_header_sys_time_h=yes
ac_cv_header_sys_types_h=yes
ac_cv_header_sys_utsname_h=yes
ac_cv_header_unistd_h=yes
ac_cv_host=i686-pc-linux-gnu
ac_cv_host_alias=i686-pc-linux-gnu
ac_cv_lib_cposix_strerror=no
ac_cv_objext=o
ac_cv_path_GLIB_CONFIG=no
ac_cv_path_PKG_CONFIG=/usr/bin/pkg-config
ac_cv_path_install='/usr/bin/install -c'
ac_cv_path_perlpath=/usr/bin/perl
ac_cv_path_sedpath=/bin/sed
ac_cv_prog_CPP='gcc -E'
ac_cv_prog_CXXCPP='g++ -E'
ac_cv_prog_ac_ct_AR=ar
ac_cv_prog_ac_ct_CC=gcc
ac_cv_prog_ac_ct_CXX=g++
ac_cv_prog_ac_ct_F77=g77
ac_cv_prog_ac_ct_RANLIB=ranlib
ac_cv_prog_ac_ct_STRIP=strip
ac_cv_prog_cc_g=yes
ac_cv_prog_cc_stdc=
ac_cv_prog_cxx_g=yes
ac_cv_prog_egrep='grep -E'
ac_cv_prog_f77_g=yes
ac_cv_prog_make_make_set=yes
ac_cv_sizeof_int=4
ac_cv_sizeof_long=4
ac_cv_sizeof_long_long=8
ac_cv_type_int=yes
ac_cv_type_long=yes
ac_cv_type_long_long=yes
irssi_cv_type_socklen_t=yes
lt_cv_deplibs_check_method=pass_all
lt_cv_file_magic_cmd='$MAGIC_CMD'
lt_cv_file_magic_test_file=
lt_cv_ld_reload_flag=-r
lt_cv_objdir=.libs
lt_cv_path_LD=/usr/bin/ld
lt_cv_path_LDCXX=/usr/bin/ld
lt_cv_path_NM='/usr/bin/nm -B'
lt_cv_path_SED=/bin/sed
lt_cv_prog_compiler_c_o=yes
lt_cv_prog_compiler_c_o_CXX=yes
lt_cv_prog_compiler_c_o_F77=yes
lt_cv_prog_compiler_rtti_exceptions=no
lt_cv_prog_gnu_ld=yes
lt_cv_prog_gnu_ldcxx=yes
lt_cv_sys_global_symbol_pipe='sed -n -e '\''s/^.*[ ]\([ABCDGIRSTW][ABCDGIRSTW]*\)[ ][ ]*\(\)\([_A-Za-z][_A-Za-z0-9]*\)$/\1 \2\3 \3/p'\'''
lt_cv_sys_global_symbol_to_c_name_address='sed -n -e '\''s/^: \([^ ]*\) $/ {\"\1\", (lt_ptr) 0},/p'\'' -e '\''s/^[BCDEGRST] \([^ ]*\) \([^ ]*\)$/ {"\2", (lt_ptr) \&\2},/p'\'''
lt_cv_sys_global_symbol_to_cdecl='sed -n -e '\''s/^. .* \(.*\)$/extern int \1;/p'\'''
lt_cv_sys_max_cmd_len=32768
lt_lt_cv_prog_compiler_c_o='"yes"'
lt_lt_cv_prog_compiler_c_o_CXX='"yes"'
lt_lt_cv_prog_compiler_c_o_F77='"yes"'
lt_lt_cv_sys_global_symbol_pipe='"sed -n -e '\''s/^.*[ ]\\([ABCDGIRSTW][ABCDGIRSTW]*\\)[ ][ ]*\\(\\)\\([_A-Za-z][_A-Za-z0-9]*\\)\$/\\1 \\2\\3 \\3/p'\''"'
lt_lt_cv_sys_global_symbol_to_c_name_address='"sed -n -e '\''s/^: \\([^ ]*\\) \$/ {\\\"\\1\\\", (lt_ptr) 0},/p'\'' -e '\''s/^[BCDEGRST] \\([^ ]*\\) \\([^ ]*\\)\$/ {\"\\2\", (lt_ptr) \\&\\2},/p'\''"'
lt_lt_cv_sys_global_symbol_to_cdecl='"sed -n -e '\''s/^. .* \\(.*\\)\$/extern int \\1;/p'\''"'
## ----------------- ##
## Output variables. ##
## ----------------- ##
ACLOCAL='aclocal-1.4'
AR='ar'
AUTOCONF='autoconf'
AUTOHEADER='autoheader'
AUTOMAKE='automake-1.4'
BUILD_IRSSIBOT_FALSE=''
BUILD_IRSSIBOT_TRUE=''
BUILD_IRSSIPROXY_FALSE=''
BUILD_IRSSIPROXY_TRUE=''
BUILD_PLUGINS_FALSE=''
BUILD_PLUGINS_TRUE=''
BUILD_TEXTUI_FALSE=''
BUILD_TEXTUI_TRUE=''
CC='gcc'
CFLAGS='-g -O2'
CHAT_MODULES=''
COMMON_LIBS=''
COMMON_NOUI_LIBS=''
CPP='gcc -E'
CPPFLAGS=''
CURSES_INCLUDEDIR=''
CURSES_LIBS=''
CXX='g++'
CXXCPP='g++ -E'
CXXFLAGS='-g -O2'
DEFS=''
DYNALOADER_A=''
ECHO='echo'
ECHO_C=''
ECHO_N='-n'
ECHO_T=''
EGREP='grep -E'
EXEEXT=''
F77='g77'
FFLAGS='-g -O2'
GLIB_CFLAGS=''
GLIB_CONFIG='no'
GLIB_GENMARSHAL=''
GLIB_LIBS=''
GLIB_MKENUMS=''
GOBJECT_QUERY=''
HAVE_PERL_FALSE=''
HAVE_PERL_TRUE=''
HAVE_STATIC_PERL_FALSE=''
HAVE_STATIC_PERL_TRUE=''
INSTALL_DATA='${INSTALL} -m 644'
INSTALL_PROGRAM='${INSTALL}'
INSTALL_SCRIPT='${INSTALL}'
LDFLAGS=''
LIBOBJS=''
LIBPERL_A=''
LIBS=''
LIBTOOL='$(SHELL) $(top_builddir)/libtool'
LN_S='ln -s'
LTLIBOBJS=''
MAINT='#'
MAINTAINER_MODE_FALSE=''
MAINTAINER_MODE_TRUE='#'
MAKEINFO='makeinfo'
NEED_TPARM_FALSE=''
NEED_TPARM_TRUE=''
OBJEXT='o'
PACKAGE='irssi'
PACKAGE_BUGREPORT=''
PACKAGE_NAME=''
PACKAGE_STRING=''
PACKAGE_TARNAME=''
PACKAGE_VERSION=''
PATH_SEPARATOR=':'
PERL_CFLAGS=''
PERL_EXTRA_OPTS=''
PERL_FE_LINK_LIBS=''
PERL_LDFLAGS=''
PERL_LIBTOOL=''
PERL_LINK_FLAGS=''
PERL_LINK_LIBS=''
PERL_MM_PARAMS=''
PERL_STATIC_LIBS=''
PERL_USE_LIB=''
PKG_CONFIG='/usr/bin/pkg-config'
PROG_LIBS=''
RANLIB='ranlib'
SET_MAKE=''
SHELL='/bin/sh'
SSL_CFLAGS=''
SSL_LIBS=''
STRIP='strip'
TEXTUI_LIBS=''
USE_CURSES_FALSE=''
USE_CURSES_TRUE=''
VERSION='0.8.10'
VERSION_DATE=''
VERSION_TIME=''
ac_ct_AR='ar'
ac_ct_CC='gcc'
ac_ct_CXX='g++'
ac_ct_F77='g77'
ac_ct_RANLIB='ranlib'
ac_ct_STRIP='strip'
ac_pt_PKG_CONFIG=''
bindir='${exec_prefix}/bin'
build='i686-pc-linux-gnu'
build_alias=''
build_cpu='i686'
build_os='linux-gnu'
build_vendor='pc'
datadir='${prefix}/share'
exec_prefix='NONE'
host='i686-pc-linux-gnu'
host_alias=''
host_cpu='i686'
host_os='linux-gnu'
host_vendor='pc'
includedir='${prefix}/include'
infodir='${prefix}/info'
irc_MODULES=''
libdir='${exec_prefix}/lib'
libexecdir='${exec_prefix}/libexec'
localstatedir='${prefix}/var'
mandir='${prefix}/man'
oldincludedir='/usr/include'
perl_module_fe_lib=''
perl_module_lib=''
perl_static_fe_lib=''
perl_static_lib=''
perlpath='/usr/bin/perl'
prefix='NONE'
program_transform_name='s,x,x,'
sbindir='${exec_prefix}/sbin'
sedpath='/bin/sed'
sharedstatedir='${prefix}/com'
sysconfdir='${prefix}/etc'
target_alias=''
## ----------- ##
## confdefs.h. ##
## ----------- ##
#define HAVE_DIRENT_H 1
#define HAVE_DLFCN_H 1
#define HAVE_FCNTL 1
#define HAVE_INTTYPES_H 1
#define HAVE_MEMORY_H 1
#define HAVE_MKFIFO 1
#define HAVE_NL_LANGINFO 1
#define HAVE_REGEX_H 1
#define HAVE_STDINT_H 1
#define HAVE_STDLIB_H 1
#define HAVE_STDLIB_H 1
#define HAVE_STRINGS_H 1
#define HAVE_STRING_H 1
#define HAVE_STRING_H 1
#define HAVE_SYS_IOCTL_H 1
#define HAVE_SYS_RESOURCE_H 1
#define HAVE_SYS_STAT_H 1
#define HAVE_SYS_TIME_H 1
#define HAVE_SYS_TYPES_H 1
#define HAVE_SYS_UTSNAME_H 1
#define HAVE_UNISTD_H 1
#define HAVE_UNISTD_H 1
#define PACKAGE "irssi"
#define PACKAGE_BUGREPORT ""
#define PACKAGE_NAME ""
#define PACKAGE_STRING ""
#define PACKAGE_TARNAME ""
#define PACKAGE_VERSION ""
#define PRIuUOFF_T "llu"
#define SIZEOF_INT 4
#define SIZEOF_LONG 4
#define SIZEOF_LONG_LONG 8
#define STDC_HEADERS 1
#define UOFF_T_LONG_LONG 1
#define VERSION "0.8.10"
#define _FILE_OFFSET_BITS 64
#endif
#ifdef __cplusplus
extern "C" void std::exit (int) throw (); using std::exit;
configure: exit 1