All pastes #25949 Raw Edit

Someone

public text v1 · immutable
#25949 ·published 2005-10-19 12:14 UTC
rendered paste body
This file contains any messages produced by compilers while
running configure, to aid debugging if configure makes a mistake.

It was created by djvulibre configure 3.5.14, which was
generated by GNU Autoconf 2.59.  Invocation command line was

  $ ./configure --prefix=/usr --host=x86_64-pc-linux-gnu --mandir=/usr/share/man --infodir=/usr/share/info --datadir=/usr/share --sysconfdir=/etc --localstatedir=/var/lib --libdir=/usr/lib64 --build=x86_64-pc-linux-gnu --enable-desktopfiles --enable-xmltools --with-qt --with-jpeg --with-tiff --enable-threads --enable-i18n --enable-debug

## --------- ##
## Platform. ##
## --------- ##

hostname = bedazzled
uname -m = x86_64
uname -r = 2.6.13-gentoo-r3
uname -s = Linux
uname -v = #3 Tue Oct 18 17:06:01 EEST 2005

/usr/bin/uname -p = AMD Athlon(tm) 64 Processor 3000+
/bin/uname -X     = unknown

/bin/arch              = x86_64
/usr/bin/arch -k       = unknown
/usr/convex/getsysinfo = unknown
hostinfo               = unknown
/bin/machine           = unknown
/usr/bin/oslevel       = unknown
/bin/universe          = unknown

PATH: /usr/lib/ccache/bin
PATH: /sbin
PATH: /usr/sbin
PATH: /usr/lib/portage/bin
PATH: /bin
PATH: /usr/bin
PATH: /opt/bin
PATH: /usr/x86_64-pc-linux-gnu/gcc-bin/3.4.4
PATH: /usr/qt/3/bin
PATH: /usr/kde/3.4/sbin
PATH: /usr/kde/3.4/bin


## ----------- ##
## Core tests. ##
## ----------- ##

configure:1615: checking build system type
configure:1633: result: x86_64-pc-linux-gnu
configure:1641: checking host system type
configure:1655: result: x86_64-pc-linux-gnu
configure:1719: checking whether make sets $(MAKE)
configure:1739: result: yes
configure:1750: checking whether ln -s works
configure:1754: result: yes
configure:1763: checking for rm
configure:1781: found /bin/rm
configure:1793: result: /bin/rm
configure:1802: checking for ar
configure:1820: found /usr/bin/ar
configure:1832: result: /usr/bin/ar
configure:1841: checking for touch
configure:1859: found /bin/touch
configure:1871: result: /bin/touch
configure:1880: checking for mkdir
configure:1898: found /bin/mkdir
configure:1910: result: /bin/mkdir
configure:2004: checking for x86_64-pc-linux-gnu-gcc
configure:2020: found /usr/lib/ccache/bin/x86_64-pc-linux-gnu-gcc
configure:2030: result: x86_64-pc-linux-gnu-gcc
configure:2312: checking for C compiler version
configure:2315: x86_64-pc-linux-gnu-gcc --version </dev/null >&5
x86_64-pc-linux-gnu-gcc (GCC) 3.4.4 (Gentoo 3.4.4-r1, ssp-3.4.4-1.0, pie-8.7.8)
Copyright (C) 2004 Free Software Foundation, Inc.
This is free software; see the source for copying conditions.  There is NO
warranty; not even for MERCHANTABILITY or FITNESS FOR A PARTICULAR PURPOSE.

configure:2318: $? = 0
configure:2320: x86_64-pc-linux-gnu-gcc -v </dev/null >&5
Reading specs from /usr/lib/gcc/x86_64-pc-linux-gnu/3.4.4/specs
Configured with: /var/tmp/portage/gcc-3.4.4-r1/work/gcc-3.4.4/configure --prefix=/usr --bindir=/usr/x86_64-pc-linux-gnu/gcc-bin/3.4.4 --includedir=/usr/lib/gcc/x86_64-pc-linux-gnu/3.4.4/include --datadir=/usr/share/gcc-data/x86_64-pc-linux-gnu/3.4.4 --mandir=/usr/share/gcc-data/x86_64-pc-linux-gnu/3.4.4/man --infodir=/usr/share/gcc-data/x86_64-pc-linux-gnu/3.4.4/info --with-gxx-include-dir=/usr/lib/gcc/x86_64-pc-linux-gnu/3.4.4/include/g++-v3 --host=x86_64-pc-linux-gnu --build=x86_64-pc-linux-gnu --disable-altivec --enable-nls --without-included-gettext --with-system-zlib --disable-checking --disable-werror --disable-libunwind-exceptions --enable-multilib --disable-libgcj --enable-languages=c,c++ --enable-shared --enable-threads=posix --enable-__cxa_atexit --enable-clocale=gnu
Thread model: posix
gcc version 3.4.4 (Gentoo 3.4.4-r1, ssp-3.4.4-1.0, pie-8.7.8)
configure:2323: $? = 0
configure:2325: x86_64-pc-linux-gnu-gcc -V </dev/null >&5
x86_64-pc-linux-gnu-gcc: `-V' option must have argument
configure:2328: $? = 1
configure:2351: checking for C compiler default output file name
configure:2354: x86_64-pc-linux-gnu-gcc -march=k8 -O2 -pipe   conftest.c  >&5
configure:2357: $? = 0
configure:2403: result: a.out
configure:2408: checking whether the C compiler works
configure:2414: ./a.out
configure:2417: $? = 0
configure:2434: result: yes
configure:2441: checking whether we are cross compiling
configure:2443: result: no
configure:2446: checking for suffix of executables
configure:2448: x86_64-pc-linux-gnu-gcc -o conftest -march=k8 -O2 -pipe   conftest.c  >&5
configure:2451: $? = 0
configure:2476: result: 
configure:2482: checking for suffix of object files
configure:2503: x86_64-pc-linux-gnu-gcc -c -march=k8 -O2 -pipe  conftest.c >&5
configure:2506: $? = 0
configure:2528: result: o
configure:2532: checking whether we are using the GNU C compiler
configure:2556: x86_64-pc-linux-gnu-gcc -c -march=k8 -O2 -pipe  conftest.c >&5
configure:2562: $? = 0
configure:2566: test -z 
			 || test ! -s conftest.err
configure:2569: $? = 0
configure:2572: test -s conftest.o
configure:2575: $? = 0
configure:2588: result: yes
configure:2594: checking whether x86_64-pc-linux-gnu-gcc accepts -g
configure:2615: x86_64-pc-linux-gnu-gcc -c -g  conftest.c >&5
configure:2621: $? = 0
configure:2625: test -z 
			 || test ! -s conftest.err
configure:2628: $? = 0
configure:2631: test -s conftest.o
configure:2634: $? = 0
configure:2645: result: yes
configure:2662: checking for x86_64-pc-linux-gnu-gcc option to accept ANSI C
configure:2732: x86_64-pc-linux-gnu-gcc  -c -march=k8 -O2 -pipe  conftest.c >&5
configure:2738: $? = 0
configure:2742: test -z 
			 || test ! -s conftest.err
configure:2745: $? = 0
configure:2748: test -s conftest.o
configure:2751: $? = 0
configure:2769: result: none needed
configure:2787: x86_64-pc-linux-gnu-gcc -c -march=k8 -O2 -pipe  conftest.c >&5
conftest.c:2: error: parse error before "me"
configure:2793: $? = 1
configure: failed program was:
| #ifndef __cplusplus
|   choke me
| #endif
configure:2926: checking for a sed that does not truncate output
configure:2980: result: /bin/sed
configure:2983: checking for egrep
configure:2993: result: grep -E
configure:3009: checking for ld used by x86_64-pc-linux-gnu-gcc
configure:3076: result: /usr/x86_64-pc-linux-gnu/bin/ld
configure:3085: checking if the linker (/usr/x86_64-pc-linux-gnu/bin/ld) is GNU ld
configure:3100: result: yes
configure:3105: checking for /usr/x86_64-pc-linux-gnu/bin/ld option to reload object files
configure:3112: result: -r
configure:3121: checking for BSD-compatible nm
configure:3163: result: /usr/bin/x86_64-pc-linux-gnu-nm -B
configure:3167: checking how to recognise dependent libraries
configure:3350: result: pass_all
configure:3435: x86_64-pc-linux-gnu-gcc -c -march=k8 -O2 -pipe  conftest.c >&5
configure:3438: $? = 0
configure:3564: checking how to run the C preprocessor
configure:3599: x86_64-pc-linux-gnu-gcc -E  conftest.c
configure:3605: $? = 0
configure:3637: x86_64-pc-linux-gnu-gcc -E  conftest.c
conftest.c:9:28: ac_nonexistent.h: No such file or directory
configure:3643: $? = 1
configure: failed program was:
| /* confdefs.h.  */
| 
| #define PACKAGE_NAME "djvulibre"
| #define PACKAGE_TARNAME "djvulibre"
| #define PACKAGE_VERSION "3.5.14"
| #define PACKAGE_STRING "djvulibre 3.5.14"
| #define PACKAGE_BUGREPORT ""
| /* end confdefs.h.  */
| #include <ac_nonexistent.h>
configure:3682: result: x86_64-pc-linux-gnu-gcc -E
configure:3706: x86_64-pc-linux-gnu-gcc -E  conftest.c
configure:3712: $? = 0
configure:3744: x86_64-pc-linux-gnu-gcc -E  conftest.c
conftest.c:9:28: ac_nonexistent.h: No such file or directory
configure:3750: $? = 1
configure: failed program was:
| /* confdefs.h.  */
| 
| #define PACKAGE_NAME "djvulibre"
| #define PACKAGE_TARNAME "djvulibre"
| #define PACKAGE_VERSION "3.5.14"
| #define PACKAGE_STRING "djvulibre 3.5.14"
| #define PACKAGE_BUGREPORT ""
| /* end confdefs.h.  */
| #include <ac_nonexistent.h>
configure:3794: checking for ANSI C header files
configure:3819: x86_64-pc-linux-gnu-gcc -c -march=k8 -O2 -pipe  conftest.c >&5
configure:3825: $? = 0
configure:3829: test -z 
			 || test ! -s conftest.err
configure:3832: $? = 0
configure:3835: test -s conftest.o
configure:3838: $? = 0
configure:3927: x86_64-pc-linux-gnu-gcc -o conftest -march=k8 -O2 -pipe   conftest.c  >&5
configure:3930: $? = 0
configure:3932: ./conftest
configure:3935: $? = 0
configure:3950: result: yes
configure:3974: checking for sys/types.h
configure:3990: x86_64-pc-linux-gnu-gcc -c -march=k8 -O2 -pipe  conftest.c >&5
configure:3996: $? = 0
configure:4000: test -z 
			 || test ! -s conftest.err
configure:4003: $? = 0
configure:4006: test -s conftest.o
configure:4009: $? = 0
configure:4020: result: yes
configure:3974: checking for sys/stat.h
configure:3990: x86_64-pc-linux-gnu-gcc -c -march=k8 -O2 -pipe  conftest.c >&5
configure:3996: $? = 0
configure:4000: test -z 
			 || test ! -s conftest.err
configure:4003: $? = 0
configure:4006: test -s conftest.o
configure:4009: $? = 0
configure:4020: result: yes
configure:3974: checking for stdlib.h
configure:3990: x86_64-pc-linux-gnu-gcc -c -march=k8 -O2 -pipe  conftest.c >&5
configure:3996: $? = 0
configure:4000: test -z 
			 || test ! -s conftest.err
configure:4003: $? = 0
configure:4006: test -s conftest.o
configure:4009: $? = 0
configure:4020: result: yes
configure:3974: checking for string.h
configure:3990: x86_64-pc-linux-gnu-gcc -c -march=k8 -O2 -pipe  conftest.c >&5
configure:3996: $? = 0
configure:4000: test -z 
			 || test ! -s conftest.err
configure:4003: $? = 0
configure:4006: test -s conftest.o
configure:4009: $? = 0
configure:4020: result: yes
configure:3974: checking for memory.h
configure:3990: x86_64-pc-linux-gnu-gcc -c -march=k8 -O2 -pipe  conftest.c >&5
configure:3996: $? = 0
configure:4000: test -z 
			 || test ! -s conftest.err
configure:4003: $? = 0
configure:4006: test -s conftest.o
configure:4009: $? = 0
configure:4020: result: yes
configure:3974: checking for strings.h
configure:3990: x86_64-pc-linux-gnu-gcc -c -march=k8 -O2 -pipe  conftest.c >&5
configure:3996: $? = 0
configure:4000: test -z 
			 || test ! -s conftest.err
configure:4003: $? = 0
configure:4006: test -s conftest.o
configure:4009: $? = 0
configure:4020: result: yes
configure:3974: checking for inttypes.h
configure:3990: x86_64-pc-linux-gnu-gcc -c -march=k8 -O2 -pipe  conftest.c >&5
configure:3996: $? = 0
configure:4000: test -z 
			 || test ! -s conftest.err
configure:4003: $? = 0
configure:4006: test -s conftest.o
configure:4009: $? = 0
configure:4020: result: yes
configure:3974: checking for stdint.h
configure:3990: x86_64-pc-linux-gnu-gcc -c -march=k8 -O2 -pipe  conftest.c >&5
configure:3996: $? = 0
configure:4000: test -z 
			 || test ! -s conftest.err
configure:4003: $? = 0
configure:4006: test -s conftest.o
configure:4009: $? = 0
configure:4020: result: yes
configure:3974: checking for unistd.h
configure:3990: x86_64-pc-linux-gnu-gcc -c -march=k8 -O2 -pipe  conftest.c >&5
configure:3996: $? = 0
configure:4000: test -z 
			 || test ! -s conftest.err
configure:4003: $? = 0
configure:4006: test -s conftest.o
configure:4009: $? = 0
configure:4020: result: yes
configure:4046: checking dlfcn.h usability
configure:4058: x86_64-pc-linux-gnu-gcc -c -march=k8 -O2 -pipe  conftest.c >&5
configure:4064: $? = 0
configure:4068: test -z 
			 || test ! -s conftest.err
configure:4071: $? = 0
configure:4074: test -s conftest.o
configure:4077: $? = 0
configure:4087: result: yes
configure:4091: checking dlfcn.h presence
configure:4101: x86_64-pc-linux-gnu-gcc -E  conftest.c
configure:4107: $? = 0
configure:4127: result: yes
configure:4162: checking for dlfcn.h
configure:4169: result: yes
configure:4192: checking for x86_64-pc-linux-gnu-g++
configure:4208: found /usr/lib/ccache/bin/x86_64-pc-linux-gnu-g++
configure:4218: result: x86_64-pc-linux-gnu-g++
configure:4276: checking for C++ compiler version
configure:4279: x86_64-pc-linux-gnu-g++ --version </dev/null >&5
x86_64-pc-linux-gnu-g++ (GCC) 3.4.4 (Gentoo 3.4.4-r1, ssp-3.4.4-1.0, pie-8.7.8)
Copyright (C) 2004 Free Software Foundation, Inc.
This is free software; see the source for copying conditions.  There is NO
warranty; not even for MERCHANTABILITY or FITNESS FOR A PARTICULAR PURPOSE.

configure:4282: $? = 0
configure:4284: x86_64-pc-linux-gnu-g++ -v </dev/null >&5
Reading specs from /usr/lib/gcc/x86_64-pc-linux-gnu/3.4.4/specs
Configured with: /var/tmp/portage/gcc-3.4.4-r1/work/gcc-3.4.4/configure --prefix=/usr --bindir=/usr/x86_64-pc-linux-gnu/gcc-bin/3.4.4 --includedir=/usr/lib/gcc/x86_64-pc-linux-gnu/3.4.4/include --datadir=/usr/share/gcc-data/x86_64-pc-linux-gnu/3.4.4 --mandir=/usr/share/gcc-data/x86_64-pc-linux-gnu/3.4.4/man --infodir=/usr/share/gcc-data/x86_64-pc-linux-gnu/3.4.4/info --with-gxx-include-dir=/usr/lib/gcc/x86_64-pc-linux-gnu/3.4.4/include/g++-v3 --host=x86_64-pc-linux-gnu --build=x86_64-pc-linux-gnu --disable-altivec --enable-nls --without-included-gettext --with-system-zlib --disable-checking --disable-werror --disable-libunwind-exceptions --enable-multilib --disable-libgcj --enable-languages=c,c++ --enable-shared --enable-threads=posix --enable-__cxa_atexit --enable-clocale=gnu
Thread model: posix
gcc version 3.4.4 (Gentoo 3.4.4-r1, ssp-3.4.4-1.0, pie-8.7.8)
configure:4287: $? = 0
configure:4289: x86_64-pc-linux-gnu-g++ -V </dev/null >&5
x86_64-pc-linux-gnu-g++: `-V' option must have argument
configure:4292: $? = 1
configure:4295: checking whether we are using the GNU C++ compiler
configure:4319: x86_64-pc-linux-gnu-g++ -c -march=k8 -O2 -pipe  conftest.cc >&5
configure:4325: $? = 0
configure:4329: test -z 
			 || test ! -s conftest.err
configure:4332: $? = 0
configure:4335: test -s conftest.o
configure:4338: $? = 0
configure:4351: result: yes
configure:4357: checking whether x86_64-pc-linux-gnu-g++ accepts -g
configure:4378: x86_64-pc-linux-gnu-g++ -c -g  conftest.cc >&5
configure:4384: $? = 0
configure:4388: test -z 
			 || test ! -s conftest.err
configure:4391: $? = 0
configure:4394: test -s conftest.o
configure:4397: $? = 0
configure:4408: result: yes
configure:4450: x86_64-pc-linux-gnu-g++ -c -march=k8 -O2 -pipe  conftest.cc >&5
configure:4456: $? = 0
configure:4460: test -z 
			 || test ! -s conftest.err
configure:4463: $? = 0
configure:4466: test -s conftest.o
configure:4469: $? = 0
configure:4495: x86_64-pc-linux-gnu-g++ -c -march=k8 -O2 -pipe  conftest.cc >&5
conftest.cc: In function `int main()':
conftest.cc:24: error: `exit' undeclared (first use this function)
conftest.cc:24: error: (Each undeclared identifier is reported only once for each function it appears in.)
configure:4501: $? = 1
configure: failed program was:
| /* confdefs.h.  */
| 
| #define PACKAGE_NAME "djvulibre"
| #define PACKAGE_TARNAME "djvulibre"
| #define PACKAGE_VERSION "3.5.14"
| #define PACKAGE_STRING "djvulibre 3.5.14"
| #define PACKAGE_BUGREPORT ""
| #define STDC_HEADERS 1
| #define HAVE_SYS_TYPES_H 1
| #define HAVE_SYS_STAT_H 1
| #define HAVE_STDLIB_H 1
| #define HAVE_STRING_H 1
| #define HAVE_MEMORY_H 1
| #define HAVE_STRINGS_H 1
| #define HAVE_INTTYPES_H 1
| #define HAVE_STDINT_H 1
| #define HAVE_UNISTD_H 1
| #define HAVE_DLFCN_H 1
| /* end confdefs.h.  */
| 
| int
| main ()
| {
| exit (42);
|   ;
|   return 0;
| }
configure:4450: x86_64-pc-linux-gnu-g++ -c -march=k8 -O2 -pipe  conftest.cc >&5
configure:4456: $? = 0
configure:4460: test -z 
			 || test ! -s conftest.err
configure:4463: $? = 0
configure:4466: test -s conftest.o
configure:4469: $? = 0
configure:4495: x86_64-pc-linux-gnu-g++ -c -march=k8 -O2 -pipe  conftest.cc >&5
configure:4501: $? = 0
configure:4505: test -z 
			 || test ! -s conftest.err
configure:4508: $? = 0
configure:4511: test -s conftest.o
configure:4514: $? = 0
configure:4542: checking how to run the C++ preprocessor
configure:4573: x86_64-pc-linux-gnu-g++ -E  conftest.cc
configure:4579: $? = 0
configure:4611: x86_64-pc-linux-gnu-g++ -E  conftest.cc
conftest.cc:23:28: ac_nonexistent.h: No such file or directory
configure:4617: $? = 1
configure: failed program was:
| /* confdefs.h.  */
| 
| #define PACKAGE_NAME "djvulibre"
| #define PACKAGE_TARNAME "djvulibre"
| #define PACKAGE_VERSION "3.5.14"
| #define PACKAGE_STRING "djvulibre 3.5.14"
| #define PACKAGE_BUGREPORT ""
| #define STDC_HEADERS 1
| #define HAVE_SYS_TYPES_H 1
| #define HAVE_SYS_STAT_H 1
| #define HAVE_STDLIB_H 1
| #define HAVE_STRING_H 1
| #define HAVE_MEMORY_H 1
| #define HAVE_STRINGS_H 1
| #define HAVE_INTTYPES_H 1
| #define HAVE_STDINT_H 1
| #define HAVE_UNISTD_H 1
| #define HAVE_DLFCN_H 1
| #ifdef __cplusplus
| extern "C" void std::exit (int) throw (); using std::exit;
| #endif
| /* end confdefs.h.  */
| #include <ac_nonexistent.h>
configure:4656: result: x86_64-pc-linux-gnu-g++ -E
configure:4680: x86_64-pc-linux-gnu-g++ -E  conftest.cc
configure:4686: $? = 0
configure:4718: x86_64-pc-linux-gnu-g++ -E  conftest.cc
conftest.cc:23:28: ac_nonexistent.h: No such file or directory
configure:4724: $? = 1
configure: failed program was:
| /* confdefs.h.  */
| 
| #define PACKAGE_NAME "djvulibre"
| #define PACKAGE_TARNAME "djvulibre"
| #define PACKAGE_VERSION "3.5.14"
| #define PACKAGE_STRING "djvulibre 3.5.14"
| #define PACKAGE_BUGREPORT ""
| #define STDC_HEADERS 1
| #define HAVE_SYS_TYPES_H 1
| #define HAVE_SYS_STAT_H 1
| #define HAVE_STDLIB_H 1
| #define HAVE_STRING_H 1
| #define HAVE_MEMORY_H 1
| #define HAVE_STRINGS_H 1
| #define HAVE_INTTYPES_H 1
| #define HAVE_STDINT_H 1
| #define HAVE_UNISTD_H 1
| #define HAVE_DLFCN_H 1
| #ifdef __cplusplus
| extern "C" void std::exit (int) throw (); using std::exit;
| #endif
| /* end confdefs.h.  */
| #include <ac_nonexistent.h>
configure:4777: checking for x86_64-pc-linux-gnu-g77
configure:4806: result: no
configure:4777: checking for x86_64-pc-linux-gnu-f77
configure:4806: result: no
configure:4777: checking for x86_64-pc-linux-gnu-xlf
configure:4806: result: no
configure:4777: checking for x86_64-pc-linux-gnu-frt
configure:4806: result: no
configure:4777: checking for x86_64-pc-linux-gnu-pgf77
configure:4806: result: no
configure:4777: checking for x86_64-pc-linux-gnu-fort77
configure:4806: result: no
configure:4777: checking for x86_64-pc-linux-gnu-fl32
configure:4806: result: no
configure:4777: checking for x86_64-pc-linux-gnu-af77
configure:4806: result: no
configure:4777: checking for x86_64-pc-linux-gnu-f90
configure:4806: result: no
configure:4777: checking for x86_64-pc-linux-gnu-xlf90
configure:4806: result: no
configure:4777: checking for x86_64-pc-linux-gnu-pgf90
configure:4806: result: no
configure:4777: checking for x86_64-pc-linux-gnu-epcf90
configure:4806: result: no
configure:4777: checking for x86_64-pc-linux-gnu-f95
configure:4806: result: no
configure:4777: checking for x86_64-pc-linux-gnu-fort
configure:4806: result: no
configure:4777: checking for x86_64-pc-linux-gnu-xlf95
configure:4806: result: no
configure:4777: checking for x86_64-pc-linux-gnu-ifc
configure:4806: result: no
configure:4777: checking for x86_64-pc-linux-gnu-efc
configure:4806: result: no
configure:4777: checking for x86_64-pc-linux-gnu-pgf95
configure:4806: result: no
configure:4777: checking for x86_64-pc-linux-gnu-lf95
configure:4806: result: no
configure:4777: checking for x86_64-pc-linux-gnu-gfortran
configure:4806: result: no
configure:4819: checking for g77
configure:4848: result: no
configure:4819: checking for f77
configure:4848: result: no
configure:4819: checking for xlf
configure:4848: result: no
configure:4819: checking for frt
configure:4848: result: no
configure:4819: checking for pgf77
configure:4848: result: no
configure:4819: checking for fort77
configure:4848: result: no
configure:4819: checking for fl32
configure:4848: result: no
configure:4819: checking for af77
configure:4848: result: no
configure:4819: checking for f90
configure:4848: result: no
configure:4819: checking for xlf90
configure:4848: result: no
configure:4819: checking for pgf90
configure:4848: result: no
configure:4819: checking for epcf90
configure:4848: result: no
configure:4819: checking for f95
configure:4848: result: no
configure:4819: checking for fort
configure:4848: result: no
configure:4819: checking for xlf95
configure:4848: result: no
configure:4819: checking for ifc
configure:4848: result: no
configure:4819: checking for efc
configure:4848: result: no
configure:4819: checking for pgf95
configure:4848: result: no
configure:4819: checking for lf95
configure:4848: result: no
configure:4819: checking for gfortran
configure:4848: result: no
configure:4860: checking for Fortran 77 compiler version
configure:4863:  --version </dev/null >&5
./configure: line 4864: --version: command not found
configure:4866: $? = 127
configure:4868:  -v </dev/null >&5
./configure: line 4869: -v: command not found
configure:4871: $? = 127
configure:4873:  -V </dev/null >&5
./configure: line 4874: -V: command not found
configure:4876: $? = 127
configure:4884: checking whether we are using the GNU Fortran 77 compiler
configure:4898:  -c  conftest.F >&5
./configure: line 4899: -c: command not found
configure:4904: $? = 127
configure: failed program was:
|       program main
| #ifndef __GNUC__
|        choke me
| #endif
| 
|       end
configure:4930: result: no
configure:4936: checking whether  accepts -g
configure:4948:  -c -g conftest.f >&5
./configure: line 4949: -c: command not found
configure:4954: $? = 127
configure: failed program was:
|       program main
| 
|       end
configure:4979: result: no
configure:5009: checking the maximum length of command line arguments
configure:5074: result: 32768
configure:5085: checking command to parse /usr/bin/x86_64-pc-linux-gnu-nm -B output from x86_64-pc-linux-gnu-gcc object
configure:5174: x86_64-pc-linux-gnu-gcc -c -march=k8 -O2 -pipe  conftest.c >&5
configure:5177: $? = 0
configure:5181: /usr/bin/x86_64-pc-linux-gnu-nm -B conftest.o \| sed -n -e 's/^.*[ 	]\([ABCDGIRSTW][ABCDGIRSTW]*\)[ 	][ 	]*\(\)\([_A-Za-z][_A-Za-z0-9]*\)$/\1 \2\3 \3/p' \> conftest.nm
configure:5184: $? = 0
configure:5236: x86_64-pc-linux-gnu-gcc -o conftest -march=k8 -O2 -pipe   conftest.c conftstm.o >&5
configure:5239: $? = 0
configure:5277: result: ok
configure:5281: checking for objdir
configure:5296: result: .libs
configure:5348: checking for x86_64-pc-linux-gnu-ar
configure:5374: result: /usr/bin/ar
configure:5428: checking for x86_64-pc-linux-gnu-ranlib
configure:5444: found /usr/bin/x86_64-pc-linux-gnu-ranlib
configure:5454: result: x86_64-pc-linux-gnu-ranlib
configure:5508: checking for x86_64-pc-linux-gnu-strip
configure:5524: found /usr/bin/x86_64-pc-linux-gnu-strip
configure:5534: result: x86_64-pc-linux-gnu-strip
configure:5835: checking if x86_64-pc-linux-gnu-gcc static flag  works
configure:5858: result: yes
configure:5880: checking if x86_64-pc-linux-gnu-gcc supports -fno-rtti -fno-exceptions
configure:5898: x86_64-pc-linux-gnu-gcc -c -march=k8 -O2 -pipe  -fno-rtti -fno-exceptions conftest.c >&5
cc1: warning: command line option "-fno-rtti" is valid for C++/ObjC++ but not for C
cc1: warning: command line option "-fno-rtti" is valid for C++/ObjC++ but not for C
configure:5902: $? = 0
configure:5913: result: no
configure:5928: checking for x86_64-pc-linux-gnu-gcc option to produce PIC
configure:6105: result: -fPIC
configure:6113: checking if x86_64-pc-linux-gnu-gcc PIC flag -fPIC works
configure:6131: x86_64-pc-linux-gnu-gcc -c -march=k8 -O2 -pipe  -fPIC -DPIC conftest.c >&5
configure:6135: $? = 0
configure:6146: result: yes
configure:6170: checking if x86_64-pc-linux-gnu-gcc supports -c -o file.o
configure:6191: x86_64-pc-linux-gnu-gcc -c -march=k8 -O2 -pipe  -o out/conftest2.o conftest.c >&5
configure:6195: $? = 0
configure:6215: result: yes
configure:6241: checking whether the x86_64-pc-linux-gnu-gcc linker (/usr/x86_64-pc-linux-gnu/bin/ld -m elf_x86_64) supports shared libraries
configure:7089: result: yes
configure:7115: checking whether -lc should be explicitly linked in
configure:7120: x86_64-pc-linux-gnu-gcc -c -march=k8 -O2 -pipe  conftest.c >&5
configure:7123: $? = 0
configure:7137: x86_64-pc-linux-gnu-gcc -shared conftest.o  -v -Wl,-soname -Wl,conftest -o conftest 2\>\&1 \| grep  -lc  \>/dev/null 2\>\&1
configure:7140: $? = 0
configure:7152: result: no
configure:7160: checking dynamic linker characteristics
configure:7700: result: GNU/Linux ld.so
configure:7704: checking how to hardcode library paths into programs
configure:7729: result: immediate
configure:7743: checking whether stripping libraries is possible
configure:7748: result: yes
configure:8578: checking if libtool supports shared libraries
configure:8580: result: yes
configure:8583: checking whether to build shared libraries
configure:8641: result: yes
configure:8644: checking whether to build static libraries
configure:8648: result: no
configure:8740: creating libtool
configure:9287: checking for ld used by x86_64-pc-linux-gnu-g++
configure:9354: result: /usr/x86_64-pc-linux-gnu/bin/ld -m elf_x86_64
configure:9363: checking if the linker (/usr/x86_64-pc-linux-gnu/bin/ld -m elf_x86_64) is GNU ld
configure:9378: result: yes
configure:9429: checking whether the x86_64-pc-linux-gnu-g++ linker (/usr/x86_64-pc-linux-gnu/bin/ld -m elf_x86_64) supports shared libraries
configure:10257: result: yes
configure:10279: x86_64-pc-linux-gnu-g++ -c -march=k8 -O2 -pipe  conftest.cc >&5
configure:10282: $? = 0
configure:10378: checking for x86_64-pc-linux-gnu-g++ option to produce PIC
configure:10630: result: -fPIC
configure:10638: checking if x86_64-pc-linux-gnu-g++ PIC flag -fPIC works
configure:10656: x86_64-pc-linux-gnu-g++ -c -march=k8 -O2 -pipe  -fPIC -DPIC conftest.cc >&5
configure:10660: $? = 0
configure:10671: result: yes
configure:10695: checking if x86_64-pc-linux-gnu-g++ supports -c -o file.o
configure:10716: x86_64-pc-linux-gnu-g++ -c -march=k8 -O2 -pipe  -o out/conftest2.o conftest.cc >&5
configure:10720: $? = 0
configure:10740: result: yes
configure:10766: checking whether the x86_64-pc-linux-gnu-g++ linker (/usr/x86_64-pc-linux-gnu/bin/ld -m elf_x86_64) supports shared libraries
configure:10791: result: yes
configure:10862: checking dynamic linker characteristics
configure:11402: result: GNU/Linux ld.so
configure:11406: checking how to hardcode library paths into programs
configure:11431: result: immediate
configure:11445: checking whether stripping libraries is possible
configure:11450: result: yes
configure:18697: checking for x86_64-pc-linux-gnu-gcc
configure:18723: result: x86_64-pc-linux-gnu-gcc
configure:19005: checking for C compiler version
configure:19008: x86_64-pc-linux-gnu-gcc --version </dev/null >&5
x86_64-pc-linux-gnu-gcc (GCC) 3.4.4 (Gentoo 3.4.4-r1, ssp-3.4.4-1.0, pie-8.7.8)
Copyright (C) 2004 Free Software Foundation, Inc.
This is free software; see the source for copying conditions.  There is NO
warranty; not even for MERCHANTABILITY or FITNESS FOR A PARTICULAR PURPOSE.

configure:19011: $? = 0
configure:19013: x86_64-pc-linux-gnu-gcc -v </dev/null >&5
Reading specs from /usr/lib/gcc/x86_64-pc-linux-gnu/3.4.4/specs
Configured with: /var/tmp/portage/gcc-3.4.4-r1/work/gcc-3.4.4/configure --prefix=/usr --bindir=/usr/x86_64-pc-linux-gnu/gcc-bin/3.4.4 --includedir=/usr/lib/gcc/x86_64-pc-linux-gnu/3.4.4/include --datadir=/usr/share/gcc-data/x86_64-pc-linux-gnu/3.4.4 --mandir=/usr/share/gcc-data/x86_64-pc-linux-gnu/3.4.4/man --infodir=/usr/share/gcc-data/x86_64-pc-linux-gnu/3.4.4/info --with-gxx-include-dir=/usr/lib/gcc/x86_64-pc-linux-gnu/3.4.4/include/g++-v3 --host=x86_64-pc-linux-gnu --build=x86_64-pc-linux-gnu --disable-altivec --enable-nls --without-included-gettext --with-system-zlib --disable-checking --disable-werror --disable-libunwind-exceptions --enable-multilib --disable-libgcj --enable-languages=c,c++ --enable-shared --enable-threads=posix --enable-__cxa_atexit --enable-clocale=gnu
Thread model: posix
gcc version 3.4.4 (Gentoo 3.4.4-r1, ssp-3.4.4-1.0, pie-8.7.8)
configure:19016: $? = 0
configure:19018: x86_64-pc-linux-gnu-gcc -V </dev/null >&5
x86_64-pc-linux-gnu-gcc: `-V' option must have argument
configure:19021: $? = 1
configure:19024: checking whether we are using the GNU C compiler
configure:19080: result: yes
configure:19086: checking whether x86_64-pc-linux-gnu-gcc accepts -g
configure:19137: result: yes
configure:19154: checking for x86_64-pc-linux-gnu-gcc option to accept ANSI C
configure:19261: result: none needed
configure:19279: x86_64-pc-linux-gnu-gcc -c -march=k8 -O2 -pipe  conftest.c >&5
conftest.c:2: error: parse error before "me"
configure:19285: $? = 1
configure: failed program was:
| #ifndef __cplusplus
|   choke me
| #endif
configure:19428: checking for x86_64-pc-linux-gnu-g++
configure:19454: result: x86_64-pc-linux-gnu-g++
configure:19512: checking for C++ compiler version
configure:19515: x86_64-pc-linux-gnu-g++ --version </dev/null >&5
x86_64-pc-linux-gnu-g++ (GCC) 3.4.4 (Gentoo 3.4.4-r1, ssp-3.4.4-1.0, pie-8.7.8)
Copyright (C) 2004 Free Software Foundation, Inc.
This is free software; see the source for copying conditions.  There is NO
warranty; not even for MERCHANTABILITY or FITNESS FOR A PARTICULAR PURPOSE.

configure:19518: $? = 0
configure:19520: x86_64-pc-linux-gnu-g++ -v </dev/null >&5
Reading specs from /usr/lib/gcc/x86_64-pc-linux-gnu/3.4.4/specs
Configured with: /var/tmp/portage/gcc-3.4.4-r1/work/gcc-3.4.4/configure --prefix=/usr --bindir=/usr/x86_64-pc-linux-gnu/gcc-bin/3.4.4 --includedir=/usr/lib/gcc/x86_64-pc-linux-gnu/3.4.4/include --datadir=/usr/share/gcc-data/x86_64-pc-linux-gnu/3.4.4 --mandir=/usr/share/gcc-data/x86_64-pc-linux-gnu/3.4.4/man --infodir=/usr/share/gcc-data/x86_64-pc-linux-gnu/3.4.4/info --with-gxx-include-dir=/usr/lib/gcc/x86_64-pc-linux-gnu/3.4.4/include/g++-v3 --host=x86_64-pc-linux-gnu --build=x86_64-pc-linux-gnu --disable-altivec --enable-nls --without-included-gettext --with-system-zlib --disable-checking --disable-werror --disable-libunwind-exceptions --enable-multilib --disable-libgcj --enable-languages=c,c++ --enable-shared --enable-threads=posix --enable-__cxa_atexit --enable-clocale=gnu
Thread model: posix
gcc version 3.4.4 (Gentoo 3.4.4-r1, ssp-3.4.4-1.0, pie-8.7.8)
configure:19523: $? = 0
configure:19525: x86_64-pc-linux-gnu-g++ -V </dev/null >&5
x86_64-pc-linux-gnu-g++: `-V' option must have argument
configure:19528: $? = 1
configure:19531: checking whether we are using the GNU C++ compiler
configure:19587: result: yes
configure:19593: checking whether x86_64-pc-linux-gnu-g++ accepts -g
configure:19644: result: yes
configure:19686: x86_64-pc-linux-gnu-g++ -c -march=k8 -O2 -pipe  conftest.cc >&5
configure:19692: $? = 0
configure:19696: test -z 
			 || test ! -s conftest.err
configure:19699: $? = 0
configure:19702: test -s conftest.o
configure:19705: $? = 0
configure:19731: x86_64-pc-linux-gnu-g++ -c -march=k8 -O2 -pipe  conftest.cc >&5
configure:19737: $? = 0
configure:19741: test -z 
			 || test ! -s conftest.err
configure:19744: $? = 0
configure:19747: test -s conftest.o
configure:19750: $? = 0
configure:19889: checking if x86_64-pc-linux-gnu-g++ accepts -Wall
configure:19893: result: yes
configure:19910: checking whether the compiler recognizes bool as a built-in type
configure:19943: x86_64-pc-linux-gnu-g++ -c  -march=k8 -pipe  conftest.cc >&5
configure:19949: $? = 0
configure:19953: test -z 
			 || test ! -s conftest.err
configure:19956: $? = 0
configure:19959: test -s conftest.o
configure:19962: $? = 0
configure:19980: result: yes
configure:19990: checking whether the compiler supports exceptions
configure:20019: x86_64-pc-linux-gnu-g++ -c  -march=k8 -pipe  conftest.cc >&5
configure:20025: $? = 0
configure:20029: test -z 
			 || test ! -s conftest.err
configure:20032: $? = 0
configure:20035: test -s conftest.o
configure:20038: $? = 0
configure:20056: result: yes
configure:20066: checking whether the compiler recognizes typename
configure:20095: x86_64-pc-linux-gnu-g++ -c  -march=k8 -pipe  conftest.cc >&5
configure:20101: $? = 0
configure:20105: test -z 
			 || test ! -s conftest.err
configure:20108: $? = 0
configure:20111: test -s conftest.o
configure:20114: $? = 0
configure:20132: result: yes
configure:20142: checking whether the compiler comes with standard includes
configure:20173: x86_64-pc-linux-gnu-g++ -c  -march=k8 -pipe  conftest.cc >&5
configure:20179: $? = 0
configure:20183: test -z 
			 || test ! -s conftest.err
configure:20186: $? = 0
configure:20189: test -s conftest.o
configure:20192: $? = 0
configure:20210: result: yes
configure:20220: checking whether the compiler implements namespaces
configure:20249: x86_64-pc-linux-gnu-g++ -c  -march=k8 -pipe  conftest.cc >&5
configure:20255: $? = 0
configure:20259: test -z 
			 || test ! -s conftest.err
configure:20262: $? = 0
configure:20265: test -s conftest.o
configure:20268: $? = 0
configure:20286: result: yes
configure:20296: checking whether the compiler supports member templates
configure:20329: x86_64-pc-linux-gnu-g++ -c  -march=k8 -pipe  conftest.cc >&5
configure:20335: $? = 0
configure:20339: test -z 
			 || test ! -s conftest.err
configure:20342: $? = 0
configure:20345: test -s conftest.o
configure:20348: $? = 0
configure:20366: result: yes
configure:20403: checking for sqrt in -lm
configure:20433: x86_64-pc-linux-gnu-g++ -o conftest  -march=k8 -pipe   conftest.cc -lm   >&5
configure:20439: $? = 0
configure:20443: test -z 
			 || test ! -s conftest.err
configure:20446: $? = 0
configure:20449: test -s conftest
configure:20452: $? = 0
configure:20465: result: yes
configure:20477: checking for libiconv in -liconv
configure:20507: x86_64-pc-linux-gnu-g++ -o conftest  -march=k8 -pipe   conftest.cc -liconv  -lm  >&5
/usr/lib/gcc/x86_64-pc-linux-gnu/3.4.4/../../../../x86_64-pc-linux-gnu/bin/ld: cannot find -liconv
collect2: ld returned 1 exit status
configure:20513: $? = 1
configure: failed program was:
| /* confdefs.h.  */
| 
| #define PACKAGE_NAME "djvulibre"
| #define PACKAGE_TARNAME "djvulibre"
| #define PACKAGE_VERSION "3.5.14"
| #define PACKAGE_STRING "djvulibre 3.5.14"
| #define PACKAGE_BUGREPORT ""
| #define STDC_HEADERS 1
| #define HAVE_SYS_TYPES_H 1
| #define HAVE_SYS_STAT_H 1
| #define HAVE_STDLIB_H 1
| #define HAVE_STRING_H 1
| #define HAVE_MEMORY_H 1
| #define HAVE_STRINGS_H 1
| #define HAVE_INTTYPES_H 1
| #define HAVE_STDINT_H 1
| #define HAVE_UNISTD_H 1
| #define HAVE_DLFCN_H 1
| #ifdef __cplusplus
| extern "C" void std::exit (int) throw (); using std::exit;
| #endif
| #define HAVE_BOOL 1
| #define HAVE_EXCEPTIONS 1
| #define HAVE_TYPENAME 1
| #define HAVE_STDINCLUDES 1
| #define HAVE_MEMBER_TEMPLATES 1
| #define HAVE_LIBM 1
| /* end confdefs.h.  */
| 
| /* Override any gcc2 internal prototype to avoid an error.  */
| #ifdef __cplusplus
| extern "C"
| #endif
| /* We use char because int might match the return type of a gcc2
|    builtin and then its argument prototype would still apply.  */
| char libiconv ();
| int
| main ()
| {
| libiconv ();
|   ;
|   return 0;
| }
configure:20539: result: no
configure:20556: checking for ANSI C header files
configure:20712: result: yes
configure:20730: checking for dirent.h that defines DIR
configure:20754: x86_64-pc-linux-gnu-g++ -c  -march=k8 -pipe  conftest.cc >&5
configure:20760: $? = 0
configure:20764: test -z 
			 || test ! -s conftest.err
configure:20767: $? = 0
configure:20770: test -s conftest.o
configure:20773: $? = 0
configure:20784: result: yes
configure:20797: checking for library containing opendir
configure:20827: x86_64-pc-linux-gnu-g++ -o conftest  -march=k8 -pipe   conftest.cc -lm  >&5
configure:20833: $? = 0
configure:20837: test -z 
			 || test ! -s conftest.err
configure:20840: $? = 0
configure:20843: test -s conftest
configure:20846: $? = 0
configure:20916: result: none required
configure:21052: checking whether time.h and sys/time.h may both be included
configure:21077: x86_64-pc-linux-gnu-g++ -c  -march=k8 -pipe  conftest.cc >&5
configure:21083: $? = 0
configure:21087: test -z 
			 || test ! -s conftest.err
configure:21090: $? = 0
configure:21093: test -s conftest.o
configure:21096: $? = 0
configure:21107: result: yes
configure:21117: checking for sys/wait.h that is POSIX.1 compatible
configure:21148: x86_64-pc-linux-gnu-g++ -c  -march=k8 -pipe  conftest.cc >&5
configure:21154: $? = 0
configure:21158: test -z 
			 || test ! -s conftest.err
configure:21161: $? = 0
configure:21164: test -s conftest.o
configure:21167: $? = 0
configure:21178: result: yes
configure:21205: checking wchar.h usability
configure:21217: x86_64-pc-linux-gnu-g++ -c  -march=k8 -pipe  conftest.cc >&5
configure:21223: $? = 0
configure:21227: test -z 
			 || test ! -s conftest.err
configure:21230: $? = 0
configure:21233: test -s conftest.o
configure:21236: $? = 0
configure:21246: result: yes
configure:21250: checking wchar.h presence
configure:21260: x86_64-pc-linux-gnu-g++ -E  conftest.cc
configure:21266: $? = 0
configure:21286: result: yes
configure:21321: checking for wchar.h
configure:21328: result: yes
configure:21205: checking wctype.h usability
configure:21217: x86_64-pc-linux-gnu-g++ -c  -march=k8 -pipe  conftest.cc >&5
configure:21223: $? = 0
configure:21227: test -z 
			 || test ! -s conftest.err
configure:21230: $? = 0
configure:21233: test -s conftest.o
configure:21236: $? = 0
configure:21246: result: yes
configure:21250: checking wctype.h presence
configure:21260: x86_64-pc-linux-gnu-g++ -E  conftest.cc
configure:21266: $? = 0
configure:21286: result: yes
configure:21321: checking for wctype.h
configure:21328: result: yes
configure:21205: checking sys/mman.h usability
configure:21217: x86_64-pc-linux-gnu-g++ -c  -march=k8 -pipe  conftest.cc >&5
configure:21223: $? = 0
configure:21227: test -z 
			 || test ! -s conftest.err
configure:21230: $? = 0
configure:21233: test -s conftest.o
configure:21236: $? = 0
configure:21246: result: yes
configure:21250: checking sys/mman.h presence
configure:21260: x86_64-pc-linux-gnu-g++ -E  conftest.cc
configure:21266: $? = 0
configure:21286: result: yes
configure:21321: checking for sys/mman.h
configure:21328: result: yes
configure:21205: checking iconv.h usability
configure:21217: x86_64-pc-linux-gnu-g++ -c  -march=k8 -pipe  conftest.cc >&5
configure:21223: $? = 0
configure:21227: test -z 
			 || test ! -s conftest.err
configure:21230: $? = 0
configure:21233: test -s conftest.o
configure:21236: $? = 0
configure:21246: result: yes
configure:21250: checking iconv.h presence
configure:21260: x86_64-pc-linux-gnu-g++ -E  conftest.cc
configure:21266: $? = 0
configure:21286: result: yes
configure:21321: checking for iconv.h
configure:21328: result: yes
configure:21348: checking for stdint.h
configure:21353: result: yes
configure:21357: checking sys/ipc.h usability
configure:21369: x86_64-pc-linux-gnu-g++ -c  -march=k8 -pipe  conftest.cc >&5
configure:21375: $? = 0
configure:21379: test -z 
			 || test ! -s conftest.err
configure:21382: $? = 0
configure:21385: test -s conftest.o
configure:21388: $? = 0
configure:21398: result: yes
configure:21402: checking sys/ipc.h presence
configure:21412: x86_64-pc-linux-gnu-g++ -E  conftest.cc
configure:21418: $? = 0
configure:21438: result: yes
configure:21473: checking for sys/ipc.h
configure:21480: result: yes
configure:21357: checking sys/shm.h usability
configure:21369: x86_64-pc-linux-gnu-g++ -c  -march=k8 -pipe  conftest.cc >&5
configure:21375: $? = 0
configure:21379: test -z 
			 || test ! -s conftest.err
configure:21382: $? = 0
configure:21385: test -s conftest.o
configure:21388: $? = 0
configure:21398: result: yes
configure:21402: checking sys/shm.h presence
configure:21412: x86_64-pc-linux-gnu-g++ -E  conftest.cc
configure:21418: $? = 0
configure:21438: result: yes
configure:21473: checking for sys/shm.h
configure:21480: result: yes
configure:21497: checking for X11/extensions/Xext.h
configure:21513: x86_64-pc-linux-gnu-g++ -c  -march=k8 -pipe  conftest.cc >&5
configure:21519: $? = 0
configure:21523: test -z 
			 || test ! -s conftest.err
configure:21526: $? = 0
configure:21529: test -s conftest.o
configure:21532: $? = 0
configure:21543: result: yes
configure:21559: checking for wchar_t
configure:21583: x86_64-pc-linux-gnu-g++ -c  -march=k8 -pipe  conftest.cc >&5
configure:21589: $? = 0
configure:21593: test -z 
			 || test ! -s conftest.err
configure:21596: $? = 0
configure:21599: test -s conftest.o
configure:21602: $? = 0
configure:21613: result: yes
configure:21624: checking for long long int
configure:21648: x86_64-pc-linux-gnu-g++ -c  -march=k8 -pipe  conftest.cc >&5
configure:21654: $? = 0
configure:21658: test -z 
			 || test ! -s conftest.err
configure:21661: $? = 0
configure:21664: test -s conftest.o
configure:21667: $? = 0
configure:21678: result: yes
configure:21689: checking for mbstate_t
configure:21714: x86_64-pc-linux-gnu-g++ -c  -march=k8 -pipe  conftest.cc >&5
configure:21720: $? = 0
configure:21724: test -z 
			 || test ! -s conftest.err
configure:21727: $? = 0
configure:21730: test -s conftest.o
configure:21733: $? = 0
configure:21744: result: yes
configure:21766: checking for stdlib.h
configure:21771: result: yes
configure:21766: checking for unistd.h
configure:21771: result: yes
configure:21915: checking for getpagesize
configure:21972: x86_64-pc-linux-gnu-g++ -o conftest  -march=k8 -pipe   conftest.cc -lm  >&5
configure:21978: $? = 0
configure:21982: test -z 
			 || test ! -s conftest.err
configure:21985: $? = 0
configure:21988: test -s conftest
configure:21991: $? = 0
configure:22003: result: yes
configure:22013: checking for working mmap
configure:22155: x86_64-pc-linux-gnu-g++ -o conftest  -march=k8 -pipe   conftest.cc -lm  >&5
configure:22158: $? = 0
configure:22160: ./conftest
configure:22163: $? = 0
configure:22177: result: yes
configure:22188: checking for pid_t
configure:22212: x86_64-pc-linux-gnu-g++ -c  -march=k8 -pipe  conftest.cc >&5
configure:22218: $? = 0
configure:22222: test -z 
			 || test ! -s conftest.err
configure:22225: $? = 0
configure:22228: test -s conftest.o
configure:22231: $? = 0
configure:22242: result: yes
configure:22260: checking for unistd.h
configure:22265: result: yes
configure:22269: checking vfork.h usability
configure:22281: x86_64-pc-linux-gnu-g++ -c  -march=k8 -pipe  conftest.cc >&5
conftest.cc:83:19: vfork.h: No such file or directory
configure:22287: $? = 1
configure: failed program was:
| /* confdefs.h.  */
| 
| #define PACKAGE_NAME "djvulibre"
| #define PACKAGE_TARNAME "djvulibre"
| #define PACKAGE_VERSION "3.5.14"
| #define PACKAGE_STRING "djvulibre 3.5.14"
| #define PACKAGE_BUGREPORT ""
| #define STDC_HEADERS 1
| #define HAVE_SYS_TYPES_H 1
| #define HAVE_SYS_STAT_H 1
| #define HAVE_STDLIB_H 1
| #define HAVE_STRING_H 1
| #define HAVE_MEMORY_H 1
| #define HAVE_STRINGS_H 1
| #define HAVE_INTTYPES_H 1
| #define HAVE_STDINT_H 1
| #define HAVE_UNISTD_H 1
| #define HAVE_DLFCN_H 1
| #ifdef __cplusplus
| extern "C" void std::exit (int) throw (); using std::exit;
| #endif
| #define HAVE_BOOL 1
| #define HAVE_EXCEPTIONS 1
| #define HAVE_TYPENAME 1
| #define HAVE_STDINCLUDES 1
| #define HAVE_MEMBER_TEMPLATES 1
| #define HAVE_LIBM 1
| #define STDC_HEADERS 1
| #define HAVE_DIRENT_H 1
| #define TIME_WITH_SYS_TIME 1
| #define HAVE_SYS_WAIT_H 1
| #define HAVE_WCHAR_H 1
| #define HAVE_WCTYPE_H 1
| #define HAVE_SYS_MMAN_H 1
| #define HAVE_ICONV_H 1
| #define HAVE_STDINT_H 1
| #define HAVE_SYS_IPC_H 1
| #define HAVE_SYS_SHM_H 1
| #define HAVE_X11_EXTENSIONS_XEXT_H 1
| #define HAVE_WCHAR_T 1
| #define HAVE_LONG_LONG_INT 1
| #define HAVE_MBSTATE_T 1
| #define HAVE_STDLIB_H 1
| #define HAVE_UNISTD_H 1
| #define HAVE_GETPAGESIZE 1
| #define HAVE_MMAP 1
| #define HAVE_UNISTD_H 1
| /* end confdefs.h.  */
| #include <stdio.h>
| #if HAVE_SYS_TYPES_H
| # include <sys/types.h>
| #endif
| #if HAVE_SYS_STAT_H
| # include <sys/stat.h>
| #endif
| #if STDC_HEADERS
| # include <stdlib.h>
| # include <stddef.h>
| #else
| # if HAVE_STDLIB_H
| #  include <stdlib.h>
| # endif
| #endif
| #if HAVE_STRING_H
| # if !STDC_HEADERS && HAVE_MEMORY_H
| #  include <memory.h>
| # endif
| # include <string.h>
| #endif
| #if HAVE_STRINGS_H
| # include <strings.h>
| #endif
| #if HAVE_INTTYPES_H
| # include <inttypes.h>
| #else
| # if HAVE_STDINT_H
| #  include <stdint.h>
| # endif
| #endif
| #if HAVE_UNISTD_H
| # include <unistd.h>
| #endif
| #include <vfork.h>
configure:22310: result: no
configure:22314: checking vfork.h presence
configure:22324: x86_64-pc-linux-gnu-g++ -E  conftest.cc
conftest.cc:49:19: vfork.h: No such file or directory
configure:22330: $? = 1
configure: failed program was:
| /* confdefs.h.  */
| 
| #define PACKAGE_NAME "djvulibre"
| #define PACKAGE_TARNAME "djvulibre"
| #define PACKAGE_VERSION "3.5.14"
| #define PACKAGE_STRING "djvulibre 3.5.14"
| #define PACKAGE_BUGREPORT ""
| #define STDC_HEADERS 1
| #define HAVE_SYS_TYPES_H 1
| #define HAVE_SYS_STAT_H 1
| #define HAVE_STDLIB_H 1
| #define HAVE_STRING_H 1
| #define HAVE_MEMORY_H 1
| #define HAVE_STRINGS_H 1
| #define HAVE_INTTYPES_H 1
| #define HAVE_STDINT_H 1
| #define HAVE_UNISTD_H 1
| #define HAVE_DLFCN_H 1
| #ifdef __cplusplus
| extern "C" void std::exit (int) throw (); using std::exit;
| #endif
| #define HAVE_BOOL 1
| #define HAVE_EXCEPTIONS 1
| #define HAVE_TYPENAME 1
| #define HAVE_STDINCLUDES 1
| #define HAVE_MEMBER_TEMPLATES 1
| #define HAVE_LIBM 1
| #define STDC_HEADERS 1
| #define HAVE_DIRENT_H 1
| #define TIME_WITH_SYS_TIME 1
| #define HAVE_SYS_WAIT_H 1
| #define HAVE_WCHAR_H 1
| #define HAVE_WCTYPE_H 1
| #define HAVE_SYS_MMAN_H 1
| #define HAVE_ICONV_H 1
| #define HAVE_STDINT_H 1
| #define HAVE_SYS_IPC_H 1
| #define HAVE_SYS_SHM_H 1
| #define HAVE_X11_EXTENSIONS_XEXT_H 1
| #define HAVE_WCHAR_T 1
| #define HAVE_LONG_LONG_INT 1
| #define HAVE_MBSTATE_T 1
| #define HAVE_STDLIB_H 1
| #define HAVE_UNISTD_H 1
| #define HAVE_GETPAGESIZE 1
| #define HAVE_MMAP 1
| #define HAVE_UNISTD_H 1
| /* end confdefs.h.  */
| #include <vfork.h>
configure:22350: result: no
configure:22385: checking for vfork.h
configure:22392: result: no
configure:22410: checking for fork
configure:22467: x86_64-pc-linux-gnu-g++ -o conftest  -march=k8 -pipe   conftest.cc -lm  >&5
configure:22473: $? = 0
configure:22477: test -z 
			 || test ! -s conftest.err
configure:22480: $? = 0
configure:22483: test -s conftest
configure:22486: $? = 0
configure:22498: result: yes
configure:22410: checking for vfork
configure:22467: x86_64-pc-linux-gnu-g++ -o conftest  -march=k8 -pipe   conftest.cc -lm  >&5
configure:22473: $? = 0
configure:22477: test -z 
			 || test ! -s conftest.err
configure:22480: $? = 0
configure:22483: test -s conftest
configure:22486: $? = 0
configure:22498: result: yes
configure:22509: checking for working fork
configure:22532: x86_64-pc-linux-gnu-g++ -o conftest  -march=k8 -pipe   conftest.cc -lm  >&5
conftest.cc: In function `int main()':
conftest.cc:9: error: `fork' undeclared (first use this function)
conftest.cc:9: error: (Each undeclared identifier is reported only once for each function it appears in.)
conftest.cc:10: error: `exit' undeclared (first use this function)
configure:22535: $? = 1
configure: program exited with status 1
configure: failed program was:
| /* By Ruediger Kuhlmann. */
|       #include <sys/types.h>
|       #if HAVE_UNISTD_H
|       # include <unistd.h>
|       #endif
|       /* Some systems only have a dummy stub for fork() */
|       int main ()
|       {
| 	if (fork() < 0)
| 	  exit (1);
| 	exit (0);
|       }
configure:22554: result: no
configure:22575: checking for working vfork
configure:22708: result: yes
configure:22744: checking for wcrtomb
configure:22801: x86_64-pc-linux-gnu-g++ -o conftest  -march=k8 -pipe   conftest.cc -lm  >&5
configure:22807: $? = 0
configure:22811: test -z 
			 || test ! -s conftest.err
configure:22814: $? = 0
configure:22817: test -s conftest
configure:22820: $? = 0
configure:22832: result: yes
configure:22744: checking for iswspace
configure:22801: x86_64-pc-linux-gnu-g++ -o conftest  -march=k8 -pipe   conftest.cc -lm  >&5
configure:22807: $? = 0
configure:22811: test -z 
			 || test ! -s conftest.err
configure:22814: $? = 0
configure:22817: test -s conftest
configure:22820: $? = 0
configure:22832: result: yes
configure:22848: checking for putc_unlocked
configure:22905: x86_64-pc-linux-gnu-g++ -o conftest  -march=k8 -pipe   conftest.cc -lm  >&5
configure:22911: $? = 0
configure:22915: test -z 
			 || test ! -s conftest.err
configure:22918: $? = 0
configure:22921: test -s conftest
configure:22924: $? = 0
configure:22936: result: yes
configure:22848: checking for strerror
configure:22905: x86_64-pc-linux-gnu-g++ -o conftest  -march=k8 -pipe   conftest.cc -lm  >&5
configure:22911: $? = 0
configure:22915: test -z 
			 || test ! -s conftest.err
configure:22918: $? = 0
configure:22921: test -s conftest
configure:22924: $? = 0
configure:22936: result: yes
configure:22848: checking for vsnprintf
configure:22905: x86_64-pc-linux-gnu-g++ -o conftest  -march=k8 -pipe   conftest.cc -lm  >&5
configure:22911: $? = 0
configure:22915: test -z 
			 || test ! -s conftest.err
configure:22918: $? = 0
configure:22921: test -s conftest
configure:22924: $? = 0
configure:22936: result: yes
configure:22953: checking for gethostname
configure:23010: x86_64-pc-linux-gnu-g++ -o conftest  -march=k8 -pipe   conftest.cc -lm  >&5
configure:23016: $? = 0
configure:23020: test -z 
			 || test ! -s conftest.err
configure:23023: $? = 0
configure:23026: test -s conftest
configure:23029: $? = 0
configure:23041: result: yes
configure:22953: checking for iconv
configure:23010: x86_64-pc-linux-gnu-g++ -o conftest  -march=k8 -pipe   conftest.cc -lm  >&5
configure:23016: $? = 0
configure:23020: test -z 
			 || test ! -s conftest.err
configure:23023: $? = 0
configure:23026: test -s conftest
configure:23029: $? = 0
configure:23041: result: yes
configure:22953: checking for strftime
configure:23010: x86_64-pc-linux-gnu-g++ -o conftest  -march=k8 -pipe   conftest.cc -lm  >&5
configure:23016: $? = 0
configure:23020: test -z 
			 || test ! -s conftest.err
configure:23023: $? = 0
configure:23026: test -s conftest
configure:23029: $? = 0
configure:23041: result: yes
configure:22953: checking for getpwuid
configure:23010: x86_64-pc-linux-gnu-g++ -o conftest  -march=k8 -pipe   conftest.cc -lm  >&5
configure:23016: $? = 0
configure:23020: test -z 
			 || test ! -s conftest.err
configure:23023: $? = 0
configure:23026: test -s conftest
configure:23029: $? = 0
configure:23041: result: yes
configure:23078: checking for jpeg library
configure:23111: x86_64-pc-linux-gnu-g++ -o conftest  -march=k8 -pipe    conftest.cc -lm  -ljpeg >&5
configure:23117: $? = 0
configure:23121: test -z 
			 || test ! -s conftest.err
configure:23124: $? = 0
configure:23127: test -s conftest
configure:23130: $? = 0
configure:23144: result: yes
configure:23159: result: setting JPEG_CFLAGS=
configure:23161: result: setting JPEG_LIBS=-ljpeg
configure:23189: checking for the libtiff library
configure:23222: x86_64-pc-linux-gnu-g++ -o conftest  -march=k8 -pipe    conftest.cc -lm  -ltiff >&5
configure:23228: $? = 0
configure:23232: test -z 
			 || test ! -s conftest.err
configure:23235: $? = 0
configure:23238: test -s conftest
configure:23241: $? = 0
configure:23255: result: yes
configure:23270: result: setting TIFF_CFLAGS=
configure:23272: result: setting TIFF_LIBS=-ltiff
configure:23306: checking pthread.h usability
configure:23318: x86_64-pc-linux-gnu-g++ -c  -march=k8 -pipe  conftest.cc >&5
configure:23324: $? = 0
configure:23328: test -z 
			 || test ! -s conftest.err
configure:23331: $? = 0
configure:23334: test -s conftest.o
configure:23337: $? = 0
configure:23347: result: yes
configure:23351: checking pthread.h presence
configure:23361: x86_64-pc-linux-gnu-g++ -E  conftest.cc
configure:23367: $? = 0
configure:23387: result: yes
configure:23422: checking for pthread.h
configure:23429: result: yes
configure:23565: checking for the pthreads library -lpthreads
configure:23603: x86_64-pc-linux-gnu-g++ -o conftest  -march=k8 -pipe    conftest.cc -lpthreads -lm  >&5
/usr/lib/gcc/x86_64-pc-linux-gnu/3.4.4/../../../../x86_64-pc-linux-gnu/bin/ld: cannot find -lpthreads
collect2: ld returned 1 exit status
configure:23609: $? = 1
configure: failed program was:
| /* confdefs.h.  */
| 
| #define PACKAGE_NAME "djvulibre"
| #define PACKAGE_TARNAME "djvulibre"
| #define PACKAGE_VERSION "3.5.14"
| #define PACKAGE_STRING "djvulibre 3.5.14"
| #define PACKAGE_BUGREPORT ""
| #define STDC_HEADERS 1
| #define HAVE_SYS_TYPES_H 1
| #define HAVE_SYS_STAT_H 1
| #define HAVE_STDLIB_H 1
| #define HAVE_STRING_H 1
| #define HAVE_MEMORY_H 1
| #define HAVE_STRINGS_H 1
| #define HAVE_INTTYPES_H 1
| #define HAVE_STDINT_H 1
| #define HAVE_UNISTD_H 1
| #define HAVE_DLFCN_H 1
| #ifdef __cplusplus
| extern "C" void std::exit (int) throw (); using std::exit;
| #endif
| #define HAVE_BOOL 1
| #define HAVE_EXCEPTIONS 1
| #define HAVE_TYPENAME 1
| #define HAVE_STDINCLUDES 1
| #define HAVE_MEMBER_TEMPLATES 1
| #define HAVE_LIBM 1
| #define STDC_HEADERS 1
| #define HAVE_DIRENT_H 1
| #define TIME_WITH_SYS_TIME 1
| #define HAVE_SYS_WAIT_H 1
| #define HAVE_WCHAR_H 1
| #define HAVE_WCTYPE_H 1
| #define HAVE_SYS_MMAN_H 1
| #define HAVE_ICONV_H 1
| #define HAVE_STDINT_H 1
| #define HAVE_SYS_IPC_H 1
| #define HAVE_SYS_SHM_H 1
| #define HAVE_X11_EXTENSIONS_XEXT_H 1
| #define HAVE_WCHAR_T 1
| #define HAVE_LONG_LONG_INT 1
| #define HAVE_MBSTATE_T 1
| #define HAVE_STDLIB_H 1
| #define HAVE_UNISTD_H 1
| #define HAVE_GETPAGESIZE 1
| #define HAVE_MMAP 1
| #define HAVE_UNISTD_H 1
| #define HAVE_FORK 1
| #define HAVE_VFORK 1
| #define HAVE_WORKING_VFORK 1
| #define HAVE_WCRTOMB 1
| #define HAVE_ISWSPACE 1
| #define HAVE_PUTC_UNLOCKED 1
| #define HAVE_STRERROR 1
| #define HAVE_VSNPRINTF 1
| #define HAVE_GETHOSTNAME 1
| #define HAVE_ICONV 1
| #define HAVE_STRFTIME 1
| #define HAVE_GETPWUID 1
| #define HAVE_JPEG 1
| #define HAVE_TIFF 1
| /* end confdefs.h.  */
| #include <pthread.h>
| int
| main ()
| {
| pthread_t th; pthread_join(th, 0);
|                      pthread_attr_init(0); pthread_cleanup_push(0, 0);
|                      pthread_create(0,0,0,0); pthread_cleanup_pop(0);
|   ;
|   return 0;
| }
configure:23635: result: no
configure:23556: checking whether pthreads work without any flags
configure:23603: x86_64-pc-linux-gnu-g++ -o conftest  -march=k8 -pipe    conftest.cc  -lm  >&5
/var/tmp/portage/djvu-3.5.14-r1/temp/cccJaA90.o(.text+0x12): In function `main':
: undefined reference to `pthread_join'
/var/tmp/portage/djvu-3.5.14-r1/temp/cccJaA90.o(.text+0x2f): In function `main':
: undefined reference to `_pthread_cleanup_push'
/var/tmp/portage/djvu-3.5.14-r1/temp/cccJaA90.o(.text+0x48): In function `main':
: undefined reference to `pthread_create'
/var/tmp/portage/djvu-3.5.14-r1/temp/cccJaA90.o(.text+0x56): In function `main':
: undefined reference to `_pthread_cleanup_pop'
collect2: ld returned 1 exit status
configure:23609: $? = 1
configure: failed program was:
| /* confdefs.h.  */
| 
| #define PACKAGE_NAME "djvulibre"
| #define PACKAGE_TARNAME "djvulibre"
| #define PACKAGE_VERSION "3.5.14"
| #define PACKAGE_STRING "djvulibre 3.5.14"
| #define PACKAGE_BUGREPORT ""
| #define STDC_HEADERS 1
| #define HAVE_SYS_TYPES_H 1
| #define HAVE_SYS_STAT_H 1
| #define HAVE_STDLIB_H 1
| #define HAVE_STRING_H 1
| #define HAVE_MEMORY_H 1
| #define HAVE_STRINGS_H 1
| #define HAVE_INTTYPES_H 1
| #define HAVE_STDINT_H 1
| #define HAVE_UNISTD_H 1
| #define HAVE_DLFCN_H 1
| #ifdef __cplusplus
| extern "C" void std::exit (int) throw (); using std::exit;
| #endif
| #define HAVE_BOOL 1
| #define HAVE_EXCEPTIONS 1
| #define HAVE_TYPENAME 1
| #define HAVE_STDINCLUDES 1
| #define HAVE_MEMBER_TEMPLATES 1
| #define HAVE_LIBM 1
| #define STDC_HEADERS 1
| #define HAVE_DIRENT_H 1
| #define TIME_WITH_SYS_TIME 1
| #define HAVE_SYS_WAIT_H 1
| #define HAVE_WCHAR_H 1
| #define HAVE_WCTYPE_H 1
| #define HAVE_SYS_MMAN_H 1
| #define HAVE_ICONV_H 1
| #define HAVE_STDINT_H 1
| #define HAVE_SYS_IPC_H 1
| #define HAVE_SYS_SHM_H 1
| #define HAVE_X11_EXTENSIONS_XEXT_H 1
| #define HAVE_WCHAR_T 1
| #define HAVE_LONG_LONG_INT 1
| #define HAVE_MBSTATE_T 1
| #define HAVE_STDLIB_H 1
| #define HAVE_UNISTD_H 1
| #define HAVE_GETPAGESIZE 1
| #define HAVE_MMAP 1
| #define HAVE_UNISTD_H 1
| #define HAVE_FORK 1
| #define HAVE_VFORK 1
| #define HAVE_WORKING_VFORK 1
| #define HAVE_WCRTOMB 1
| #define HAVE_ISWSPACE 1
| #define HAVE_PUTC_UNLOCKED 1
| #define HAVE_STRERROR 1
| #define HAVE_VSNPRINTF 1
| #define HAVE_GETHOSTNAME 1
| #define HAVE_ICONV 1
| #define HAVE_STRFTIME 1
| #define HAVE_GETPWUID 1
| #define HAVE_JPEG 1
| #define HAVE_TIFF 1
| /* end confdefs.h.  */
| #include <pthread.h>
| int
| main ()
| {
| pthread_t th; pthread_join(th, 0);
|                      pthread_attr_init(0); pthread_cleanup_push(0, 0);
|                      pthread_create(0,0,0,0); pthread_cleanup_pop(0);
|   ;
|   return 0;
| }
configure:23635: result: no
configure:23560: checking whether pthreads work with -Kthread
configure:23603: x86_64-pc-linux-gnu-g++ -o conftest  -march=k8 -pipe -Kthread   conftest.cc  -lm  >&5
x86_64-pc-linux-gnu-g++: unrecognized option `-Kthread'
/var/tmp/portage/djvu-3.5.14-r1/temp/ccvE7jVc.o(.text+0x12): In function `main':
: undefined reference to `pthread_join'
/var/tmp/portage/djvu-3.5.14-r1/temp/ccvE7jVc.o(.text+0x2f): In function `main':
: undefined reference to `_pthread_cleanup_push'
/var/tmp/portage/djvu-3.5.14-r1/temp/ccvE7jVc.o(.text+0x48): In function `main':
: undefined reference to `pthread_create'
/var/tmp/portage/djvu-3.5.14-r1/temp/ccvE7jVc.o(.text+0x56): In function `main':
: undefined reference to `_pthread_cleanup_pop'
collect2: ld returned 1 exit status
configure:23609: $? = 1
configure: failed program was:
| /* confdefs.h.  */
| 
| #define PACKAGE_NAME "djvulibre"
| #define PACKAGE_TARNAME "djvulibre"
| #define PACKAGE_VERSION "3.5.14"
| #define PACKAGE_STRING "djvulibre 3.5.14"
| #define PACKAGE_BUGREPORT ""
| #define STDC_HEADERS 1
| #define HAVE_SYS_TYPES_H 1
| #define HAVE_SYS_STAT_H 1
| #define HAVE_STDLIB_H 1
| #define HAVE_STRING_H 1
| #define HAVE_MEMORY_H 1
| #define HAVE_STRINGS_H 1
| #define HAVE_INTTYPES_H 1
| #define HAVE_STDINT_H 1
| #define HAVE_UNISTD_H 1
| #define HAVE_DLFCN_H 1
| #ifdef __cplusplus
| extern "C" void std::exit (int) throw (); using std::exit;
| #endif
| #define HAVE_BOOL 1
| #define HAVE_EXCEPTIONS 1
| #define HAVE_TYPENAME 1
| #define HAVE_STDINCLUDES 1
| #define HAVE_MEMBER_TEMPLATES 1
| #define HAVE_LIBM 1
| #define STDC_HEADERS 1
| #define HAVE_DIRENT_H 1
| #define TIME_WITH_SYS_TIME 1
| #define HAVE_SYS_WAIT_H 1
| #define HAVE_WCHAR_H 1
| #define HAVE_WCTYPE_H 1
| #define HAVE_SYS_MMAN_H 1
| #define HAVE_ICONV_H 1
| #define HAVE_STDINT_H 1
| #define HAVE_SYS_IPC_H 1
| #define HAVE_SYS_SHM_H 1
| #define HAVE_X11_EXTENSIONS_XEXT_H 1
| #define HAVE_WCHAR_T 1
| #define HAVE_LONG_LONG_INT 1
| #define HAVE_MBSTATE_T 1
| #define HAVE_STDLIB_H 1
| #define HAVE_UNISTD_H 1
| #define HAVE_GETPAGESIZE 1
| #define HAVE_MMAP 1
| #define HAVE_UNISTD_H 1
| #define HAVE_FORK 1
| #define HAVE_VFORK 1
| #define HAVE_WORKING_VFORK 1
| #define HAVE_WCRTOMB 1
| #define HAVE_ISWSPACE 1
| #define HAVE_PUTC_UNLOCKED 1
| #define HAVE_STRERROR 1
| #define HAVE_VSNPRINTF 1
| #define HAVE_GETHOSTNAME 1
| #define HAVE_ICONV 1
| #define HAVE_STRFTIME 1
| #define HAVE_GETPWUID 1
| #define HAVE_JPEG 1
| #define HAVE_TIFF 1
| /* end confdefs.h.  */
| #include <pthread.h>
| int
| main ()
| {
| pthread_t th; pthread_join(th, 0);
|                      pthread_attr_init(0); pthread_cleanup_push(0, 0);
|                      pthread_create(0,0,0,0); pthread_cleanup_pop(0);
|   ;
|   return 0;
| }
configure:23635: result: no
configure:23560: checking whether pthreads work with -kthread
configure:23603: x86_64-pc-linux-gnu-g++ -o conftest  -march=k8 -pipe -kthread   conftest.cc  -lm  >&5
x86_64-pc-linux-gnu-g++: unrecognized option `-kthread'
/var/tmp/portage/djvu-3.5.14-r1/temp/ccnb6U0c.o(.text+0x12): In function `main':
: undefined reference to `pthread_join'
/var/tmp/portage/djvu-3.5.14-r1/temp/ccnb6U0c.o(.text+0x2f): In function `main':
: undefined reference to `_pthread_cleanup_push'
/var/tmp/portage/djvu-3.5.14-r1/temp/ccnb6U0c.o(.text+0x48): In function `main':
: undefined reference to `pthread_create'
/var/tmp/portage/djvu-3.5.14-r1/temp/ccnb6U0c.o(.text+0x56): In function `main':
: undefined reference to `_pthread_cleanup_pop'
collect2: ld returned 1 exit status
configure:23609: $? = 1
configure: failed program was:
| /* confdefs.h.  */
| 
| #define PACKAGE_NAME "djvulibre"
| #define PACKAGE_TARNAME "djvulibre"
| #define PACKAGE_VERSION "3.5.14"
| #define PACKAGE_STRING "djvulibre 3.5.14"
| #define PACKAGE_BUGREPORT ""
| #define STDC_HEADERS 1
| #define HAVE_SYS_TYPES_H 1
| #define HAVE_SYS_STAT_H 1
| #define HAVE_STDLIB_H 1
| #define HAVE_STRING_H 1
| #define HAVE_MEMORY_H 1
| #define HAVE_STRINGS_H 1
| #define HAVE_INTTYPES_H 1
| #define HAVE_STDINT_H 1
| #define HAVE_UNISTD_H 1
| #define HAVE_DLFCN_H 1
| #ifdef __cplusplus
| extern "C" void std::exit (int) throw (); using std::exit;
| #endif
| #define HAVE_BOOL 1
| #define HAVE_EXCEPTIONS 1
| #define HAVE_TYPENAME 1
| #define HAVE_STDINCLUDES 1
| #define HAVE_MEMBER_TEMPLATES 1
| #define HAVE_LIBM 1
| #define STDC_HEADERS 1
| #define HAVE_DIRENT_H 1
| #define TIME_WITH_SYS_TIME 1
| #define HAVE_SYS_WAIT_H 1
| #define HAVE_WCHAR_H 1
| #define HAVE_WCTYPE_H 1
| #define HAVE_SYS_MMAN_H 1
| #define HAVE_ICONV_H 1
| #define HAVE_STDINT_H 1
| #define HAVE_SYS_IPC_H 1
| #define HAVE_SYS_SHM_H 1
| #define HAVE_X11_EXTENSIONS_XEXT_H 1
| #define HAVE_WCHAR_T 1
| #define HAVE_LONG_LONG_INT 1
| #define HAVE_MBSTATE_T 1
| #define HAVE_STDLIB_H 1
| #define HAVE_UNISTD_H 1
| #define HAVE_GETPAGESIZE 1
| #define HAVE_MMAP 1
| #define HAVE_UNISTD_H 1
| #define HAVE_FORK 1
| #define HAVE_VFORK 1
| #define HAVE_WORKING_VFORK 1
| #define HAVE_WCRTOMB 1
| #define HAVE_ISWSPACE 1
| #define HAVE_PUTC_UNLOCKED 1
| #define HAVE_STRERROR 1
| #define HAVE_VSNPRINTF 1
| #define HAVE_GETHOSTNAME 1
| #define HAVE_ICONV 1
| #define HAVE_STRFTIME 1
| #define HAVE_GETPWUID 1
| #define HAVE_JPEG 1
| #define HAVE_TIFF 1
| /* end confdefs.h.  */
| #include <pthread.h>
| int
| main ()
| {
| pthread_t th; pthread_join(th, 0);
|                      pthread_attr_init(0); pthread_cleanup_push(0, 0);
|                      pthread_create(0,0,0,0); pthread_cleanup_pop(0);
|   ;
|   return 0;
| }
configure:23635: result: no
configure:23565: checking for the pthreads library -llthread
configure:23603: x86_64-pc-linux-gnu-g++ -o conftest  -march=k8 -pipe    conftest.cc -llthread -lm  >&5
/usr/lib/gcc/x86_64-pc-linux-gnu/3.4.4/../../../../x86_64-pc-linux-gnu/bin/ld: cannot find -llthread
collect2: ld returned 1 exit status
configure:23609: $? = 1
configure: failed program was:
| /* confdefs.h.  */
| 
| #define PACKAGE_NAME "djvulibre"
| #define PACKAGE_TARNAME "djvulibre"
| #define PACKAGE_VERSION "3.5.14"
| #define PACKAGE_STRING "djvulibre 3.5.14"
| #define PACKAGE_BUGREPORT ""
| #define STDC_HEADERS 1
| #define HAVE_SYS_TYPES_H 1
| #define HAVE_SYS_STAT_H 1
| #define HAVE_STDLIB_H 1
| #define HAVE_STRING_H 1
| #define HAVE_MEMORY_H 1
| #define HAVE_STRINGS_H 1
| #define HAVE_INTTYPES_H 1
| #define HAVE_STDINT_H 1
| #define HAVE_UNISTD_H 1
| #define HAVE_DLFCN_H 1
| #ifdef __cplusplus
| extern "C" void std::exit (int) throw (); using std::exit;
| #endif
| #define HAVE_BOOL 1
| #define HAVE_EXCEPTIONS 1
| #define HAVE_TYPENAME 1
| #define HAVE_STDINCLUDES 1
| #define HAVE_MEMBER_TEMPLATES 1
| #define HAVE_LIBM 1
| #define STDC_HEADERS 1
| #define HAVE_DIRENT_H 1
| #define TIME_WITH_SYS_TIME 1
| #define HAVE_SYS_WAIT_H 1
| #define HAVE_WCHAR_H 1
| #define HAVE_WCTYPE_H 1
| #define HAVE_SYS_MMAN_H 1
| #define HAVE_ICONV_H 1
| #define HAVE_STDINT_H 1
| #define HAVE_SYS_IPC_H 1
| #define HAVE_SYS_SHM_H 1
| #define HAVE_X11_EXTENSIONS_XEXT_H 1
| #define HAVE_WCHAR_T 1
| #define HAVE_LONG_LONG_INT 1
| #define HAVE_MBSTATE_T 1
| #define HAVE_STDLIB_H 1
| #define HAVE_UNISTD_H 1
| #define HAVE_GETPAGESIZE 1
| #define HAVE_MMAP 1
| #define HAVE_UNISTD_H 1
| #define HAVE_FORK 1
| #define HAVE_VFORK 1
| #define HAVE_WORKING_VFORK 1
| #define HAVE_WCRTOMB 1
| #define HAVE_ISWSPACE 1
| #define HAVE_PUTC_UNLOCKED 1
| #define HAVE_STRERROR 1
| #define HAVE_VSNPRINTF 1
| #define HAVE_GETHOSTNAME 1
| #define HAVE_ICONV 1
| #define HAVE_STRFTIME 1
| #define HAVE_GETPWUID 1
| #define HAVE_JPEG 1
| #define HAVE_TIFF 1
| /* end confdefs.h.  */
| #include <pthread.h>
| int
| main ()
| {
| pthread_t th; pthread_join(th, 0);
|                      pthread_attr_init(0); pthread_cleanup_push(0, 0);
|                      pthread_create(0,0,0,0); pthread_cleanup_pop(0);
|   ;
|   return 0;
| }
configure:23635: result: no
configure:23560: checking whether pthreads work with -pthread
configure:23603: x86_64-pc-linux-gnu-g++ -o conftest  -march=k8 -pipe -pthread   conftest.cc  -lm  >&5
configure:23609: $? = 0
configure:23613: test -z 
			 || test ! -s conftest.err
configure:23616: $? = 0
configure:23619: test -s conftest
configure:23622: $? = 0
configure:23635: result: yes
configure:23652: checking if more special flags are required for pthreads
configure:23659: result: no
configure:23838: checking threading model
configure:23840: result: pthread
configure:23843: result: setting THREAD_CFLAGS=-pthread -DTHREADMODEL=POSIXTHREADS
configure:23845: result: setting THREAD_LIBS=
configure:23856: checking for X
configure:23961: x86_64-pc-linux-gnu-g++ -E  conftest.cc
configure:23967: $? = 0
configure:24086: result: libraries /usr/lib64, headers 
configure:24258: x86_64-pc-linux-gnu-g++ -o conftest  -march=k8 -pipe   conftest.cc -lm   -L/usr/lib64 -lX11 >&5
configure:24264: $? = 0
configure:24268: test -z 
			 || test ! -s conftest.err
configure:24271: $? = 0
configure:24274: test -s conftest
configure:24277: $? = 0
configure:24435: checking for gethostbyname
configure:24492: x86_64-pc-linux-gnu-g++ -o conftest  -march=k8 -pipe   conftest.cc -lm  >&5
configure:24498: $? = 0
configure:24502: test -z 
			 || test ! -s conftest.err
configure:24505: $? = 0
configure:24508: test -s conftest
configure:24511: $? = 0
configure:24523: result: yes
configure:24674: checking for connect
configure:24731: x86_64-pc-linux-gnu-g++ -o conftest  -march=k8 -pipe   conftest.cc -lm  >&5
configure:24737: $? = 0
configure:24741: test -z 
			 || test ! -s conftest.err
configure:24744: $? = 0
configure:24747: test -s conftest
configure:24750: $? = 0
configure:24762: result: yes
configure:24837: checking for remove
configure:24894: x86_64-pc-linux-gnu-g++ -o conftest  -march=k8 -pipe   conftest.cc -lm  >&5
configure:24900: $? = 0
configure:24904: test -z 
			 || test ! -s conftest.err
configure:24907: $? = 0
configure:24910: test -s conftest
configure:24913: $? = 0
configure:24925: result: yes
configure:25000: checking for shmat
configure:25057: x86_64-pc-linux-gnu-g++ -o conftest  -march=k8 -pipe   conftest.cc -lm  >&5
configure:25063: $? = 0
configure:25067: test -z 
			 || test ! -s conftest.err
configure:25070: $? = 0
configure:25073: test -s conftest
configure:25076: $? = 0
configure:25088: result: yes
configure:25172: checking for IceConnectionNumber in -lICE
configure:25202: x86_64-pc-linux-gnu-g++ -o conftest  -march=k8 -pipe   -L/usr/lib64 conftest.cc -lICE  -lm  >&5
configure:25208: $? = 0
configure:25212: test -z 
			 || test ! -s conftest.err
configure:25215: $? = 0
configure:25218: test -s conftest
configure:25221: $? = 0
configure:25234: result: yes
configure:25271: checking for Qt root directory
configure:25338: result: /usr/qt/3
configure:25358: checking for multithreaded Qt3 library
configure:25372: result: yes
configure:25387: checking for moc
configure:25405: found /usr/qt/3/bin/moc
configure:25417: result: /usr/qt/3/bin/moc
configure:25432: checking for uic
configure:25450: found /usr/qt/3/bin/uic
configure:25462: result: /usr/qt/3/bin/uic
configure:25477: checking for lupdate
configure:25495: found /usr/qt/3/bin/lupdate
configure:25507: result: /usr/qt/3/bin/lupdate
configure:25522: checking for lrelease
configure:25540: found /usr/qt/3/bin/lrelease
configure:25552: result: /usr/qt/3/bin/lrelease
configure:25572: checking if a small Qt program runs
configure:25607: x86_64-pc-linux-gnu-g++ -o conftest  -march=k8 -pipe  -march=k8 -pipe -pthread -DTHREADMODEL=POSIXTHREADS -I/usr/qt/3/include    conftest.cc   -L/usr/qt/3/lib -lqt-mt  -L/usr/lib64  -lSM -lICE -lXext -lX11  -lm  >&5
/usr/qt/3/lib/libqt-mt.so: undefined reference to `__pthread_register_cancel@GLIBC_2.3.3'
/usr/qt/3/lib/libqt-mt.so: undefined reference to `__pthread_unregister_cancel@GLIBC_2.3.3'
collect2: ld returned 1 exit status
configure:25610: $? = 1
configure: program exited with status 1
configure: failed program was:
| /* confdefs.h.  */
| 
| #define PACKAGE_NAME "djvulibre"
| #define PACKAGE_TARNAME "djvulibre"
| #define PACKAGE_VERSION "3.5.14"
| #define PACKAGE_STRING "djvulibre 3.5.14"
| #define PACKAGE_BUGREPORT ""
| #define STDC_HEADERS 1
| #define HAVE_SYS_TYPES_H 1
| #define HAVE_SYS_STAT_H 1
| #define HAVE_STDLIB_H 1
| #define HAVE_STRING_H 1
| #define HAVE_MEMORY_H 1
| #define HAVE_STRINGS_H 1
| #define HAVE_INTTYPES_H 1
| #define HAVE_STDINT_H 1
| #define HAVE_UNISTD_H 1
| #define HAVE_DLFCN_H 1
| #ifdef __cplusplus
| extern "C" void std::exit (int) throw (); using std::exit;
| #endif
| #define HAVE_BOOL 1
| #define HAVE_EXCEPTIONS 1
| #define HAVE_TYPENAME 1
| #define HAVE_STDINCLUDES 1
| #define HAVE_MEMBER_TEMPLATES 1
| #define HAVE_LIBM 1
| #define STDC_HEADERS 1
| #define HAVE_DIRENT_H 1
| #define TIME_WITH_SYS_TIME 1
| #define HAVE_SYS_WAIT_H 1
| #define HAVE_WCHAR_H 1
| #define HAVE_WCTYPE_H 1
| #define HAVE_SYS_MMAN_H 1
| #define HAVE_ICONV_H 1
| #define HAVE_STDINT_H 1
| #define HAVE_SYS_IPC_H 1
| #define HAVE_SYS_SHM_H 1
| #define HAVE_X11_EXTENSIONS_XEXT_H 1
| #define HAVE_WCHAR_T 1
| #define HAVE_LONG_LONG_INT 1
| #define HAVE_MBSTATE_T 1
| #define HAVE_STDLIB_H 1
| #define HAVE_UNISTD_H 1
| #define HAVE_GETPAGESIZE 1
| #define HAVE_MMAP 1
| #define HAVE_UNISTD_H 1
| #define HAVE_FORK 1
| #define HAVE_VFORK 1
| #define HAVE_WORKING_VFORK 1
| #define HAVE_WCRTOMB 1
| #define HAVE_ISWSPACE 1
| #define HAVE_PUTC_UNLOCKED 1
| #define HAVE_STRERROR 1
| #define HAVE_VSNPRINTF 1
| #define HAVE_GETHOSTNAME 1
| #define HAVE_ICONV 1
| #define HAVE_STRFTIME 1
| #define HAVE_GETPWUID 1
| #define HAVE_JPEG 1
| #define HAVE_TIFF 1
| #define HAVE_PTHREAD 1
| /* end confdefs.h.  */
| 
| #include <qfile.h>
| #include <qtextstream.h>
| #include <qglobal.h>
| int main() {
| QFile qf("confout"); if (!qf.open(IO_WriteOnly)) return 1;
| QTextStream ts(&qf); ts << QT_VERSION; return 0;
| }
configure:25636: result: no
configure:25660: WARNING: Qt support is disabled
configure:25711: WARNING: Disabling compilation of djview.
--------------------------------------------------------
*** The GUI portion of this package will not be compiled.
*** This is probably not what you want.  Chech the output
*** of configure for warning messages.  Read file INSTALL.
*** Investigate options --with-qt and --enable-threads.
--------------------------------------------------------
configure:25796: checking if x86_64-pc-linux-gnu-g++ has the LPR0 bug
configure:25802: result: no
configure:25821: checking g++ version
configure:25825: result: 3.4.4
configure:26097: creating ./config.status

## ---------------------- ##
## Running config.status. ##
## ---------------------- ##

This file was extended by djvulibre config.status 3.5.14, which was
generated by GNU Autoconf 2.59.  Invocation command line was

  CONFIG_FILES    = 
  CONFIG_HEADERS  = 
  CONFIG_LINKS    = 
  CONFIG_COMMANDS = 
  $ ./config.status 

on bedazzled

config.status:722: creating Makefile
config.status:722: creating libdjvu/Makefile
config.status:722: creating tools/Makefile
config.status:722: creating xmltools/Makefile
config.status:722: creating gui/Makefile
config.status:722: creating gui/desktop/Makefile
config.status:722: creating gui/bin2cpp/Makefile
config.status:722: creating gui/djview/Makefile
config.status:722: creating gui/nsdejavu/Makefile
config.status:722: creating gsfiles/Makefile
config.status:722: creating i18n/Makefile
config.status:722: creating i18n/ja/Makefile
config.status:722: creating i18n/de/Makefile