All pastes #258553 Raw Edit

Someone

public text v1 · immutable
#258553 ·published 2006-11-26 17:09 UTC
rendered paste body
i686-pc-linux-gnu-g++ -shared -nostdlib /usr/lib/gcc/i686-pc-linux-gnu/4.1.1/../../../crti.o /usr/lib/gcc/i686-pc-linux-gnu/4.1.1/crtbeginS.o  .libs/libcontainer_query_la-libcontainer_query.o  /usr/lib/libgtk-x11-2.0.so /usr/lib/libgdk-x11-2.0.so /usr/lib/libatk-1.0.so -L/usr/lib /usr/lib/libgdk_pixbuf-2.0.so /usr/lib/libpangocairo-1.0.so /usr/lib/libpango-1.0.so /usr/lib/libcairo.so /usr/lib/libgobject-2.0.so /usr/lib/libgthread-2.0.so /usr/lib/libgmodule-2.0.so -ldl /usr/lib/libglib-2.0.so /usr/lib/libxml2.so -lz -L/usr/lib/gcc/i686-pc-linux-gnu/4.1.1 -L/usr/lib/gcc/i686-pc-linux-gnu/4.1.1/../../../../i686-pc-linux-gnu/lib -L/usr/lib/gcc/i686-pc-linux-gnu/4.1.1/../../.. -lstdc++ -lm -lc -lgcc_s /usr/lib/gcc/i686-pc-linux-gnu/4.1.1/crtendS.o /usr/lib/gcc/i686-pc-linux-gnu/4.1.1/../../../crtn.o  -march=athlon-xp -pthread -Wl,--export-dynamic -Wl,-soname -Wl,libcontainer_query.so.0 -o .libs/libcontainer_query.so.0.0.0
(cd .libs && rm -f libcontainer_query.so.0 && ln -s libcontainer_query.so.0.0.0 libcontainer_query.so.0)
(cd .libs && rm -f libcontainer_query.so && ln -s libcontainer_query.so.0.0.0 libcontainer_query.so)
creating libcontainer_query.la
(cd .libs && rm -f libcontainer_query.la && ln -s ../libcontainer_query.la libcontainer_query.la)
../../../libhal++/device.hh: In member function 'bool Hal::Device::PropertySet::iterator::operator==(const Hal::Device::PropertySet::iterator&)':
../../../libhal++/device.hh:59: error: 'struct LibHalPropertySetIterator' has no member named 'idx'
../../../libhal++/device.hh:59: error: 'const struct LibHalPropertySetIterator' has no member named 'idx'
../../../libhal++/storage.hh: At global scope:
../../../libhal++/storage.hh:52: error: 'LIBHAL_DRIVE_CDROM_CAPS_DVDPLUSRWDL' was not declared in this scope
../../../libhal++/storage.hh:68: error: 'LIBHAL_VOLUME_USAGE_OTHER' was not declared in this scope
make[4]: *** [libcontainer_xspf_la-libcontainer_xspf.lo] Error 1