make -C /home/db90h/xwrt/trunk/build_mipsel/iptables-1.3.3 \
PATH=/home/db90h/xwrt/trunk/staging_dir_mipsel/usr/bin:/home/db90h/xwrt/trunk/staging_dir_mipsel/bin:/bin:/sbin:/usr/bin:/usr/sbin AR=/home/db90h/xwrt/trunk/staging_dir_mipsel/bin/mipsel-linux-uclibc-ar AS=/home/db90h/xwrt/trunk/staging_dir_mipsel/bin/mipsel-linux-uclibc-as LD=/home/db90h/xwrt/trunk/staging_dir_mipsel/bin/mipsel-linux-uclibc-ld NM=/home/db90h/xwrt/trunk/staging_dir_mipsel/bin/mipsel-linux-uclibc-nm CC=/home/db90h/xwrt/trunk/staging_dir_mipsel/bin/mipsel-linux-uclibc-gcc GCC=/home/db90h/xwrt/trunk/staging_dir_mipsel/bin/mipsel-linux-uclibc-gcc CXX=/home/db90h/xwrt/trunk/staging_dir_mipsel/bin/mipsel-linux-uclibc-g++ RANLIB=/home/db90h/xwrt/trunk/staging_dir_mipsel/bin/mipsel-linux-uclibc-ranlib STRIP=/home/db90h/xwrt/trunk/staging_dir_mipsel/bin/mipsel-linux-uclibc-strip \
CC=/home/db90h/xwrt/trunk/staging_dir_mipsel/bin/mipsel-linux-uclibc-gcc COPT_FLAGS="-Os -pipe -mips32 -mtune=mips32 -funit-at-a-time " \
KERNEL_DIR=/home/db90h/xwrt/trunk/build_mipsel/linux PREFIX=/usr \
DESTDIR="/home/db90h/xwrt/trunk/build_mipsel/iptables-1.3.3/ipkg-install" \
all install install-devel
[: 1: /home/db90h/xwrt/trunk/build_mipsel/linux/include/asm: unexpected operator
make[3]: Entering directory `/home/db90h/xwrt/trunk/build_mipsel/iptables-1.3.3'
/home/db90h/xwrt/trunk/staging_dir_mipsel/bin/mipsel-linux-uclibc-gcc -Os -pipe -mips32 -mtune=mips32 -funit-at-a-time -Wall -Wunused -I/home/db90h/xwrt/trunk/build_mipsel/linux/include -Iinclude/ -DIPTABLES_VERSION=\"1.3.3\" -D_UNKNOWN_KERNEL_POINTER_SIZE -fPIC -o extensions/libipt_string_sh.o -c extensions/libipt_string.c
extensions/libipt_string.c: In function `parse_string':
extensions/libipt_string.c:50: error: `BM_MAX_NLEN' undeclared (first use in this function)
extensions/libipt_string.c:50: error: (Each undeclared identifier is reported only once
extensions/libipt_string.c:50: error: for each function it appears in.)
extensions/libipt_string.c:50: error: structure has no member named `string'
extensions/libipt_string.c: In function `parse_hex_string':
extensions/libipt_string.c:95: error: structure has no member named `string'
extensions/libipt_string.c:117: error: structure has no member named `string'
extensions/libipt_string.c:123: error: structure has no member named `string'
extensions/libipt_string.c:126: error: `BM_MAX_NLEN' undeclared (first use in this function)
extensions/libipt_string.c:130: error: structure has no member named `len'
extensions/libipt_string.c: In function `parse':
extensions/libipt_string.c:154: error: structure has no member named `len'
extensions/libipt_string.c:154: error: structure has no member named `string'
extensions/libipt_string.c: In function `print':
extensions/libipt_string.c:240: error: structure has no member named `string'
extensions/libipt_string.c:240: error: structure has no member named `len'
extensions/libipt_string.c:242: error: structure has no member named `string'
extensions/libipt_string.c:242: error: structure has no member named `len'
extensions/libipt_string.c:245: error: structure has no member named `string'
extensions/libipt_string.c:245: error: structure has no member named `len'
extensions/libipt_string.c: In function `save':
extensions/libipt_string.c:257: error: structure has no member named `string'
extensions/libipt_string.c:257: error: structure has no member named `len'
extensions/libipt_string.c:259: error: structure has no member named `string'
extensions/libipt_string.c:259: error: structure has no member named `len'
extensions/libipt_string.c:262: error: structure has no member named `string'
extensions/libipt_string.c:262: error: structure has no member named `len'
make[3]: *** [extensions/libipt_string_sh.o] Error 1
make[3]: Leaving directory `/home/db90h/xwrt/trunk/build_mipsel/iptables-1.3.3'
make[2]: *** [/home/db90h/xwrt/trunk/build_mipsel/iptables-1.3.3/.built] Error 2
make[2]: Leaving directory `/home/db90h/xwrt/trunk/package/iptables'
make[1]: *** [iptables-compile] Error 2
make[1]: Leaving directory `/home/db90h/xwrt/trunk/package'
make: *** [package/compile] Error 2