All pastes #256266 Raw Edit

Unnamed

public text v1 · immutable
#256266 ·published 2006-11-23 23:01 UTC
rendered paste body
emerge -av azureus
--- Invalid atom in /etc/portage/package.keywords: dev-python/pyxdg-0.14
--- Invalid atom in /etc/portage/package.keywords: dev-python/pyxdg-0.14

These are the packages that would be merged, in order:

Calculating dependencies... done!
[ebuild  N    ] dev-java/ant-core-1.6.5-r14  USE="-doc -source" 0 kB
[ebuild  N    ] dev-java/eclipse-ecj-3.2  USE="-doc" 598 kB
[ebuild  N    ] dev-java/junit-3.8.1-r3  USE="-doc -source" 431 kB
[ebuild  N    ] dev-java/bcprov-1.31-r1  USE="-doc" 1,758 kB
[ebuild  N    ] dev-java/commons-lang-2.0-r1  USE="-doc -jikes -source" 430 kB
[ebuild  N    ] dev-java/log4j-1.2.9  USE="-doc -javamail -jikes -jms -jmx -source" 2,705 kB
[ebuild  N    ] dev-java/avalon-logkit-1.2  USE="-doc -javamail -jikes -jms -source" 233 kB
[ebuild  N    ] dev-java/commons-logging-1.0.4-r1  USE="-avalon -doc -jikes -source" 98 kB
[ebuild  N    ] dev-java/commons-cli-1.0-r4  USE="-doc -jikes -junit -source" 36 kB
[ebuild     U ] dev-libs/atk-1.12.1 [1.10.1] USE="-debug -doc (-static%)" 626 kB
[ebuild  N    ] dev-java/swt-3.2-r2  USE="gnome opengl -cairo -seamonkey" 2,866 kB
[ebuild  N    ] net-p2p/azureus-2.5.0.0-r3  USE="-source" 5,719 kB

Total size of downloads: 15,504 kB

Would you like to merge these packages? [Yes/No] yes

>>> Emerging (1 of 12) dev-java/ant-core-1.6.5-r14 to /
 * apache-ant-1.6.5-src.tar.bz2 MD5 ;-) ...                               [ ok ] * apache-ant-1.6.5-src.tar.bz2 RMD160 ;-) ...                            [ ok ] * apache-ant-1.6.5-src.tar.bz2 SHA1 ;-) ...                              [ ok ] * apache-ant-1.6.5-src.tar.bz2 SHA256 ;-) ...                            [ ok ] * apache-ant-1.6.5-src.tar.bz2 size ;-) ...                              [ ok ] * checking ebuild checksums ;-) ...                                      [ ok ] * checking auxfile checksums ;-) ...                                     [ ok ] * checking miscfile checksums ;-) ...                                    [ ok ] * checking apache-ant-1.6.5-src.tar.bz2 ;-) ...                          [ ok ]Traceback (most recent call last):
  File "/usr/bin/depend-java-query", line 85, in ?
    (options, args) = parser.parse_args()
  File "/usr/lib/python2.4/optparse.py", line 1275, in parse_args
    stop = self._process_args(largs, rargs, values)
  File "/usr/lib/python2.4/optparse.py", line 1315, in _process_args
    self._process_long_opt(rargs, values)
  File "/usr/lib/python2.4/optparse.py", line 1390, in _process_long_opt
    option.process(opt, value, values, self)
  File "/usr/lib/python2.4/optparse.py", line 707, in process
    return self.take_action(
  File "/usr/lib/python2.4/optparse.py", line 726, in take_action
    self.callback(self, opt, value, parser, *args, **kwargs)
  File "/usr/bin/depend-java-query", line 49, in get_vm
    vm = verman.get_vm(value)
  File "/usr/share/java-config-2/pym/java_config/VersionManager.py", line 131, in get_vm
    raise Exception("Couldn't find suitable VM. Possible invalid dependency string.")
Exception: Couldn't find suitable VM. Possible invalid dependency string.
 * Unable to determine VM for building from dependencies.
NV_DEPEND:
        source? ( app-arch/zip )
        >=virtual/jdk-1.4
        !<dev-java/ant-tasks-1.6.5  >=dev-java/java-config-2.0.19-r1 >=sys-apps/portage-2.1_pre1 >=dev-java/javatoolkit-0.1.5 >=sys-apps/portage-2.1_pre1
VNEED:
!!! ERROR: The active vm could not be found
!!! ERROR: The active vm could not be found
!!! ERROR: The active vm could not be found
!!! ERROR: The active vm could not be found
!!! ERROR: The active vm could not be found
!!! ERROR: The active vm could not be found
!!! ERROR: The active vm could not be found
Traceback (most recent call last):
  File "/usr/bin/depend-java-query", line 85, in ?
    (options, args) = parser.parse_args()
  File "/usr/lib/python2.4/optparse.py", line 1275, in parse_args
    stop = self._process_args(largs, rargs, values)
  File "/usr/lib/python2.4/optparse.py", line 1315, in _process_args
    self._process_long_opt(rargs, values)
  File "/usr/lib/python2.4/optparse.py", line 1390, in _process_long_opt
    option.process(opt, value, values, self)
  File "/usr/lib/python2.4/optparse.py", line 707, in process
    return self.take_action(
  File "/usr/lib/python2.4/optparse.py", line 726, in take_action
    self.callback(self, opt, value, parser, *args, **kwargs)
  File "/usr/bin/depend-java-query", line 49, in get_vm
    vm = verman.get_vm(value)
  File "/usr/share/java-config-2/pym/java_config/VersionManager.py", line 131, in get_vm
    raise Exception("Couldn't find suitable VM. Possible invalid dependency string.")
Exception: Couldn't find suitable VM. Possible invalid dependency string.
 * Unable to determine VM for building from dependencies.
NV_DEPEND:
        source? ( app-arch/zip )
        >=virtual/jdk-1.4
        !<dev-java/ant-tasks-1.6.5  >=dev-java/java-config-2.0.19-r1 >=sys-apps/portage-2.1_pre1 >=dev-java/javatoolkit-0.1.5 >=sys-apps/portage-2.1_pre1
VNEED:
!!! ERROR: The active vm could not be found
!!! ERROR: The active vm could not be found
!!! ERROR: The active vm could not be found
!!! ERROR: The active vm could not be found
!!! ERROR: The active vm could not be found
!!! ERROR: The active vm could not be found
!!! ERROR: The active vm could not be found
Traceback (most recent call last):
  File "/usr/bin/depend-java-query", line 85, in ?
    (options, args) = parser.parse_args()
  File "/usr/lib/python2.4/optparse.py", line 1275, in parse_args
    stop = self._process_args(largs, rargs, values)
  File "/usr/lib/python2.4/optparse.py", line 1315, in _process_args
    self._process_long_opt(rargs, values)
  File "/usr/lib/python2.4/optparse.py", line 1390, in _process_long_opt
    option.process(opt, value, values, self)
  File "/usr/lib/python2.4/optparse.py", line 707, in process
    return self.take_action(
  File "/usr/lib/python2.4/optparse.py", line 726, in take_action
    self.callback(self, opt, value, parser, *args, **kwargs)
  File "/usr/bin/depend-java-query", line 49, in get_vm
    vm = verman.get_vm(value)
  File "/usr/share/java-config-2/pym/java_config/VersionManager.py", line 131, in get_vm
    raise Exception("Couldn't find suitable VM. Possible invalid dependency string.")
Exception: Couldn't find suitable VM. Possible invalid dependency string.
 * Unable to determine VM for building from dependencies.
NV_DEPEND: >=virtual/jdk-1.4
        >=dev-java/java-config-1.2  >=dev-java/java-config-2.0.19-r1 >=sys-apps/portage-2.1_pre1
        source? ( app-arch/zip )
        >=virtual/jdk-1.4
        !<dev-java/ant-tasks-1.6.5  >=dev-java/java-config-2.0.19-r1 >=sys-apps/portage-2.1_pre1 >=dev-java/javatoolkit-0.1.5 >=sys-apps/portage-2.1_pre1
VNEED:
!!! ERROR: The active vm could not be found
!!! ERROR: The active vm could not be found
!!! ERROR: The active vm could not be found
!!! ERROR: The active vm could not be found
!!! ERROR: The active vm could not be found
!!! ERROR: The active vm could not be found
!!! ERROR: The active vm could not be found
!!! ERROR: The active vm could not be found
 * Using:
>>> Unpacking source...
>>> Unpacking apache-ant-1.6.5-src.tar.bz2 to /var/tmp/portage/ant-core-1.6.5-r14/work
 * Applying build.sh-exit-fix.patch ...                                   [ ok ]>>> Source unpacked.
Rewriting ./src/etc/testcases/core/include/included_file_parse_error/build.xml
Rewriting ./src/etc/testcases/core/include/included_file_task_error/build.xml
Rewriting ./src/etc/testcases/core/include/including_file_parse_error/build.xml
Rewriting ./src/etc/testcases/core/include/including_file_task_error/build.xml
Rewriting ./src/etc/testcases/filters/build.xml
Rewriting ./src/etc/testcases/taskdefs/fixcrlf/build.xml
Rewriting ./src/etc/testcases/taskdefs/style/build.xml
Rewriting ./build.xml
Traceback (most recent call last):
  File "/usr/bin/depend-java-query", line 85, in ?
    (options, args) = parser.parse_args()
  File "/usr/lib/python2.4/optparse.py", line 1275, in parse_args
    stop = self._process_args(largs, rargs, values)
  File "/usr/lib/python2.4/optparse.py", line 1315, in _process_args
    self._process_long_opt(rargs, values)
  File "/usr/lib/python2.4/optparse.py", line 1390, in _process_long_opt
    option.process(opt, value, values, self)
  File "/usr/lib/python2.4/optparse.py", line 707, in process
    return self.take_action(
  File "/usr/lib/python2.4/optparse.py", line 726, in take_action
    self.callback(self, opt, value, parser, *args, **kwargs)
  File "/usr/bin/depend-java-query", line 49, in get_vm
    vm = verman.get_vm(value)
  File "/usr/share/java-config-2/pym/java_config/VersionManager.py", line 131, in get_vm
    raise Exception("Couldn't find suitable VM. Possible invalid dependency string.")
Exception: Couldn't find suitable VM. Possible invalid dependency string.
 * Unable to determine VM for building from dependencies.
NV_DEPEND: >=virtual/jdk-1.4
        >=dev-java/java-config-1.2  >=dev-java/java-config-2.0.19-r1 >=sys-apps/portage-2.1_pre1
        source? ( app-arch/zip )
        >=virtual/jdk-1.4
        !<dev-java/ant-tasks-1.6.5  >=dev-java/java-config-2.0.19-r1 >=sys-apps/portage-2.1_pre1 >=dev-java/javatoolkit-0.1.5 >=sys-apps/portage-2.1_pre1
VNEED:
!!! ERROR: The active vm could not be found
!!! ERROR: The active vm could not be found
!!! ERROR: The active vm could not be found
!!! ERROR: The active vm could not be found
!!! ERROR: The active vm could not be found
!!! ERROR: The active vm could not be found
!!! ERROR: The active vm could not be found
>>> Compiling source in /var/tmp/portage/ant-core-1.6.5-r14/work/apache-ant-1.6.5 ...
Warning: JAVA_HOME environment variable not set.
  If build fails because sun.* classes could not be found
  you will need to set the JAVA_HOME environment variable
  to the installation directory of java.
Error: JAVA_HOME is not defined correctly.
  We cannot execute java
Bootstrap FAILED

!!! ERROR: dev-java/ant-core-1.6.5-r14 failed.
Call stack:
  ebuild.sh, line 1546:   Called dyn_compile
  ebuild.sh, line 937:   Called src_compile
  ant-core-1.6.5-r14.ebuild, line 42:   Called die

!!! failed to build
!!! If you need support, post the topmost build error, and the call stack if relevant.

!!! When you file a bug report, please include the following information:
GENTOO_VM=  CLASSPATH="" JAVA_HOME=""
JAVACFLAGS="-target 1.4" COMPILER=""
and of course, the output of emerge --info