dale@athlon ~/Desktop/gninjam/gninjam-0.01a.orig $ make
make all-recursive
make[1]: Entering directory `/home/dale/Desktop/gninjam/gninjam-0.01a.orig'
Making all in src
make[2]: Entering directory `/home/dale/Desktop/gninjam/gninjam-0.01a.orig/src'
if g++ -DHAVE_CONFIG_H -I. -I. -I.. -I/usr/include/gtkmm-2.0 -I/usr/lib/gtkmm-2.0/include -I/usr/include/gtk-2.0 -I/usr/lib/sigc++-1.2/include -I/usr/include/sigc++-1.2 -I/usr/include/glib-2.0 -I/usr/lib/glib-2.0/include -I/usr/lib/gtk-2.0/include -I/usr/include/pango-1.0 -I/usr/include/cairo -I/usr/include/atk-1.0 -DORBIT2=1 -pthread -I/usr/include/gconfmm-2.6 -I/usr/lib/gconfmm-2.6/include -I/usr/include/glibmm-2.4 -I/usr/lib/glibmm-2.4/include -I/usr/include/gconf/2 -I/usr/include/sigc++-2.0 -I/usr/lib/sigc++-2.0/include -I/usr/include/glib-2.0 -I/usr/lib/glib-2.0/include -I/usr/include/orbit-2.0 -I/usr/include/libninjam -s -malign-double -lpthread -g -O2 -MT gninjam.o -MD -MP -MF ".deps/gninjam.Tpo" -c -o gninjam.o gninjam.cc; \
then mv -f ".deps/gninjam.Tpo" ".deps/gninjam.Po"; else rm -f ".deps/gninjam.Tpo"; exit 1; fi
In file included from gNinjamClient.hh:20,
from gninjam.cc:22:
gNinjamClient_glade.hh:38:28: error: gtkmm/combobox.h: No such file or directory
gNinjamClient_glade.hh:60: error: 'ComboBox' in namespace 'Gtk' does not name a type
window_preferences_glade.hh:47: error: 'ComboBox' in namespace 'Gtk' does not name a type
window_preferences_glade.hh:49: error: 'ComboBox' in namespace 'Gtk' does not name a type
/usr/include/gconfmm-2.6/gconfmm/callback.h:39: error: 'sigc' has not been declared
/usr/include/gconfmm-2.6/gconfmm/callback.h:39: error: expected initializer before '<' token
/usr/include/gconfmm-2.6/gconfmm/callback.h:48: error: expected `)' before 'slot'
/usr/include/gconfmm-2.6/gconfmm/callback.h:53: error: 'Callback' does not name a type
/usr/include/gconfmm-2.6/gconfmm/changeset.h:123: error: 'sigc' has not been declared
/usr/include/gconfmm-2.6/gconfmm/changeset.h:123: error: expected ';' before '<' token
/usr/include/gconfmm-2.6/gconfmm/changeset.h:128: error: expected ',' or '...' before '&' token
/usr/include/gconfmm-2.6/gconfmm/changeset.h:128: error: ISO C++ forbids declaration of 'ForeachSlot' with no type
/usr/include/gconfmm-2.6/gconfmm/client.h:399: error: 'Callback' has not been declared
gNinjamClient.hh:68: error: 'sigc' has not been declared
gNinjamClient.hh:68: error: expected ';' before '_gui_connection'
gNinjamClient.hh:69: error: 'Gtk::TreeModel' has not been declared
gNinjamClient.hh:69: error: expected ';' before '_column_model'
gNinjamClient.hh:70: error: using-declaration for non-member at class scope
gNinjamClient.hh:70: error: expected ';' before '<' token
make[2]: *** [gninjam.o] Error 1
make[2]: Leaving directory `/home/dale/Desktop/gninjam/gninjam-0.01a.orig/src'
make[1]: *** [all-recursive] Error 1
make[1]: Leaving directory `/home/dale/Desktop/gninjam/gninjam-0.01a.orig'
make: *** [all] Error 2