All pastes #25548 Raw Edit

Stuff

public text v1 · immutable
#25548 ·published 2005-10-15 04:16 UTC
rendered paste body
[root@Zeus mythtv-0.18.1]# ./configure
# Basic Settings
Compile type     release
Compiler cache   no
DistCC           no
Install prefix   /usr/local
CPU              x86_64 (AMD Athlon(tm) 64 Processor 3500+)
Big Endian       no
MMX enabled      yes
Vector Builtins  yes

# Input Support
Joystick menu    yes
lirc support     no
ivtv support     yes
FireWire support no
DVB support      no [/usr/src/linux-2.6.12-12mdk/include]

# Sound Output Support
OSS support      yes
ALSA support     yes
aRts support     yes
JACK support     yes

# Video Output Support
x11 support      yes
xrandr support   yes
xv support       yes
XvMC support     no
XvMC VLD support no
OpenGL vsync     no
DirectFB         no

Creating config.mak and config.h
[root@Zeus mythtv-0.18.1]#                     

[root@Zeus mythtv-0.18.1]# qmake mythtv.pro
[root@Zeus mythtv-0.18.1]# make
cd libs && qmake libs.pro -o Makefile
cd libs && make -f Makefile
make[1]: Entering directory `/home/matthew/Desktop/mythtv-0.18.1/libs'
cd libavcodec && qmake libavcodec.pro -o Makefile
cd libavcodec && make -f Makefile
make[2]: Entering directory `/home/matthew/Desktop/mythtv-0.18.1/libs/libavcodec'
gcc -c -pipe -march=k8 -w -O3 -Wall -Wno-switch -fomit-frame-pointer -D_REENTRANT -DPIC -fPIC  -DMMX -DUSING_IVTV -DUSING_XRANDR -D_GNU_SOURCE -D_FILE_OFFSET_BITS=64 -DPREFIX=\"/usr/local\" -DHAVE_AV_CONFIG_H -D_LARGEFILE_SOURCE -DQT_NO_DEBUG -DQT_THREAD_SUPPORT -DQT_SHARED -I/usr/lib/qt3/mkspecs/default64 -I. -I.. -I../.. -I/usr/lib/qt3//include -o utils.o utils.c
In file included from avcodec.h:14,
                 from utils.c:27:
common.h:61: error: array type has incomplete element type
common.h:65: error: array type has incomplete element type
make[2]: *** [utils.o] Error 1
make[2]: Leaving directory `/home/matthew/Desktop/mythtv-0.18.1/libs/libavcodec'
make[1]: *** [sub-libavcodec] Error 2
make[1]: Leaving directory `/home/matthew/Desktop/mythtv-0.18.1/libs'
make: *** [sub-libs] Error 2
[root@Zeus mythtv-0.18.1]#