rendered paste bodyBuilding Apache Config.....Done
Downloading and compiling apache+modules....
Verifying archive integrity... All good.
Uncompressing buildapache.............................................................................................................................
Verifying compiler and libs....Verifying installation....Using newyum support
Setting up Install Process
Setting up Repos
Reading repository metadata in from local files
Traceback (most recent call last):
File "/usr/bin/yum", line 7, in ?
yummain.main(sys.argv[1:])
File "/usr/share/yum-cli/yummain.py", line 68, in main
result, resultmsgs = base.doCommands()
File "/usr/share/yum-cli/cli.py", line 406, in doCommands
return self.installPkgs()
File "/usr/share/yum-cli/cli.py", line 813, in installPkgs
self.doRepoSetup()
File "/usr/share/yum-cli/cli.py", line 89, in doRepoSetup
self.doSackSetup()
File "__init__.py", line 143, in doSackSetup
File "repos.py", line 243, in populateSack
File "mdcache.py", line 103, in getPrimary
File "mdcache.py", line 90, in _getGeneric
File "mdcache.py", line 62, in _unpickle
EOFError
Using newyum support
Setting up Install Process
Setting up Repos
Reading repository metadata in from local files
Traceback (most recent call last):
File "/usr/bin/yum", line 7, in ?
yummain.main(sys.argv[1:])
File "/usr/share/yum-cli/yummain.py", line 68, in main
result, resultmsgs = base.doCommands()
File "/usr/share/yum-cli/cli.py", line 406, in doCommands
return self.installPkgs()
File "/usr/share/yum-cli/cli.py", line 813, in installPkgs
self.doRepoSetup()
File "/usr/share/yum-cli/cli.py", line 89, in doRepoSetup
self.doSackSetup()
File "__init__.py", line 143, in doSackSetup
File "repos.py", line 243, in populateSack
File "mdcache.py", line 103, in getPrimary
File "mdcache.py", line 90, in _getGeneric
File "mdcache.py", line 62, in _unpickle
EOFError
Done
Done
********************************
This is buildapache version 10.5.1
********************************
buildapache configured from Web Host Manager
Apache configured from Web Host Manager!
Untarring expat...Done
configure expat-1.95.6...(--prefix=/usr).... . . . . Done
make -j 1 expat-1.95.6....... . . . . . . . . Done
make expat-1.95.6...(install).... . . . . . . . Done
Untarring apache....
Suexec Standard Patch
patching file src/support/suexec.c
patching file src/support/suexec.h
Suexec MailMan Patch
patching file src/support/suexec.c
Applying regex AMD64 patch
(Stripping trailing CRs from patch.)
patching file src/regex/regexec.c
patch unexpectedly ends in middle of line
Hunk #1 succeeded at 21 with fuzz 2.
Fileprotect Suexec Standard Patch
patching file src/support/suexec.c
Hunk #1 succeeded at 224 (offset -44 lines).
Hunk #3 succeeded at 556 (offset -44 lines).
HTTPS var Standard Patch
patching file src/support/suexec.c
Hunk #1 succeeded at 131 (offset -43 lines).
configure apache_1.3.33...(--enable-shared=max).... . . Done
patching file src/include/httpd.h
Hunk #1 succeeded at 272 (offset -44 lines).
Untarring modssl....
patching file pkg.sslmod/libssl.module
configure mod_ssl-2.8.22-1.3.33...(--with-apache=../apache_1.3.33 --with-ssl=SYSTEM --enable-module=expires --enable-shared=expires --add-module=../mod_frontpage.c --enable-module=rewrite --enable-shared=rewrite --enable-suexec --suexec-logfile=/usr/local/apache/logs/suexec_log --suexec-caller=nobody --suexec-uidmin=100 --suexec-gidmin=100 --suexec-docroot=/ --suexec-userdir=public_html).... . . . . . . Done
configure apache_1.3.33...(--enable-module=ssl --enable-module=expires --enable-shared=expires --add-module=../mod_frontpage.c --enable-module=rewrite --enable-shared=rewrite --enable-suexec --suexec-logfile=/usr/local/apache/logs/suexec_log --suexec-caller=nobody --suexec-uidmin=100 --suexec-gidmin=100 --suexec-docroot=/ --suexec-userdir=public_html).... . . . Done
make -j 1 apache_1.3.33....... . . . . . . . . . . . . . . . Done
make apache_1.3.33...(install).... Done
/etc/rc.d/init.d/httpd start: httpd started
Setting /home permissions to 0711......Done
Setting permissions for.....wwwunix...nixtr......Done
Untarring curl......Done
configure curl-7.12.0...(--libdir=/usr/lib64 --prefix=/usr --without-ssl).... . . . . . . . . . . . . . . . Done
make -j 1 curl-7.12.0....... . . . . . . . . . . . . . . . . . . . . . Done
make[2]: *** [libcurl.la] Error 1
make[1]: *** [all] Error 2
make: *** [all-recursive] Error 1
make curl-7.12.0...(install).... Done
make[2]: *** [libcurl.la] Error 1
make[1]: *** [install] Error 2
make: *** [install-recursive] Error 1
Using newyum support
Setting up Install Process
Setting up Repos
Reading repository metadata in from local files
Traceback (most recent call last):
File "/usr/bin/yum", line 7, in ?
yummain.main(sys.argv[1:])
File "/usr/share/yum-cli/yummain.py", line 68, in main
result, resultmsgs = base.doCommands()
File "/usr/share/yum-cli/cli.py", line 406, in doCommands
return self.installPkgs()
File "/usr/share/yum-cli/cli.py", line 813, in installPkgs
self.doRepoSetup()
File "/usr/share/yum-cli/cli.py", line 89, in doRepoSetup
self.doSackSetup()
File "__init__.py", line 143, in doSackSetup
File "repos.py", line 243, in populateSack
File "mdcache.py", line 103, in getPrimary
File "mdcache.py", line 90, in _getGeneric
File "mdcache.py", line 62, in _unpickle
EOFError
Untarring php....Done
x86_64 detected.. patching/rebuilding php configure.....New Libtool detected.. applying patch!
patching file acinclude.m4
Hunk #1 succeeded at 783 with fuzz 2 (offset -38 lines).
You should add the contents of `/usr/share/aclocal/libtool.m4' to `aclocal.m4'.
Forcing buildconf
using default Zend directory
buildconf: checking installation...
buildconf: autoconf version 2.59 (ok)
buildconf: running cvsclean.
rebuilding aclocal.m4
rebuilding configure
rebuilding main/php_config.h.in
autoheader: WARNING: Using auxiliary files such as `acconfig.h', `config.h.bot'
autoheader: WARNING: and `config.h.top', to define templates for `config.h.in'
autoheader: WARNING: is deprecated and discouraged.
autoheader:
autoheader: WARNING: Using the third argument of `AC_DEFINE' and
autoheader: WARNING: `AC_DEFINE_UNQUOTED' allows to define a template without
autoheader: WARNING: `acconfig.h':
autoheader:
autoheader: WARNING: AC_DEFINE([NEED_FUNC_MAIN], 1,
autoheader: [Define if a function `main' is needed.])
autoheader:
autoheader: WARNING: More sophisticated templates can also be produced, see the
autoheader: WARNING: documentation.
Done
Applying CURL curl_formfree patch
patching file ext/curl/curl.c
Hunk #1 succeeded at 584 (offset 39 lines).
Hunk #2 succeeded at 900 (offset 15 lines).
configure php-4.3.11...(--enable-pic --with-apxs=/usr/local/apache/bin/apxs --prefix=/usr --with-xml --enable-bcmath --enable-calendar --with-curl --enable-ftp --with-gd --with-jpeg-dir=/usr/local --with-png-dir=/usr --with-xpm-dir=/usr/X11R6 --with-gettext --enable-magic-quotes --with-mysql=/usr --with-openssl --enable-discard-path --with-pear --enable-sockets --enable-track-vars --with-ttf --with-freetype-dir=/usr --enable-gd-native-ttf --with-zlib).... . . . . . . . . . . . . . . . . . . . . . . . . . . . . . Done
make -j 1 php-4.3.11...(clean).... Done
make -j 1 php-4.3.11....... . . . . . . . . . . . . . . . . . . . . . . . . . . . . . . . . . . . . . . . . . . . . . . . . . . . . . . . . . . . . . . . . . . . . . . . . . . . . . . . . . . . . . . . . . . . . . . . . . . . . . Done
make php-4.3.11...(install).... . . . . . Done
/etc/rc.d/init.d/httpd start: httpd started
configure php-4.3.11...(--enable-pic --prefix=/usr --with-xml --enable-bcmath --enable-calendar --with-curl --enable-ftp --with-gd --with-jpeg-dir=/usr/local --with-png-dir=/usr --with-xpm-dir=/usr/X11R6 --with-gettext --enable-magic-quotes --with-mysql=/usr --with-openssl --enable-discard-path --with-pear --enable-sockets --enable-track-vars --with-ttf --with-freetype-dir=/usr --enable-gd-native-ttf --with-zlib).... . . . . . . . . . . . . . . . . . . . . . . . . . . . . . Done
make -j 1 php-4.3.11...(clean).... Done
make -j 1 php-4.3.11....... . . . . . . . . . . . . . . . . . . . . . . . . . . . . . . . . . . . . . . . . . . . . . . . . . . . . . . . . . . . . . . . . . . . . . . . . . . . . . . . . . . . . . . . . . . . . . . . . . . Done
make php-4.3.11...(install).... . . . . Done
initfpsuexec: using apache 1.x support
PHP version file has been updated to 4.3.11
Executing /scripts/postbuildapache (if exists)...Done
/etc/rc.d/init.d/httpd start: httpd started
Attempting to restart httpd
Waiting for httpd to restart....
.
.
.
.
.
.
.
.
.
.
finished.
httpd status
root 8841 0.6 0.5 88416 6024 ? Ss 10:43 0:00 /usr/local/apache/bin/httpd -DSSL
httpd started ok
Build Complete