All pastes #253276 Raw Edit

Stuff

public text v1 · immutable
#253276 ·published 2006-11-20 16:16 UTC
rendered paste body
e_bindings.h:91: error: syntax error before "Ecore_X_Event_Mouse_Button_Down"
e_bindings.h:92: error: syntax error before "Ecore_X_Event_Mouse_Button_Down"
e_bindings.h:93: error: syntax error before "Ecore_X_Event_Mouse_Button_Up"
e_bindings.h:94: error: syntax error before "Ecore_X_Event_Mouse_Button_Up"
e_bindings.h:100: error: syntax error before "Ecore_X_Event_Key_Down"
e_bindings.h:101: error: syntax error before "Ecore_X_Event_Key_Up"
e_bindings.h:112: error: syntax error before "Ecore_X_Event_Mouse_Wheel"
e_bindings.h:113: error: syntax error before "Ecore_X_Event_Mouse_Wheel"
In file included from e_includes.h:44,
                 from e.h:124,
                 from e_main.c:4:
e_actions.h:21: error: syntax error before "Ecore_X_Event_Mouse_Button_Down"
e_actions.h:22: error: syntax error before "Ecore_X_Event_Mouse_Wheel"
e_actions.h:23: error: syntax error before "Ecore_X_Event_Key_Down"
e_actions.h:26: error: syntax error before "Ecore_X_Event_Mouse_Button_Up"
e_actions.h:27: error: syntax error before "Ecore_X_Event_Key_Up"
In file included from e_includes.h:45,
                 from e.h:124,
                 from e_main.c:4:
e_popup.h:30: error: syntax error before "Ecore_X_Rectangle"
In file included from e_includes.h:82,
                 from e.h:124,
                 from e_main.c:4:
e_int_border_menu.h:10: error: syntax error before "Ecore_X_Time"
e_main.c: In function `_e_main_screens_init':
e_main.c:933: warning: assignment makes pointer from integer without a cast
gmake[3]: *** [e_main.o] Error 1
gmake[3]: Leaving directory `/usr/ports/x11-wm/enlightenment-devel/work/e-20060926/src/bin'
gmake[2]: *** [all-recursive] Error 1
gmake[2]: Leaving directory `/usr/ports/x11-wm/enlightenment-devel/work/e-20060926/src'
gmake[1]: *** [all-recursive] Error 1
gmake[1]: Leaving directory `/usr/ports/x11-wm/enlightenment-devel/work/e-20060926'
gmake: *** [all] Error 2
*** Error code 2