All pastes #252421 Raw Edit

Stuff

public text v1 · immutable
#252421 ·published 2006-11-19 14:01 UTC
rendered paste body
Processing file orbit-interface.idl
cc1: note: obsolete option -I- used, please use -iquote instead
(rm -f ../../../include/orbit/orb-core/orbit-interface.h ../../../include/orbit/or
b-core/orbit-interface-stubs.c ../../../include/orbit/orb-core/orbit-interface-ske
ls.c ../../../include/orbit/orb-core/orbit-interface-common.c ../../../include/orb
it/orb-core/orbit-interface-imodule.c ../../../include/orbit/orb-core/orbit-interf
ace-skelimpl.c || true) > /dev/null
../../../src/idl-compiler/orbit-idl-2 -I../../../src/idl/CORBA_PIDL -I../../../src
/idl/CORBA -I../../../src/idl/misc -I../../../src/idl/interop -I. -D_PRE_3_0_COMPI
LER_ --noskels --nodefskels --nostubs --noidata --noheaders --define=Object=OObjec
t --define=TypeCode=TTypeCode --showcpperrors --deps ../../../include/orbit/orb-co
re/.deps/orbit-interface.idl.P ../../../include/orbit/orb-core/../../../src/orb/or
b-core/orbit-interface.idl
orbit-idl-2 2.14.2 compiling
  mode, show preprocessor errors, passes: common

Processing file ../../../include/orbit/orb-core/../../../src/orb/orb-core/orbit-in
terface.idl
cc1: note: obsolete option -I- used, please use -iquote instead

** (orbit-idl-2:7479): WARNING **: ../../../include/orbit/orb-core/../../../src/or                                            b/orb-core/orbit-interface.idl compilation failed
make[3]: *** [../../../include/orbit/orb-core/orbit-interface.h] Error 1
make[3]: Leaving directory `/var/tmp/portage/gnome-base/orbit-2.14.2/work/ORBit2-2                                            .14.2/src/orb/orb-core'
make[2]: *** [install-recursive] Error 1
make[2]: Leaving directory `/var/tmp/portage/gnome-base/orbit-2.14.2/work/ORBit2-2                                            .14.2/src/orb'
make[1]: *** [install-recursive] Error 1
make[1]: Leaving directory `/var/tmp/portage/gnome-base/orbit-2.14.2/work/ORBit2-2                                            .14.2/src'
make: *** [install-recursive] Error 1

!!! ERROR: gnome-base/orbit-2.14.2 failed.
Call stack:
  ebuild.sh, line 1568:   Called dyn_install
  ebuild.sh, line 1022:   Called src_install
  ebuild.sh, line 1261:   Called gnome2_src_install
  gnome2.eclass, line 77:   Called die

!!! install failed
!!! If you need support, post the topmost build error, and the call stack if relev                                            ant.