Something
public text v1 · immutablemake: *** [znc.o] Error 1
make: *** Waiting for unfinished jobs....
IRCSock.h:44: error: extra qualification 'CIRCSock::' on member 'ParseISupport'
make: *** [User.o] Error 1
!!! ERROR: net-irc/znc-0.045 failed.
Call stack:
ebuild.sh, line 1539: Called dyn_compile
ebuild.sh, line 939: Called src_compile
znc-0.045.ebuild, line 35: Called die