rendered paste bodyThis file contains any messages produced by compilers while
running configure, to aid debugging if configure makes a mistake.
It was created by configure, which was
generated by GNU Autoconf 2.59. Invocation command line was
$ ./configure
## --------- ##
## Platform. ##
## --------- ##
hostname = station2
uname -m = i686
uname -r = 2.6.13-1.1526_FC4
uname -s = Linux
uname -v = #1 Wed Sep 28 19:15:10 EDT 2005
/usr/bin/uname -p = unknown
/bin/uname -X = unknown
/bin/arch = i686
/usr/bin/arch -k = unknown
/usr/convex/getsysinfo = unknown
hostinfo = unknown
/bin/machine = unknown
/usr/bin/oslevel = unknown
/bin/universe = unknown
PATH: /data/phonecall/openembedded/bitbake/bin
PATH: /usr/kerberos/bin
PATH: /usr/local/bin
PATH: /bin
PATH: /usr/bin
PATH: /usr/X11R6/bin
PATH: /data/phonecall/bin
## ----------- ##
## Core tests. ##
## ----------- ##
configure:1540: checking for a BSD-compatible install
configure:1595: result: /usr/bin/install -c
configure:1606: checking whether build environment is sane
configure:1649: result: yes
configure:1714: checking for gawk
configure:1730: found /bin/gawk
configure:1740: result: gawk
configure:1750: checking whether make sets $(MAKE)
configure:1770: result: yes
configure:1963: checking for style of include used by make
configure:1991: result: GNU
configure:2062: checking for gcc
configure:2078: found /usr/bin/gcc
configure:2088: result: gcc
configure:2332: checking for C compiler version
configure:2335: gcc --version </dev/null >&5
gcc (GCC) 4.0.1 20050727 (Red Hat 4.0.1-5)
Copyright (C) 2005 Free Software Foundation, Inc.
This is free software; see the source for copying conditions. There is NO
warranty; not even for MERCHANTABILITY or FITNESS FOR A PARTICULAR PURPOSE.
configure:2338: $? = 0
configure:2340: gcc -v </dev/null >&5
Using built-in specs.
Target: i386-redhat-linux
Configured with: ../configure --prefix=/usr --mandir=/usr/share/man --infodir=/usr/share/info --enable-shared --enable-threads=posix --enable-checking=release --with-system-zlib --enable-__cxa_atexit --disable-libunwind-exceptions --enable-libgcj-multifile --enable-languages=c,c++,objc,java,f95,ada --enable-java-awt=gtk --with-java-home=/usr/lib/jvm/java-1.4.2-gcj-1.4.2.0/jre --host=i386-redhat-linux
Thread model: posix
gcc version 4.0.1 20050727 (Red Hat 4.0.1-5)
configure:2343: $? = 0
configure:2345: gcc -V </dev/null >&5
gcc: '-V' option must have argument
configure:2348: $? = 1
configure:2371: checking for C compiler default output file name
configure:2374: gcc conftest.c >&5
configure:2377: $? = 0
configure:2423: result: a.out
configure:2428: checking whether the C compiler works
configure:2434: ./a.out
configure:2437: $? = 0
configure:2454: result: yes
configure:2461: checking whether we are cross compiling
configure:2463: result: no
configure:2466: checking for suffix of executables
configure:2468: gcc -o conftest conftest.c >&5
configure:2471: $? = 0
configure:2496: result:
configure:2502: checking for suffix of object files
configure:2523: gcc -c conftest.c >&5
configure:2526: $? = 0
configure:2548: result: o
configure:2552: checking whether we are using the GNU C compiler
configure:2576: gcc -c conftest.c >&5
configure:2582: $? = 0
configure:2586: test -z
|| test ! -s conftest.err
configure:2589: $? = 0
configure:2592: test -s conftest.o
configure:2595: $? = 0
configure:2608: result: yes
configure:2614: checking whether gcc accepts -g
configure:2635: gcc -c -g conftest.c >&5
configure:2641: $? = 0
configure:2645: test -z
|| test ! -s conftest.err
configure:2648: $? = 0
configure:2651: test -s conftest.o
configure:2654: $? = 0
configure:2665: result: yes
configure:2682: checking for gcc option to accept ANSI C
configure:2752: gcc -c -g -O2 conftest.c >&5
configure:2758: $? = 0
configure:2762: test -z
|| test ! -s conftest.err
configure:2765: $? = 0
configure:2768: test -s conftest.o
configure:2771: $? = 0
configure:2789: result: none needed
configure:2807: gcc -c -g -O2 conftest.c >&5
conftest.c:2: error: syntax error before 'me'
configure:2813: $? = 1
configure: failed program was:
| #ifndef __cplusplus
| choke me
| #endif
configure:2948: checking dependency style of gcc
configure:3038: result: gcc3
configure:3056: checking whether gcc and cc understand -c and -o together
configure:3086: gcc -c conftest.c -o conftest.o >&5
configure:3089: $? = 0
configure:3091: gcc -c conftest.c -o conftest.o >&5
configure:3094: $? = 0
configure:3101: cc -c conftest.c >&5
configure:3104: $? = 0
configure:3107: cc -c conftest.c -o conftest.o >&5
configure:3110: $? = 0
configure:3112: cc -c conftest.c -o conftest.o >&5
configure:3115: $? = 0
configure:3133: result: yes
configure:3186: checking for ranlib
configure:3202: found /usr/bin/ranlib
configure:3213: result: ranlib
configure:3231: checking how to run the C preprocessor
configure:3266: gcc -E conftest.c
configure:3272: $? = 0
configure:3304: gcc -E conftest.c
conftest.c:9:28: error: ac_nonexistent.h: No such file or directory
configure:3310: $? = 1
configure: failed program was:
| /* confdefs.h. */
|
| #define PACKAGE_NAME ""
| #define PACKAGE_TARNAME ""
| #define PACKAGE_VERSION ""
| #define PACKAGE_STRING ""
| #define PACKAGE_BUGREPORT ""
| /* end confdefs.h. */
| #include <ac_nonexistent.h>
configure:3349: result: gcc -E
configure:3373: gcc -E conftest.c
configure:3379: $? = 0
configure:3411: gcc -E conftest.c
conftest.c:9:28: error: ac_nonexistent.h: No such file or directory
configure:3417: $? = 1
configure: failed program was:
| /* confdefs.h. */
|
| #define PACKAGE_NAME ""
| #define PACKAGE_TARNAME ""
| #define PACKAGE_VERSION ""
| #define PACKAGE_STRING ""
| #define PACKAGE_BUGREPORT ""
| /* end confdefs.h. */
| #include <ac_nonexistent.h>
configure:3461: checking for egrep
configure:3471: result: grep -E
configure:3476: checking for ANSI C header files
configure:3501: gcc -c -g -O2 conftest.c >&5
configure:3507: $? = 0
configure:3511: test -z
|| test ! -s conftest.err
configure:3514: $? = 0
configure:3517: test -s conftest.o
configure:3520: $? = 0
configure:3609: gcc -o conftest -g -O2 conftest.c >&5
conftest.c: In function 'main':
conftest.c:26: warning: incompatible implicit declaration of built-in function 'exit'
configure:3612: $? = 0
configure:3614: ./conftest
configure:3617: $? = 0
configure:3632: result: yes
configure:3656: checking for sys/types.h
configure:3672: gcc -c -g -O2 conftest.c >&5
configure:3678: $? = 0
configure:3682: test -z
|| test ! -s conftest.err
configure:3685: $? = 0
configure:3688: test -s conftest.o
configure:3691: $? = 0
configure:3702: result: yes
configure:3656: checking for sys/stat.h
configure:3672: gcc -c -g -O2 conftest.c >&5
configure:3678: $? = 0
configure:3682: test -z
|| test ! -s conftest.err
configure:3685: $? = 0
configure:3688: test -s conftest.o
configure:3691: $? = 0
configure:3702: result: yes
configure:3656: checking for stdlib.h
configure:3672: gcc -c -g -O2 conftest.c >&5
configure:3678: $? = 0
configure:3682: test -z
|| test ! -s conftest.err
configure:3685: $? = 0
configure:3688: test -s conftest.o
configure:3691: $? = 0
configure:3702: result: yes
configure:3656: checking for string.h
configure:3672: gcc -c -g -O2 conftest.c >&5
configure:3678: $? = 0
configure:3682: test -z
|| test ! -s conftest.err
configure:3685: $? = 0
configure:3688: test -s conftest.o
configure:3691: $? = 0
configure:3702: result: yes
configure:3656: checking for memory.h
configure:3672: gcc -c -g -O2 conftest.c >&5
configure:3678: $? = 0
configure:3682: test -z
|| test ! -s conftest.err
configure:3685: $? = 0
configure:3688: test -s conftest.o
configure:3691: $? = 0
configure:3702: result: yes
configure:3656: checking for strings.h
configure:3672: gcc -c -g -O2 conftest.c >&5
configure:3678: $? = 0
configure:3682: test -z
|| test ! -s conftest.err
configure:3685: $? = 0
configure:3688: test -s conftest.o
configure:3691: $? = 0
configure:3702: result: yes
configure:3656: checking for inttypes.h
configure:3672: gcc -c -g -O2 conftest.c >&5
configure:3678: $? = 0
configure:3682: test -z
|| test ! -s conftest.err
configure:3685: $? = 0
configure:3688: test -s conftest.o
configure:3691: $? = 0
configure:3702: result: yes
configure:3656: checking for stdint.h
configure:3672: gcc -c -g -O2 conftest.c >&5
configure:3678: $? = 0
configure:3682: test -z
|| test ! -s conftest.err
configure:3685: $? = 0
configure:3688: test -s conftest.o
configure:3691: $? = 0
configure:3702: result: yes
configure:3656: checking for unistd.h
configure:3672: gcc -c -g -O2 conftest.c >&5
configure:3678: $? = 0
configure:3682: test -z
|| test ! -s conftest.err
configure:3685: $? = 0
configure:3688: test -s conftest.o
configure:3691: $? = 0
configure:3702: result: yes
configure:3731: checking stdarg.h usability
configure:3743: gcc -c -g -O2 conftest.c >&5
configure:3749: $? = 0
configure:3753: test -z
|| test ! -s conftest.err
configure:3756: $? = 0
configure:3759: test -s conftest.o
configure:3762: $? = 0
configure:3772: result: yes
configure:3776: checking stdarg.h presence
configure:3786: gcc -E conftest.c
configure:3792: $? = 0
configure:3812: result: yes
configure:3847: checking for stdarg.h
configure:3854: result: yes
configure:4160: gcc -o conftest -g -O2 conftest.c >&5
/tmp/ccy2OhVZ.o(.text+0x20): In function `main':
/data/phonecall/tmp/work/php-4.3.10-r0/php-4.3.10/TSRM/conftest.c:32: undefined reference to `pthread_mutexattr_init'
/tmp/ccy2OhVZ.o(.text+0x34):/data/phonecall/tmp/work/php-4.3.10-r0/php-4.3.10/TSRM/conftest.c:33: undefined reference to `pthread_create'
collect2: ld returned 1 exit status
configure:4163: $? = 1
configure: program exited with status 1
configure: failed program was:
| /* confdefs.h. */
|
| #define PACKAGE_NAME ""
| #define PACKAGE_TARNAME ""
| #define PACKAGE_VERSION ""
| #define PACKAGE_STRING ""
| #define PACKAGE_BUGREPORT ""
| #define STDC_HEADERS 1
| #define HAVE_SYS_TYPES_H 1
| #define HAVE_SYS_STAT_H 1
| #define HAVE_STDLIB_H 1
| #define HAVE_STRING_H 1
| #define HAVE_MEMORY_H 1
| #define HAVE_STRINGS_H 1
| #define HAVE_INTTYPES_H 1
| #define HAVE_STDINT_H 1
| #define HAVE_UNISTD_H 1
| #define HAVE_STDARG_H 1
| /* end confdefs.h. */
|
| #include <pthread.h>
| #include <stddef.h>
|
| void *thread_routine(void *data) {
| return data;
| }
|
| int main() {
| pthread_t thd;
| pthread_mutexattr_t mattr;
| int data = 1;
| pthread_mutexattr_init(&mattr);
| return pthread_create(&thd, NULL, thread_routine, &data);
| }
configure:4188: checking for pthreads_cflags
configure:4226: gcc -o conftest -g -O2 -kthread conftest.c >&5
gcc: unrecognized option '-kthread'
/tmp/ccSrgVse.o(.text+0x20): In function `main':
/data/phonecall/tmp/work/php-4.3.10-r0/php-4.3.10/TSRM/conftest.c:32: undefined reference to `pthread_mutexattr_init'
/tmp/ccSrgVse.o(.text+0x34):/data/phonecall/tmp/work/php-4.3.10-r0/php-4.3.10/TSRM/conftest.c:33: undefined reference to `pthread_create'
collect2: ld returned 1 exit status
configure:4229: $? = 1
configure: program exited with status 1
configure: failed program was:
| /* confdefs.h. */
|
| #define PACKAGE_NAME ""
| #define PACKAGE_TARNAME ""
| #define PACKAGE_VERSION ""
| #define PACKAGE_STRING ""
| #define PACKAGE_BUGREPORT ""
| #define STDC_HEADERS 1
| #define HAVE_SYS_TYPES_H 1
| #define HAVE_SYS_STAT_H 1
| #define HAVE_STDLIB_H 1
| #define HAVE_STRING_H 1
| #define HAVE_MEMORY_H 1
| #define HAVE_STRINGS_H 1
| #define HAVE_INTTYPES_H 1
| #define HAVE_STDINT_H 1
| #define HAVE_UNISTD_H 1
| #define HAVE_STDARG_H 1
| /* end confdefs.h. */
|
| #include <pthread.h>
| #include <stddef.h>
|
| void *thread_routine(void *data) {
| return data;
| }
|
| int main() {
| pthread_t thd;
| pthread_mutexattr_t mattr;
| int data = 1;
| pthread_mutexattr_init(&mattr);
| return pthread_create(&thd, NULL, thread_routine, &data);
| }
configure:4226: gcc -o conftest -g -O2 -pthread conftest.c >&5
configure:4229: $? = 0
configure:4231: ./conftest
configure:4234: $? = 0
configure:4261: result: -pthread
configure:4264: checking for pthreads_lib
configure:4336: result:
configure:4365: checking for POSIX threads
configure:4367: result: yes
configure:4453: checking build system type
configure:4471: result: i686-redhat-linux-gnu
configure:4479: checking host system type
configure:4493: result: i686-redhat-linux-gnu
configure:4501: checking for a sed that does not truncate output
configure:4555: result: /bin/sed
configure:4569: checking for ld used by gcc
configure:4636: result: /usr/bin/ld
configure:4645: checking if the linker (/usr/bin/ld) is GNU ld
configure:4660: result: yes
configure:4665: checking for /usr/bin/ld option to reload object files
configure:4672: result: -r
configure:4690: checking for BSD-compatible nm
configure:4732: result: /usr/bin/nm -B
configure:4736: checking whether ln -s works
configure:4740: result: yes
configure:4747: checking how to recognise dependent libraries
configure:4919: result: pass_all
configure:5141: checking dlfcn.h usability
configure:5153: gcc -c -g -O2 conftest.c >&5
configure:5159: $? = 0
configure:5163: test -z
|| test ! -s conftest.err
configure:5166: $? = 0
configure:5169: test -s conftest.o
configure:5172: $? = 0
configure:5182: result: yes
configure:5186: checking dlfcn.h presence
configure:5196: gcc -E conftest.c
configure:5202: $? = 0
configure:5222: result: yes
configure:5257: checking for dlfcn.h
configure:5264: result: yes
configure:5329: checking for g++
configure:5345: found /usr/bin/g++
configure:5355: result: g++
configure:5371: checking for C++ compiler version
configure:5374: g++ --version </dev/null >&5
g++ (GCC) 4.0.1 20050727 (Red Hat 4.0.1-5)
Copyright (C) 2005 Free Software Foundation, Inc.
This is free software; see the source for copying conditions. There is NO
warranty; not even for MERCHANTABILITY or FITNESS FOR A PARTICULAR PURPOSE.
configure:5377: $? = 0
configure:5379: g++ -v </dev/null >&5
Using built-in specs.
Target: i386-redhat-linux
Configured with: ../configure --prefix=/usr --mandir=/usr/share/man --infodir=/usr/share/info --enable-shared --enable-threads=posix --enable-checking=release --with-system-zlib --enable-__cxa_atexit --disable-libunwind-exceptions --enable-libgcj-multifile --enable-languages=c,c++,objc,java,f95,ada --enable-java-awt=gtk --with-java-home=/usr/lib/jvm/java-1.4.2-gcj-1.4.2.0/jre --host=i386-redhat-linux
Thread model: posix
gcc version 4.0.1 20050727 (Red Hat 4.0.1-5)
configure:5382: $? = 0
configure:5384: g++ -V </dev/null >&5
g++: '-V' option must have argument
configure:5387: $? = 1
configure:5390: checking whether we are using the GNU C++ compiler
configure:5414: g++ -c conftest.cc >&5
configure:5420: $? = 0
configure:5424: test -z
|| test ! -s conftest.err
configure:5427: $? = 0
configure:5430: test -s conftest.o
configure:5433: $? = 0
configure:5446: result: yes
configure:5452: checking whether g++ accepts -g
configure:5473: g++ -c -g conftest.cc >&5
configure:5479: $? = 0
configure:5483: test -z
|| test ! -s conftest.err
configure:5486: $? = 0
configure:5489: test -s conftest.o
configure:5492: $? = 0
configure:5503: result: yes
configure:5545: g++ -c -g -O2 conftest.cc >&5
configure:5551: $? = 0
configure:5555: test -z
|| test ! -s conftest.err
configure:5558: $? = 0
configure:5561: test -s conftest.o
configure:5564: $? = 0
configure:5590: g++ -c -g -O2 conftest.cc >&5
conftest.cc: In function 'int main()':
conftest.cc:26: error: 'exit' was not declared in this scope
configure:5596: $? = 1
configure: failed program was:
| /* confdefs.h. */
|
| #define PACKAGE_NAME ""
| #define PACKAGE_TARNAME ""
| #define PACKAGE_VERSION ""
| #define PACKAGE_STRING ""
| #define PACKAGE_BUGREPORT ""
| #define STDC_HEADERS 1
| #define HAVE_SYS_TYPES_H 1
| #define HAVE_SYS_STAT_H 1
| #define HAVE_STDLIB_H 1
| #define HAVE_STRING_H 1
| #define HAVE_MEMORY_H 1
| #define HAVE_STRINGS_H 1
| #define HAVE_INTTYPES_H 1
| #define HAVE_STDINT_H 1
| #define HAVE_UNISTD_H 1
| #define HAVE_STDARG_H 1
| #define PTHREADS 1
| #define HAVE_DLFCN_H 1
| /* end confdefs.h. */
|
| int
| main ()
| {
| exit (42);
| ;
| return 0;
| }
configure:5545: g++ -c -g -O2 conftest.cc >&5
configure:5551: $? = 0
configure:5555: test -z
|| test ! -s conftest.err
configure:5558: $? = 0
configure:5561: test -s conftest.o
configure:5564: $? = 0
configure:5590: g++ -c -g -O2 conftest.cc >&5
configure:5596: $? = 0
configure:5600: test -z
|| test ! -s conftest.err
configure:5603: $? = 0
configure:5606: test -s conftest.o
configure:5609: $? = 0
configure:5634: checking dependency style of g++
configure:5724: result: gcc3
configure:5751: checking how to run the C++ preprocessor
configure:5782: g++ -E conftest.cc
configure:5788: $? = 0
configure:5820: g++ -E conftest.cc
conftest.cc:25:28: error: ac_nonexistent.h: No such file or directory
configure:5826: $? = 1
configure: failed program was:
| /* confdefs.h. */
|
| #define PACKAGE_NAME ""
| #define PACKAGE_TARNAME ""
| #define PACKAGE_VERSION ""
| #define PACKAGE_STRING ""
| #define PACKAGE_BUGREPORT ""
| #define STDC_HEADERS 1
| #define HAVE_SYS_TYPES_H 1
| #define HAVE_SYS_STAT_H 1
| #define HAVE_STDLIB_H 1
| #define HAVE_STRING_H 1
| #define HAVE_MEMORY_H 1
| #define HAVE_STRINGS_H 1
| #define HAVE_INTTYPES_H 1
| #define HAVE_STDINT_H 1
| #define HAVE_UNISTD_H 1
| #define HAVE_STDARG_H 1
| #define PTHREADS 1
| #define HAVE_DLFCN_H 1
| #ifdef __cplusplus
| extern "C" void std::exit (int) throw (); using std::exit;
| #endif
| /* end confdefs.h. */
| #include <ac_nonexistent.h>
configure:5865: result: g++ -E
configure:5889: g++ -E conftest.cc
configure:5895: $? = 0
configure:5927: g++ -E conftest.cc
conftest.cc:25:28: error: ac_nonexistent.h: No such file or directory
configure:5933: $? = 1
configure: failed program was:
| /* confdefs.h. */
|
| #define PACKAGE_NAME ""
| #define PACKAGE_TARNAME ""
| #define PACKAGE_VERSION ""
| #define PACKAGE_STRING ""
| #define PACKAGE_BUGREPORT ""
| #define STDC_HEADERS 1
| #define HAVE_SYS_TYPES_H 1
| #define HAVE_SYS_STAT_H 1
| #define HAVE_STDLIB_H 1
| #define HAVE_STRING_H 1
| #define HAVE_MEMORY_H 1
| #define HAVE_STRINGS_H 1
| #define HAVE_INTTYPES_H 1
| #define HAVE_STDINT_H 1
| #define HAVE_UNISTD_H 1
| #define HAVE_STDARG_H 1
| #define PTHREADS 1
| #define HAVE_DLFCN_H 1
| #ifdef __cplusplus
| extern "C" void std::exit (int) throw (); using std::exit;
| #endif
| /* end confdefs.h. */
| #include <ac_nonexistent.h>
configure:6030: checking for g77
configure:6059: result: no
configure:6030: checking for f77
configure:6059: result: no
configure:6030: checking for xlf
configure:6059: result: no
configure:6030: checking for frt
configure:6059: result: no
configure:6030: checking for pgf77
configure:6059: result: no
configure:6030: checking for fort77
configure:6059: result: no
configure:6030: checking for fl32
configure:6059: result: no
configure:6030: checking for af77
configure:6059: result: no
configure:6030: checking for f90
configure:6059: result: no
configure:6030: checking for xlf90
configure:6059: result: no
configure:6030: checking for pgf90
configure:6059: result: no
configure:6030: checking for epcf90
configure:6059: result: no
configure:6030: checking for f95
configure:6046: found /usr/bin/f95
configure:6056: result: f95
configure:6071: checking for Fortran 77 compiler version
configure:6074: f95 --version </dev/null >&5
GNU Fortran 95 (GCC 4.0.1 20050727 (Red Hat 4.0.1-5))
Copyright (C) 2005 Free Software Foundation, Inc.
GNU Fortran comes with NO WARRANTY, to the extent permitted by law.
You may redistribute copies of GNU Fortran
under the terms of the GNU General Public License.
For more information about these matters, see the file named COPYING
configure:6077: $? = 0
configure:6079: f95 -v </dev/null >&5
Using built-in specs.
Target: i386-redhat-linux
Configured with: ../configure --prefix=/usr --mandir=/usr/share/man --infodir=/usr/share/info --enable-shared --enable-threads=posix --enable-checking=release --with-system-zlib --enable-__cxa_atexit --disable-libunwind-exceptions --enable-libgcj-multifile --enable-languages=c,c++,objc,java,f95,ada --enable-java-awt=gtk --with-java-home=/usr/lib/jvm/java-1.4.2-gcj-1.4.2.0/jre --host=i386-redhat-linux
Thread model: posix
gcc version 4.0.1 20050727 (Red Hat 4.0.1-5)
configure:6082: $? = 0
configure:6084: f95 -V </dev/null >&5
f95: '-V' option must have argument
configure:6087: $? = 1
configure:6095: checking whether we are using the GNU Fortran 77 compiler
configure:6109: f95 -c conftest.F >&5
configure:6115: $? = 0
configure:6119: test -z
|| test ! -s conftest.err
configure:6122: $? = 0
configure:6125: test -s conftest.o
configure:6128: $? = 0
configure:6141: result: yes
configure:6147: checking whether f95 accepts -g
configure:6159: f95 -c -g conftest.f >&5
configure:6165: $? = 0
configure:6169: test -z
|| test ! -s conftest.err
configure:6172: $? = 0
configure:6175: test -s conftest.o
configure:6178: $? = 0
configure:6190: result: yes
configure:6220: checking the maximum length of command line arguments
configure:6312: result: 32768
configure:6323: checking command to parse /usr/bin/nm -B output from gcc object
configure:6419: gcc -c -g -O2 conftest.c >&5
configure:6422: $? = 0
configure:6426: /usr/bin/nm -B conftest.o \| sed -n -e 's/^.*[ ]\([ABCDGIRSTW][ABCDGIRSTW]*\)[ ][ ]*\([_A-Za-z][_A-Za-z0-9]*\)$/\1 \2 \2/p' \> conftest.nm
configure:6429: $? = 0
configure:6481: gcc -o conftest -g -O2 conftest.c conftstm.o >&5
configure:6484: $? = 0
configure:6522: result: ok
configure:6526: checking for objdir
configure:6541: result: .libs
configure:6631: checking for ar
configure:6647: found /usr/bin/ar
configure:6658: result: ar
configure:6711: checking for ranlib
configure:6738: result: ranlib
configure:6791: checking for strip
configure:6807: found /usr/bin/strip
configure:6818: result: strip
configure:7105: checking if gcc static flag works
configure:7133: result: yes
configure:7151: checking if gcc supports -fno-rtti -fno-exceptions
configure:7169: gcc -c -g -O2 -fno-rtti -fno-exceptions conftest.c >&5
cc1: warning: command line option "-fno-rtti" is valid for C++/ObjC++ but not for C
configure:7173: $? = 0
configure:7186: result: no
configure:7201: checking for gcc option to produce PIC
configure:7405: result: -fPIC
configure:7413: checking if gcc PIC flag -fPIC works
configure:7431: gcc -c -g -O2 -fPIC -DPIC conftest.c >&5
configure:7435: $? = 0
configure:7448: result: yes
configure:7472: checking if gcc supports -c -o file.o
configure:7493: gcc -c -g -O2 -o out/conftest2.o conftest.c >&5
configure:7497: $? = 0
configure:7519: result: yes
configure:7545: checking whether the gcc linker (/usr/bin/ld) supports shared libraries
configure:8440: result: yes
configure:8466: checking whether -lc should be explicitly linked in
configure:8471: gcc -c -g -O2 conftest.c >&5
configure:8474: $? = 0
configure:8488: gcc -shared conftest.o -v -Wl,-soname -Wl,conftest -o conftest 2\>\&1 \| grep -lc \>/dev/null 2\>\&1
configure:8491: $? = 0
configure:8503: result: no
configure:8511: checking dynamic linker characteristics
configure:9074: result: GNU/Linux ld.so
configure:9078: checking how to hardcode library paths into programs
configure:9103: result: immediate
configure:9117: checking whether stripping libraries is possible
configure:9122: result: yes
configure:9952: checking if libtool supports shared libraries
configure:9954: result: yes
configure:9957: checking whether to build shared libraries
configure:9978: result: yes
configure:9981: checking whether to build static libraries
configure:9985: result: yes
configure:10077: creating libtool
configure:10655: checking for ld used by g++
configure:10722: result: /usr/bin/ld
configure:10731: checking if the linker (/usr/bin/ld) is GNU ld
configure:10746: result: yes
configure:10797: checking whether the g++ linker (/usr/bin/ld) supports shared libraries
configure:11684: result: yes
configure:11702: g++ -c -g -O2 conftest.cc >&5
configure:11705: $? = 0
configure:11801: checking for g++ option to produce PIC
configure:12069: result: -fPIC
configure:12077: checking if g++ PIC flag -fPIC works
configure:12095: g++ -c -g -O2 -fPIC -DPIC conftest.cc >&5
configure:12099: $? = 0
configure:12112: result: yes
configure:12136: checking if g++ supports -c -o file.o
configure:12157: g++ -c -g -O2 -o out/conftest2.o conftest.cc >&5
configure:12161: $? = 0
configure:12183: result: yes
configure:12209: checking whether the g++ linker (/usr/bin/ld) supports shared libraries
configure:12234: result: yes
configure:12305: checking dynamic linker characteristics
configure:12868: result: GNU/Linux ld.so
configure:12872: checking how to hardcode library paths into programs
configure:12897: result: immediate
configure:12911: checking whether stripping libraries is possible
configure:12916: result: yes
configure:14252: checking if libtool supports shared libraries
configure:14254: result: yes
configure:14257: checking whether to build shared libraries
configure:14277: result: yes
configure:14280: checking whether to build static libraries
configure:14284: result: yes
configure:14296: checking for f95 option to produce PIC
configure:14500: result: -fPIC
configure:14508: checking if f95 PIC flag -fPIC works
configure:14526: f95 -c -g -O2 -fPIC conftest.f >&5
configure:14530: $? = 0
configure:14543: result: yes
configure:14567: checking if f95 supports -c -o file.o
configure:14588: f95 -c -g -O2 -o out/conftest2.o conftest.f >&5
configure:14592: $? = 0
configure:14614: result: yes
configure:14640: checking whether the f95 linker (/usr/bin/ld) supports shared libraries
configure:15515: result: yes
configure:15586: checking dynamic linker characteristics
configure:16149: result: GNU/Linux ld.so
configure:16153: checking how to hardcode library paths into programs
configure:16178: result: immediate
configure:16192: checking whether stripping libraries is possible
configure:16197: result: yes
configure:20490: checking utime.h usability
configure:20502: gcc -c -g -O2 conftest.c >&5
configure:20508: $? = 0
configure:20512: test -z
|| test ! -s conftest.err
configure:20515: $? = 0
configure:20518: test -s conftest.o
configure:20521: $? = 0
configure:20531: result: yes
configure:20535: checking utime.h presence
configure:20545: gcc -E conftest.c
configure:20551: $? = 0
configure:20571: result: yes
configure:20606: checking for utime.h
configure:20613: result: yes
configure:20490: checking dirent.h usability
configure:20502: gcc -c -g -O2 conftest.c >&5
configure:20508: $? = 0
configure:20512: test -z
|| test ! -s conftest.err
configure:20515: $? = 0
configure:20518: test -s conftest.o
configure:20521: $? = 0
configure:20531: result: yes
configure:20535: checking dirent.h presence
configure:20545: gcc -E conftest.c
configure:20551: $? = 0
configure:20571: result: yes
configure:20606: checking for dirent.h
configure:20613: result: yes
configure:20481: checking for stdarg.h
configure:20486: result: yes
configure:20490: checking alloca.h usability
configure:20502: gcc -c -g -O2 conftest.c >&5
configure:20508: $? = 0
configure:20512: test -z
|| test ! -s conftest.err
configure:20515: $? = 0
configure:20518: test -s conftest.o
configure:20521: $? = 0
configure:20531: result: yes
configure:20535: checking alloca.h presence
configure:20545: gcc -E conftest.c
configure:20551: $? = 0
configure:20571: result: yes
configure:20606: checking for alloca.h
configure:20613: result: yes
configure:20481: checking for unistd.h
configure:20486: result: yes
configure:20490: checking limits.h usability
configure:20502: gcc -c -g -O2 conftest.c >&5
configure:20508: $? = 0
configure:20512: test -z
|| test ! -s conftest.err
configure:20515: $? = 0
configure:20518: test -s conftest.o
configure:20521: $? = 0
configure:20531: result: yes
configure:20535: checking limits.h presence
configure:20545: gcc -E conftest.c
configure:20551: $? = 0
configure:20571: result: yes
configure:20606: checking for limits.h
configure:20613: result: yes
configure:20744: creating ./config.status
## ---------------------- ##
## Running config.status. ##
## ---------------------- ##
This file was extended by config.status, which was
generated by GNU Autoconf 2.59. Invocation command line was
CONFIG_FILES =
CONFIG_HEADERS =
CONFIG_LINKS =
CONFIG_COMMANDS =
$ ./config.status
on station2
config.status:714: creating Makefile
config.status:818: creating tsrm_config.h
config.status:1118: executing depfiles commands
## ---------------- ##
## Cache variables. ##
## ---------------- ##
ac_cv_build=i686-redhat-linux-gnu
ac_cv_build_alias=i686-redhat-linux-gnu
ac_cv_c_compiler_gnu=yes
ac_cv_cxx_compiler_gnu=yes
ac_cv_env_CC_set=
ac_cv_env_CC_value=
ac_cv_env_CFLAGS_set=
ac_cv_env_CFLAGS_value=
ac_cv_env_CPPFLAGS_set=
ac_cv_env_CPPFLAGS_value=
ac_cv_env_CPP_set=
ac_cv_env_CPP_value=
ac_cv_env_CXXCPP_set=
ac_cv_env_CXXCPP_value=
ac_cv_env_CXXFLAGS_set=
ac_cv_env_CXXFLAGS_value=
ac_cv_env_CXX_set=
ac_cv_env_CXX_value=
ac_cv_env_F77_set=
ac_cv_env_F77_value=
ac_cv_env_FFLAGS_set=
ac_cv_env_FFLAGS_value=
ac_cv_env_LDFLAGS_set=
ac_cv_env_LDFLAGS_value=
ac_cv_env_build_alias_set=
ac_cv_env_build_alias_value=
ac_cv_env_host_alias_set=
ac_cv_env_host_alias_value=
ac_cv_env_target_alias_set=
ac_cv_env_target_alias_value=
ac_cv_exeext=
ac_cv_f77_compiler_gnu=yes
ac_cv_header_alloca_h=yes
ac_cv_header_dirent_h=yes
ac_cv_header_dlfcn_h=yes
ac_cv_header_inttypes_h=yes
ac_cv_header_limits_h=yes
ac_cv_header_memory_h=yes
ac_cv_header_stdarg_h=yes
ac_cv_header_stdc=yes
ac_cv_header_stdint_h=yes
ac_cv_header_stdlib_h=yes
ac_cv_header_string_h=yes
ac_cv_header_strings_h=yes
ac_cv_header_sys_stat_h=yes
ac_cv_header_sys_types_h=yes
ac_cv_header_unistd_h=yes
ac_cv_header_utime_h=yes
ac_cv_host=i686-redhat-linux-gnu
ac_cv_host_alias=i686-redhat-linux-gnu
ac_cv_objext=o
ac_cv_path_install='/usr/bin/install -c'
ac_cv_prog_AWK=gawk
ac_cv_prog_CPP='gcc -E'
ac_cv_prog_CXXCPP='g++ -E'
ac_cv_prog_ac_ct_AR=ar
ac_cv_prog_ac_ct_CC=gcc
ac_cv_prog_ac_ct_CXX=g++
ac_cv_prog_ac_ct_F77=f95
ac_cv_prog_ac_ct_RANLIB=ranlib
ac_cv_prog_ac_ct_STRIP=strip
ac_cv_prog_cc_g=yes
ac_cv_prog_cc_gcc_c_o=yes
ac_cv_prog_cc_stdc=
ac_cv_prog_cxx_g=yes
ac_cv_prog_egrep='grep -E'
ac_cv_prog_f77_g=yes
ac_cv_prog_make_make_set=yes
ac_cv_pthreads_cflags=-pthread
ac_cv_pthreads_lib=
am_cv_CC_dependencies_compiler_type=gcc3
am_cv_CXX_dependencies_compiler_type=gcc3
lt_cv_deplibs_check_method=pass_all
lt_cv_file_magic_cmd='$MAGIC_CMD'
lt_cv_file_magic_test_file=
lt_cv_ld_reload_flag=-r
lt_cv_objdir=.libs
lt_cv_path_LD=/usr/bin/ld
lt_cv_path_LDCXX=/usr/bin/ld
lt_cv_path_NM='/usr/bin/nm -B'
lt_cv_path_SED=/bin/sed
lt_cv_prog_compiler_c_o=yes
lt_cv_prog_compiler_c_o_CXX=yes
lt_cv_prog_compiler_c_o_F77=yes
lt_cv_prog_compiler_rtti_exceptions=no
lt_cv_prog_gnu_ld=yes
lt_cv_prog_gnu_ldcxx=yes
lt_cv_sys_global_symbol_pipe='sed -n -e '\''s/^.*[ ]\([ABCDGIRSTW][ABCDGIRSTW]*\)[ ][ ]*\([_A-Za-z][_A-Za-z0-9]*\)$/\1 \2 \2/p'\'''
lt_cv_sys_global_symbol_to_c_name_address='sed -n -e '\''s/^: \([^ ]*\) $/ {\"\1\", (lt_ptr) 0},/p'\'' -e '\''s/^[BCDEGRST] \([^ ]*\) \([^ ]*\)$/ {"\2", (lt_ptr) \&\2},/p'\'''
lt_cv_sys_global_symbol_to_cdecl='sed -n -e '\''s/^. .* \(.*\)$/extern int \1;/p'\'''
lt_cv_sys_max_cmd_len=32768
lt_lt_cv_prog_compiler_c_o='"yes"'
lt_lt_cv_prog_compiler_c_o_CXX='"yes"'
lt_lt_cv_prog_compiler_c_o_F77='"yes"'
lt_lt_cv_sys_global_symbol_pipe='"sed -n -e '\''s/^.*[ ]\\([ABCDGIRSTW][ABCDGIRSTW]*\\)[ ][ ]*\\([_A-Za-z][_A-Za-z0-9]*\\)\$/\\1 \\2 \\2/p'\''"'
lt_lt_cv_sys_global_symbol_to_c_name_address='"sed -n -e '\''s/^: \\([^ ]*\\) \$/ {\\\"\\1\\\", (lt_ptr) 0},/p'\'' -e '\''s/^[BCDEGRST] \\([^ ]*\\) \\([^ ]*\\)\$/ {\"\\2\", (lt_ptr) \\&\\2},/p'\''"'
lt_lt_cv_sys_global_symbol_to_cdecl='"sed -n -e '\''s/^. .* \\(.*\\)\$/extern int \\1;/p'\''"'
## ----------------- ##
## Output variables. ##
## ----------------- ##
ACLOCAL='${SHELL} /data/phonecall/tmp/work/php-4.3.10-r0/php-4.3.10/missing --run aclocal-1.9'
AMDEPBACKSLASH='\'
AMDEP_FALSE='#'
AMDEP_TRUE=''
AMTAR='${SHELL} /data/phonecall/tmp/work/php-4.3.10-r0/php-4.3.10/missing --run tar'
AR='ar'
AUTOCONF='${SHELL} /data/phonecall/tmp/work/php-4.3.10-r0/php-4.3.10/missing --run autoconf'
AUTOHEADER='${SHELL} /data/phonecall/tmp/work/php-4.3.10-r0/php-4.3.10/missing --run autoheader'
AUTOMAKE='${SHELL} /data/phonecall/tmp/work/php-4.3.10-r0/php-4.3.10/missing --run automake-1.9'
AWK='gawk'
CC='gcc'
CCDEPMODE='depmode=gcc3'
CFLAGS='-g -O2'
CPP='gcc -E'
CPPFLAGS=''
CXX='g++'
CXXCPP='g++ -E'
CXXDEPMODE='depmode=gcc3'
CXXFLAGS='-g -O2'
CYGPATH_W='echo'
DEFS='-DHAVE_CONFIG_H'
DEPDIR='.deps'
ECHO='echo'
ECHO_C=''
ECHO_N='-n'
ECHO_T=''
EGREP='grep -E'
EXEEXT=''
F77='f95'
FFLAGS='-g -O2'
INSTALL_DATA='${INSTALL} -m 644'
INSTALL_PROGRAM='${INSTALL}'
INSTALL_SCRIPT='${INSTALL}'
INSTALL_STRIP_PROGRAM='${SHELL} $(install_sh) -c -s'
LDFLAGS=''
LIBOBJS=''
LIBS=''
LIBTOOL='$(SHELL) $(top_builddir)/libtool --silent'
LN_S='ln -s'
LTLIBOBJS=''
MAKEINFO='${SHELL} /data/phonecall/tmp/work/php-4.3.10-r0/php-4.3.10/missing --run makeinfo'
OBJEXT='o'
PACKAGE='TSRM'
PACKAGE_BUGREPORT=''
PACKAGE_NAME=''
PACKAGE_STRING=''
PACKAGE_TARNAME=''
PACKAGE_VERSION=''
PATH_SEPARATOR=':'
RANLIB='ranlib'
SET_MAKE=''
SHELL='/bin/sh'
STRIP='strip'
VERSION='1.0'
ac_ct_AR='ar'
ac_ct_CC='gcc'
ac_ct_CXX='g++'
ac_ct_F77='f95'
ac_ct_RANLIB='ranlib'
ac_ct_STRIP='strip'
am__fastdepCC_FALSE='#'
am__fastdepCC_TRUE=''
am__fastdepCXX_FALSE='#'
am__fastdepCXX_TRUE=''
am__include='include'
am__leading_dot='.'
am__quote=''
am__tar='${AMTAR} chof - "$$tardir"'
am__untar='${AMTAR} xf -'
bindir='${exec_prefix}/bin'
build='i686-redhat-linux-gnu'
build_alias=''
build_cpu='i686'
build_os='linux-gnu'
build_vendor='redhat'
datadir='${prefix}/share'
exec_prefix='${prefix}'
host='i686-redhat-linux-gnu'
host_alias=''
host_cpu='i686'
host_os='linux-gnu'
host_vendor='redhat'
includedir='${prefix}/include'
infodir='${prefix}/info'
install_sh='/data/phonecall/tmp/work/php-4.3.10-r0/php-4.3.10/install-sh'
libdir='${exec_prefix}/lib'
libexecdir='${exec_prefix}/libexec'
localstatedir='${prefix}/var'
mandir='${prefix}/man'
mkdir_p='mkdir -p --'
oldincludedir='/usr/include'
prefix='/usr/local'
program_transform_name='s,x,x,'
sbindir='${exec_prefix}/sbin'
sharedstatedir='${prefix}/com'
sysconfdir='${prefix}/etc'
target_alias=''
## ----------- ##
## confdefs.h. ##
## ----------- ##
#define HAVE_ALLOCA_H 1
#define HAVE_DIRENT_H 1
#define HAVE_DLFCN_H 1
#define HAVE_INTTYPES_H 1
#define HAVE_LIMITS_H 1
#define HAVE_MEMORY_H 1
#define HAVE_STDARG_H 1
#define HAVE_STDARG_H 1
#define HAVE_STDINT_H 1
#define HAVE_STDLIB_H 1
#define HAVE_STRINGS_H 1
#define HAVE_STRING_H 1
#define HAVE_SYS_STAT_H 1
#define HAVE_SYS_TYPES_H 1
#define HAVE_UNISTD_H 1
#define HAVE_UNISTD_H 1
#define HAVE_UTIME_H 1
#define PACKAGE_BUGREPORT ""
#define PACKAGE_NAME ""
#define PACKAGE_STRING ""
#define PACKAGE_TARNAME ""
#define PACKAGE_VERSION ""
#define PTHREADS 1
#define STDC_HEADERS 1
#endif
#ifdef __cplusplus
extern "C" void std::exit (int) throw (); using std::exit;
configure: exit 0