All pastes #249385 Raw Edit

pwc.10.0.12-rc1.tar.

public text v1 · immutable
#249385 ·published 2006-11-15 18:58 UTC
rendered paste body
[vass@localhost ~]$ tar xvjf pwc10.0.12.tar.bz2
tar: pwc10.0.12.tar.bz2: ne peut open: Aucun fichier ou répertoire de ce type
tar: Erreur non récupérable: fin de l'exécution immédiate
tar: Child returned status 2
tar: Statut d'erreur reporté d'erreurs précédentes.
[vass@localhost ~]$ tar xvjf pwc-10.0.12-rc1.tar.bz2
pwc-10.0.12-rc1/
pwc-10.0.12-rc1/pwc-dec1.c
pwc-10.0.12-rc1/pwc.h
pwc-10.0.12-rc1/pwc-uncompress.c
pwc-10.0.12-rc1/pwc-ioctl.h
pwc-10.0.12-rc1/pwc-nala.h
pwc-10.0.12-rc1/pwc-dec1.h
pwc-10.0.12-rc1/pwc-timon.c
pwc-10.0.12-rc1/pwc-kiara.c
pwc-10.0.12-rc1/pwc-timon.h
pwc-10.0.12-rc1/pwc-misc.c
pwc-10.0.12-rc1/pwc-kiara.h
pwc-10.0.12-rc1/pwc-dec23.c
pwc-10.0.12-rc1/pwc-if.c
pwc-10.0.12-rc1/pwc-uncompress.h
pwc-10.0.12-rc1/pwc-ctrl.c
pwc-10.0.12-rc1/Makefile
pwc-10.0.12-rc1/pwc-dec23.h
pwc-10.0.12-rc1/pwc-v4l.c
[vass@localhost ~]$ cd pwc-10.0.12-rc1.tar.bz2
bash: cd: pwc-10.0.12-rc1.tar.bz2: N'est pas un répertoire
[vass@localhost ~]$ cd pwc-10.0.12-rc1
[vass@localhost pwc-10.0.12-rc1]$ make
make -C /lib/modules/2.6.18-1.2849.fc6/source SUBDIRS=/home/vass/pwc-10.0.12-rc1 modules
make[1]: entrant dans le répertoire « /usr/src/kernels/2.6.18-1.2849.fc6-i686 »
  CC [M]  /home/vass/pwc-10.0.12-rc1/pwc-if.o
Dans le fichier inclus à partir de /home/vass/pwc-10.0.12-rc1/pwc-if.c:69:
/home/vass/pwc-10.0.12-rc1/pwc.h:28:26: erreur: linux/config.h : Aucun fichier ou répertoire de ce type
/home/vass/pwc-10.0.12-rc1/pwc-if.c:166: erreur: variable ‘pwc_template’ has initializer but incomplete type
/home/vass/pwc-10.0.12-rc1/pwc-if.c:167: erreur: unknown field ‘owner’ specified in initializer
/home/vass/pwc-10.0.12-rc1/pwc-if.c:167: attention : éléments en excès dans l'initialisation de la structure
/home/vass/pwc-10.0.12-rc1/pwc-if.c:167: attention : (near initialization for ‘pwc_template’)
/home/vass/pwc-10.0.12-rc1/pwc-if.c:168: erreur: unknown field ‘name’ specified in initializer
/home/vass/pwc-10.0.12-rc1/pwc-if.c:168: attention : éléments en excès dans l'initialisation de la structure
/home/vass/pwc-10.0.12-rc1/pwc-if.c:168: attention : (near initialization for ‘pwc_template’)
/home/vass/pwc-10.0.12-rc1/pwc-if.c:169: erreur: unknown field ‘type’ specified in initializer
/home/vass/pwc-10.0.12-rc1/pwc-if.c:169: attention : éléments en excès dans l'initialisation de la structure
/home/vass/pwc-10.0.12-rc1/pwc-if.c:169: attention : (near initialization for ‘pwc_template’)
/home/vass/pwc-10.0.12-rc1/pwc-if.c:170: erreur: unknown field ‘hardware’ specified in initializer
/home/vass/pwc-10.0.12-rc1/pwc-if.c:170: attention : éléments en excès dans l'initialisation de la structure
/home/vass/pwc-10.0.12-rc1/pwc-if.c:170: attention : (near initialization for ‘pwc_template’)
/home/vass/pwc-10.0.12-rc1/pwc-if.c:171: erreur: unknown field ‘release’ specified in initializer
/home/vass/pwc-10.0.12-rc1/pwc-if.c:171: erreur: ‘video_device_release’ undeclared here (not in a function)
/home/vass/pwc-10.0.12-rc1/pwc-if.c:171: attention : éléments en excès dans l'initialisation de la structure
/home/vass/pwc-10.0.12-rc1/pwc-if.c:171: attention : (near initialization for ‘pwc_template’)
/home/vass/pwc-10.0.12-rc1/pwc-if.c:172: erreur: unknown field ‘fops’ specified in initializer
/home/vass/pwc-10.0.12-rc1/pwc-if.c:172: attention : éléments en excès dans l'initialisation de la structure
/home/vass/pwc-10.0.12-rc1/pwc-if.c:172: attention : (near initialization for ‘pwc_template’)
/home/vass/pwc-10.0.12-rc1/pwc-if.c:173: erreur: unknown field ‘minor’ specified in initializer
/home/vass/pwc-10.0.12-rc1/pwc-if.c:173: attention : éléments en excès dans l'initialisation de la structure
/home/vass/pwc-10.0.12-rc1/pwc-if.c:173: attention : (near initialization for ‘pwc_template’)
/home/vass/pwc-10.0.12-rc1/pwc-if.c: In function ‘cd_to_pwc’:
/home/vass/pwc-10.0.12-rc1/pwc-if.c:1019: erreur: implicit declaration of function ‘to_video_device’
/home/vass/pwc-10.0.12-rc1/pwc-if.c:1019: attention : initialization makes pointer from integer without a cast
/home/vass/pwc-10.0.12-rc1/pwc-if.c:1020: erreur: implicit declaration of function ‘video_get_drvdata’
/home/vass/pwc-10.0.12-rc1/pwc-if.c:1020: attention : return makes pointer from integer without a cast
/home/vass/pwc-10.0.12-rc1/pwc-if.c: In function ‘pwc_create_sysfs_files’:
/home/vass/pwc-10.0.12-rc1/pwc-if.c:1062: attention : initialization makes pointer from integer without a cast
/home/vass/pwc-10.0.12-rc1/pwc-if.c:1064: erreur: implicit declaration of function ‘video_device_create_file’
/home/vass/pwc-10.0.12-rc1/pwc-if.c: In function ‘pwc_remove_sysfs_files’:
/home/vass/pwc-10.0.12-rc1/pwc-if.c:1070: attention : initialization makes pointer from integer without a cast
/home/vass/pwc-10.0.12-rc1/pwc-if.c:1072: erreur: implicit declaration of function ‘video_device_remove_file’
/home/vass/pwc-10.0.12-rc1/pwc-if.c: In function ‘pwc_video_open’:
/home/vass/pwc-10.0.12-rc1/pwc-if.c:1112: erreur: implicit declaration of function ‘video_devdata’
/home/vass/pwc-10.0.12-rc1/pwc-if.c:1112: attention : initialization makes pointer from integer without a cast
/home/vass/pwc-10.0.12-rc1/pwc-if.c:1117: erreur: déréférencement d'un pointeur de type incomplet
/home/vass/pwc-10.0.12-rc1/pwc-if.c: In function ‘pwc_video_close’:
/home/vass/pwc-10.0.12-rc1/pwc-if.c:1231: erreur: déréférencement d'un pointeur de type incomplet
/home/vass/pwc-10.0.12-rc1/pwc-if.c: In function ‘pwc_video_read’:
/home/vass/pwc-10.0.12-rc1/pwc-if.c:1292: erreur: déréférencement d'un pointeur de type incomplet
/home/vass/pwc-10.0.12-rc1/pwc-if.c: In function ‘pwc_video_poll’:
/home/vass/pwc-10.0.12-rc1/pwc-if.c:1359: erreur: déréférencement d'un pointeur de type incomplet
/home/vass/pwc-10.0.12-rc1/pwc-if.c: In function ‘pwc_video_ioctl’:
/home/vass/pwc-10.0.12-rc1/pwc-if.c:1375: erreur: implicit declaration of function ‘video_usercopy’
/home/vass/pwc-10.0.12-rc1/pwc-if.c: In function ‘pwc_video_mmap’:
/home/vass/pwc-10.0.12-rc1/pwc-if.c:1388: erreur: déréférencement d'un pointeur de type incomplet
/home/vass/pwc-10.0.12-rc1/pwc-if.c: In function ‘usb_pwc_probe’:
/home/vass/pwc-10.0.12-rc1/pwc-if.c:1722: erreur: implicit declaration of function ‘video_device_alloc’
/home/vass/pwc-10.0.12-rc1/pwc-if.c:1722: attention : assignment makes pointer from integer without a cast
/home/vass/pwc-10.0.12-rc1/pwc-if.c:1729: erreur: invalid application of ‘sizeof’ to incomplete type ‘struct video_device’ 
/home/vass/pwc-10.0.12-rc1/pwc-if.c:1729: erreur: invalid application of ‘sizeof’ to incomplete type ‘struct video_device’ 
/home/vass/pwc-10.0.12-rc1/pwc-if.c:1729: erreur: invalid application of ‘sizeof’ to incomplete type ‘struct video_device’ 
/home/vass/pwc-10.0.12-rc1/pwc-if.c:1730: erreur: déréférencement d'un pointeur de type incomplet
/home/vass/pwc-10.0.12-rc1/pwc-if.c:1731: erreur: déréférencement d'un pointeur de type incomplet
/home/vass/pwc-10.0.12-rc1/pwc-if.c:1732: erreur: déréférencement d'un pointeur de type incomplet
/home/vass/pwc-10.0.12-rc1/pwc-if.c:1733: erreur: implicit declaration of function ‘video_set_drvdata’
/home/vass/pwc-10.0.12-rc1/pwc-if.c:1756: erreur: déréférencement d'un pointeur de type incomplet
/home/vass/pwc-10.0.12-rc1/pwc-if.c:1757: erreur: implicit declaration of function ‘video_register_device’
/home/vass/pwc-10.0.12-rc1/pwc-if.c:1757: erreur: ‘VFL_TYPE_GRABBER’ undeclared (first use in this function)
/home/vass/pwc-10.0.12-rc1/pwc-if.c:1757: erreur: (Each undeclared identifier is reported only once
/home/vass/pwc-10.0.12-rc1/pwc-if.c:1757: erreur: for each function it appears in.)
/home/vass/pwc-10.0.12-rc1/pwc-if.c:1760: erreur: implicit declaration of function ‘video_device_release’
/home/vass/pwc-10.0.12-rc1/pwc-if.c:1765: erreur: déréférencement d'un pointeur de type incomplet
/home/vass/pwc-10.0.12-rc1/pwc-if.c: In function ‘usb_pwc_disconnect’:
/home/vass/pwc-10.0.12-rc1/pwc-if.c:1819: erreur: implicit declaration of function ‘video_unregister_device’
make[2]: *** [/home/vass/pwc-10.0.12-rc1/pwc-if.o] Erreur 1
make[1]: *** [_module_/home/vass/pwc-10.0.12-rc1] Erreur 2
make[1]: quittant le répertoire « /usr/src/kernels/2.6.18-1.2849.fc6-i686 »
make: *** [all] Erreur 2