rendered paste body -Wno-long-long -Wundef -ansi -D_XOPEN_SOURCE=500 -D_BSD_SOURCE -Wcast-align -Wconversion -Wchar-subscripts -Wall -W -Wpointer-arith -DNDEBUG -DNO_DEBUG -O2 -O2 -pipe -march=k8 -fomit-frame-pointer -ftracer -fweb -msse3 -falign-functions=64 -Wformat-security -Wmissing-format-attribute -Wno-non-virtual-dtor -fno-exceptions -fno-check-new -fno-common -DQT_CLEAN_NAMESPACE -DQT_NO_ASCII_CAST -DQT_NO_STL -DQT_NO_COMPAT -DQT_NO_TRANSLATION -c -o kspell_hspelldict.lo kspell_hspelldict.cpp
/bin/sh ../../../libtool --silent --tag=CXX --mode=compile x86_64-pc-linux-gnu-g++ -DHAVE_CONFIG_H -I. -I. -I../../.. -I../../../dcop -I../../../kdecore -I../../../kio/kssl -I../../../kjs -I../../../kspell2 -I../../.. -I../../../dcop -I../../../libltdl -I../../../kdefx -I../../../kdecore -I../../../kdecore -I../../../kdecore/network -I../../../kdeui -I../../../kio -I../../../kio/kio -I../../../kio/kfile -I../../.. -I/usr/qt/3/include -I. -I/usr/kde/3.5/include -DQT_THREAD_SUPPORT -D_REENTRANT -Wno-long-long -Wundef -ansi -D_XOPEN_SOURCE=500 -D_BSD_SOURCE -Wcast-align -Wconversion -Wchar-subscripts -Wall -W -Wpointer-arith -DNDEBUG -DNO_DEBUG -O2 -O2 -pipe -march=k8 -fomit-frame-pointer -ftracer -fweb -msse3 -falign-functions=64 -Wformat-security -Wmissing-format-attribute -Wno-non-virtual-dtor -fno-exceptions -fno-check-new -fno-common -DQT_CLEAN_NAMESPACE -DQT_NO_ASCII_CAST -DQT_NO_STL -DQT_NO_COMPAT -DQT_NO_TRANSLATION -c -o kspell_hspellclient.lo kspell_hspellclient.cpp
kspell_hspelldict.cpp:88: warning: unused parameter 'bad'
kspell_hspelldict.cpp:88: warning: unused parameter 'good'
kspell_hspelldict.cpp:95: warning: unused parameter 'word'
kspell_hspelldict.cpp:102: warning: unused parameter 'word'
/bin/sh ../../../libtool --silent --tag=CXX --mode=link x86_64-pc-linux-gnu-g++ -Wno-long-long -Wundef -ansi -D_XOPEN_SOURCE=500 -D_BSD_SOURCE -Wcast-align -Wconversion -Wchar-subscripts -Wall -W -Wpointer-arith -DNDEBUG -DNO_DEBUG -O2 -O2 -pipe -march=k8 -fomit-frame-pointer -ftracer -fweb -msse3 -falign-functions=64 -Wformat-security -Wmissing-format-attribute -Wno-non-virtual-dtor -fno-exceptions -fno-check-new -fno-common -DQT_CLEAN_NAMESPACE -DQT_NO_ASCII_CAST -DQT_NO_STL -DQT_NO_COMPAT -DQT_NO_TRANSLATION -o kspell_hspell.la -rpath /usr/kde/3.5/lib64/kde3 -module -no-undefined -Wl,--no-undefined -Wl,--allow-shlib-undefined -avoid-version -module -no-undefined -Wl,--no-undefined -Wl,--allow-shlib-undefined -R /usr/kde/3.5/lib64 -R /usr/kde/3.5/lib64 -R /usr/qt/3/lib64 -R /usr/lib64 kspell_hspellclient.lo kspell_hspelldict.lo ../../ui/libkspell2.la -lhspell -lz
/usr/lib/gcc/x86_64-pc-linux-gnu/4.1.1/../../../../x86_64-pc-linux-gnu/bin/ld: /usr/X11R6/lib64/libhspell.a(gimatria.o): relocation R_X86_64_32S against `a local symbol' can not be used when making a shared object; recompile with -fPIC
/usr/X11R6/lib64/libhspell.a: could not read symbols: Bad value
collect2: ld returned 1 exit status
make[4]: *** [kspell_hspell.la] Error 1
make[4]: Leaving directory `/var/tmp/portage/kdelibs-3.5.5-r5/work/kdelibs-3.5.5/kspell2/plugins/hspell'
make[3]: *** [all-recursive] Error 1
make[3]: Leaving directory `/var/tmp/portage/kdelibs-3.5.5-r5/work/kdelibs-3.5.5/kspell2/plugins'
make[2]: *** [all-recursive] Error 1
make[2]: Leaving directory `/var/tmp/portage/kdelibs-3.5.5-r5/work/kdelibs-3.5.5/kspell2'
make[1]: *** [all-recursive] Error 1
make[1]: Leaving directory `/var/tmp/portage/kdelibs-3.5.5-r5/work/kdelibs-3.5.5'
make: *** [all] Error 2
!!! ERROR: kde-base/kdelibs-3.5.5-r5 failed.
Call stack:
ebuild.sh, line 1546: Called dyn_compile
ebuild.sh, line 937: Called src_compile
kdelibs-3.5.5-r5.ebuild, line 134: Called kde_src_compile
kde.eclass, line 172: Called kde_src_compile 'all'
kde.eclass, line 342: Called kde_src_compile 'myconf' 'configure' 'make'
kde.eclass, line 338: Called die
!!! died running emake, kde_src_compile:make
!!! If you need support, post the topmost build error, and the call stack if relevant.