All pastes #249092 Raw Edit

Someone

public text v1 · immutable
#249092 ·published 2006-11-15 12:25 UTC
rendered paste body
In file included from pgmrendersink.c:19:
pgmrendersink.h:25:29: error: gst/video/video.h: No such file or directory
pgmrendersink.h:26:36: error: gst/video/gstvideosink.h: No such file or directory
In file included from pgmrendersink.c:19:
pgmrendersink.h:40: error: expected specifier-qualifier-list before 'GstVideoSink'
pgmrendersink.h:54: error: expected specifier-qualifier-list before 'GstVideoSinkClass'
pgmrendersink.c:28: error: 'GST_VIDEO_CAPS_RGB' undeclared here (not in a function)
pgmrendersink.c:41: error: expected ')' before '*' token
pgmrendersink.c:42: error: expected ')' before '*' token
pgmrendersink.c:47: error: expected ')' before '*' token
pgmrendersink.c:48: error: expected ')' before '*' token
pgmrendersink.c:50: error: expected '=', ',', ';', 'asm' or '__attribute__' before '*' token
pgmrendersink.c: In function 'pgm_render_sink_set_property':
pgmrendersink.c:64: error: 'PgmRenderSink' has no member named 'drawable'
pgmrendersink.c: In function 'pgm_render_sink_get_property':
pgmrendersink.c:84: error: 'PgmRenderSink' has no member named 'drawable'
pgmrendersink.c: In function 'pgm_render_sink_class_init':
pgmrendersink.c:108: error: 'GstBaseSinkClass' undeclared (first use in this function)
pgmrendersink.c:108: error: (Each undeclared identifier is reported only once
pgmrendersink.c:108: error: for each function it appears in.)
pgmrendersink.c:108: error: 'gstbasesink_class' undeclared (first use in this function)
pgmrendersink.c:112: error: expected expression before ')' token
pgmrendersink.c:114: error: 'parent_class' undeclared (first use in this function)
pgmrendersink.c:131: error: 'pgm_render_sink_getcaps' undeclared (first use in this function)
pgmrendersink.c:132: error: 'pgm_render_sink_setcaps' undeclared (first use in this function)
pgmrendersink.c:133: error: 'pgm_render_sink_get_times' undeclared (first use in this function)
pgmrendersink.c:134: error: 'pgm_render_sink_show' undeclared (first use in this function)
pgmrendersink.c: In function 'pgm_render_sink_init':
pgmrendersink.c:141: error: 'PgmRenderSink' has no member named 'time'
pgmrendersink.c:142: error: 'PgmRenderSink' has no member named 'framerate_n'
pgmrendersink.c:143: error: 'PgmRenderSink' has no member named 'framerate_d'
pgmrendersink.c:144: error: 'PgmRenderSink' has no member named 'width'
pgmrendersink.c:145: error: 'PgmRenderSink' has no member named 'height'
pgmrendersink.c:146: error: 'PgmRenderSink' has no member named 'mutex'
pgmrendersink.c:147: error: 'PgmRenderSink' has no member named 'drawable'
pgmrendersink.c: In function 'pgm_render_sink_finalize':
pgmrendersink.c:161: error: 'PgmRenderSink' has no member named 'mutex'
pgmrendersink.c: At top level:
pgmrendersink.c:165: error: expected ')' before '*' token
pgmrendersink.c:185: error: expected ')' before '*' token
pgmrendersink.c:210: error: expected ')' before '*' token
pgmrendersink.c:222: error: expected ')' before '*' token
pgmrendersink.c: In function 'pgm_render_sink_change_state':
pgmrendersink.c:250: error: 'PgmRenderSink' has no member named 'time'
pgmrendersink.c:256: error: 'parent_class' undeclared (first use in this function)
pgmrendersink.c: In function 'pgm_render_sink_get_type':
pgmrendersink.c:279: error: 'GST_TYPE_VIDEO_SINK' undeclared (first use in this function)
make[6]: *** [libpgmrendersink_la-pgmrendersink.lo] Error 1
make[6]: Leaving directory `/home/fuzzy/Desktop/pigment-0.1.0/pigment/libs/pgm/render/render'
make[5]: *** [all] Error 2
make[5]: Leaving directory `/home/fuzzy/Desktop/pigment-0.1.0/pigment/libs/pgm/render/render'
make[4]: *** [all-recursive] Error 1
make[4]: Leaving directory `/home/fuzzy/Desktop/pigment-0.1.0/pigment/libs/pgm/render'
make[3]: *** [all-recursive] Error 1
make[3]: Leaving directory `/home/fuzzy/Desktop/pigment-0.1.0/pigment/libs/pgm'
make[2]: *** [all-recursive] Error 1
make[2]: Leaving directory `/home/fuzzy/Desktop/pigment-0.1.0/pigment/libs'
make[1]: *** [all-recursive] Error 1
make[1]: Leaving directory `/home/fuzzy/Desktop/pigment-0.1.0/pigment'
make: *** [all] Error 2