All pastes #248964 Raw Edit

Stuff

public text v1 · immutable
#248964 ·published 2006-11-15 06:08 UTC
rendered paste body
lontra@debian:~/GNUMail$ make
Making all in Framework/GNUMail...
make[1]: Entering directory `/home/lontra/GNUMail/Framework/GNUMail'
Making build-headers for framework GNUMail...
Making all for framework GNUMail...
 Compiling file AboutPanel.m ...
In file included from AboutPanel.m:23:
AboutPanel.h:26:26: warning: AppKit/AppKit.h: No such file or directory
In file included from AboutPanel.m:23:
AboutPanel.h:30: error: cannot find interface declaration for ‘NSPanel’, supercl
ass of ‘AboutPanel’
In file included from AboutPanel.m:25:
Constants.h:224: error: expected ‘=’, ‘,’, ‘;’, ‘asm’ or ‘__attribute__’ before 
‘*’ token
Constants.h:225: error: expected ‘=’, ‘,’, ‘;’, ‘asm’ or ‘__attribute__’ before 
‘*’ token
Constants.h:226: error: expected ‘=’, ‘,’, ‘;’, ‘asm’ or ‘__attribute__’ before 
‘*’ token
Constants.h:227: error: expected ‘=’, ‘,’, ‘;’, ‘asm’ or ‘__attribute__’ before 
‘*’ token
Constants.h:228: error: expected ‘=’, ‘,’, ‘;’, ‘asm’ or ‘__attribute__’ before 
‘*’ token
Constants.h:229: error: expected ‘=’, ‘,’, ‘;’, ‘asm’ or ‘__attribute__’ before 
‘*’ token
Constants.h:230: error: expected ‘=’, ‘,’, ‘;’, ‘asm’ or ‘__attribute__’ before 
‘*’ token
Constants.h:235: error: expected ‘=’, ‘,’, ‘;’, ‘asm’ or ‘__attribute__’ before 
‘*’ token
Constants.h:236: error: expected ‘=’, ‘,’, ‘;’, ‘asm’ or ‘__attribute__’ before 
‘*’ token
Constants.h:237: error: expected ‘=’, ‘,’, ‘;’, ‘asm’ or ‘__attribute__’ before 
‘*’ token
Constants.h:238: error: expected ‘=’, ‘,’, ‘;’, ‘asm’ or ‘__attribute__’ before 
‘*’ token
Constants.h:239: error: expected ‘=’, ‘,’, ‘;’, ‘asm’ or ‘__attribute__’ before 
‘*’ token
Constants.h:240: error: expected ‘=’, ‘,’, ‘;’, ‘asm’ or ‘__attribute__’ before 
‘*’ token
Constants.h:241: error: expected ‘=’, ‘,’, ‘;’, ‘asm’ or ‘__attribute__’ before 
‘*’ token
Constants.h:242: error: expected ‘=’, ‘,’, ‘;’, ‘asm’ or ‘__attribute__’ before 
‘*’ token
Constants.h:243: error: expected ‘=’, ‘,’, ‘;’, ‘asm’ or ‘__attribute__’ before 
‘*’ token
Constants.h:244: error: expected ‘=’, ‘,’, ‘;’, ‘asm’ or ‘__attribute__’ before 
‘*’ token
Constants.h:245: error: expected ‘=’, ‘,’, ‘;’, ‘asm’ or ‘__attribute__’ before 
‘*’ token
Constants.h:246: error: expected ‘=’, ‘,’, ‘;’, ‘asm’ or ‘__attribute__’ before 
‘*’ token
Constants.h:247: error: expected ‘=’, ‘,’, ‘;’, ‘asm’ or ‘__attribute__’ before 
‘*’ token
Constants.h:248: error: expected ‘=’, ‘,’, ‘;’, ‘asm’ or ‘__attribute__’ before 
‘*’ token
Constants.h:253: error: expected ‘=’, ‘,’, ‘;’, ‘asm’ or ‘__attribute__’ before 
‘*’ token
In file included from AboutPanel.m:26:
LabelWidget.h:31: error: cannot find interface declaration for ‘NSTextField’, su
perclass of ‘LabelWidget’
LabelWidget.h:31: error: expected ‘)’ before ‘NSRect’
LabelWidget.h:32: error: expected ‘)’ before ‘NSRect’
LabelWidget.h:32: error: expected ‘)’ before ‘NSString’
LabelWidget.h:34: error: expected ‘)’ before ‘NSRect’
LabelWidget.h:34: error: expected ‘)’ before ‘NSString’
LabelWidget.h:35: error: expected ‘)’ before ‘NSRect’
LabelWidget.h:35: error: expected ‘)’ before ‘NSString’
In file included from AboutPanel.m:27:
Utilities.h:28:35: warning: Pantomime/CWConstants.h: No such file or directory
Utilities.h:29:31: warning: Pantomime/CWStore.h: No such file or directory
In file included from AboutPanel.m:27:
Utilities.h:44: error: expected ‘=’, ‘,’, ‘;’, ‘asm’ or ‘__attribute__’ before ‘
CompareVersion’
Utilities.h:45: error: expected ‘=’, ‘,’, ‘;’, ‘asm’ or ‘__attribute__’ before ‘
*’ token
Utilities.h:46: error: expected ‘=’, ‘,’, ‘;’, ‘asm’ or ‘__attribute__’ before ‘
*’ token
Utilities.h:47: error: expected ‘=’, ‘,’, ‘;’, ‘asm’ or ‘__attribute__’ before ‘
*’ token
Utilities.h:54: error: cannot find interface declaration for ‘NSObject’, supercl
ass of ‘Utilities’
Utilities.h:54: error: expected ‘)’ before ‘NSString’
Utilities.h:54: error: expected ‘)’ before ‘NSString’
Utilities.h:55: error: expected ‘)’ before ‘NSString’
Utilities.h:56: error: expected ‘)’ before ‘NSString’
Utilities.h:56: error: expected ‘)’ before ‘NSString’
Utilities.h:57: error: expected ‘)’ before ‘NSString’
Utilities.h:63: error: expected ‘)’ before ‘NSPopUpButton’
Utilities.h:64: error: expected ‘)’ before ‘NSString’
Utilities.h:65: error: expected ‘)’ before ‘NSPopUpButton’
Utilities.h:71: error: expected ‘)’ before ‘NSString’
Utilities.h:72: error: expected ‘)’ before ‘NSString’
Utilities.h:74: error: expected ‘)’ before ‘NSString’
Utilities.h:74: error: expected ‘)’ before ‘NSString’
Utilities.h:75: error: expected ‘)’ before ‘NSString’
Utilities.h:77: error: expected ‘)’ before ‘NSDictionary’
Utilities.h:79: error: expected ‘)’ before ‘NSString’
Utilities.h:81: error: expected ‘)’ before ‘NSString’
Utilities.h:82: error: cannot find protocol declaration for ‘CWStore’
Utilities.h:84: error: expected ‘)’ before ‘NSString’
Utilities.h:88: error: expected ‘)’ before ‘NSEnumerator’
Utilities.h:92: error: expected ‘)’ before ‘NSString’
Utilities.h:95: error: expected ‘)’ before ‘NSString’
Utilities.h:98: error: expected ‘)’ before ‘NSString’Utilities.h:98: error: expected ‘)’ before ‘NSString’
Utilities.h:98: error: expected ‘)’ before ‘NSString’
Utilities.h:102: error: expected ‘)’ before ‘NSString’
Utilities.h:103: error: expected ‘)’ before ‘NSString’
Utilities.h:104: error: expected ‘)’ before ‘NSString’
Utilities.h:106: error: expected ‘)’ before ‘BOOL’
Utilities.h:106: error: expected ‘)’ before ‘NSString’
Utilities.h:109: error: expected ‘)’ before ‘BOOL’
Utilities.h:109: error: expected ‘)’ before ‘NSString’
Utilities.h:110: error: expected ‘)’ before ‘NSString’
Utilities.h:111: error: expected ‘)’ before ‘NSString’
Utilities.h:112: error: expected ‘)’ before ‘NSString’
Utilities.h:113: error: expected ‘)’ before ‘NSString’
Utilities.h:114: error: expected ‘)’ before ‘NSString’
Utilities.h:116: error: expected ‘)’ before ‘NSDictionary’
Utilities.h:118: error: expected ‘)’ before ‘NSMenu’
Utilities.h:120: error: expected ‘)’ before ‘SEL’
Utilities.h:123: error: expected ‘)’ before ‘NSPopUpButton’
Utilities.h:128: error: expected ‘)’ before ‘SEL’
Utilities.h:129: error: expected ‘)’ before ‘NSMenu’
Utilities.h:134: error: expected ‘)’ before ‘SEL’
Utilities.h:135: error: expected ‘)’ before ‘NSMenu’
Utilities.h:138: error: expected ‘)’ before ‘NSPopUpButton’
Utilities.h:140: error: expected ‘)’ before ‘NSString’
Utilities.h:142: error: expected ‘)’ before ‘NSPopUpButton’
Utilities.h:143: error: expected ‘)’ before ‘NSString’
Utilities.h:145: error: expected ‘)’ before ‘NSString’
Utilities.h:147: error: expected ‘)’ before ‘BOOL’
Utilities.h:149: error: expected ‘)’ before ‘NSMutableDictionary’
Utilities.h:153: error: expected ‘)’ before ‘PantomimeReplyMode’
Utilities.h:156: error: expected ‘)’ before ‘PantomimeForwardMode’
Utilities.h:159: error: expected ‘)’ before ‘NSTextView’
Utilities.h:160: error: expected ‘)’ before ‘BOOL’
Utilities.h:163: error: expected ‘)’ before ‘NSTextView’
Utilities.h:165: error: cannot find protocol declaration for ‘NSTextAttachmentCe
ll’
Utilities.h:166: error: expected ‘)’ before ‘NSRect’
AboutPanel.m: In function ‘-[AboutPanel layoutWindow]’:
AboutPanel.m:37: error: ‘NSButton’ undeclared (first use in this function)
AboutPanel.m:37: error: (Each undeclared identifier is reported only once
AboutPanel.m:37: error: for each function it appears in.)
AboutPanel.m:37: error: ‘icon’ undeclared (first use in this function)
AboutPanel.m:39: error: ‘NSColor’ undeclared (first use in this function)
AboutPanel.m:39: warning: ‘AboutPanel’ may not respond to ‘-setBackgroundColor:’
AboutPanel.m:39: warning: (Messages without a matching method signature
AboutPanel.m:39: warning: will be assumed to return ‘id’ and accept
AboutPanel.m:39: warning: ‘...’ as arguments.)
AboutPanel.m:41: warning: implicit declaration of function ‘NSMakeRect’
AboutPanel.m:42: error: ‘NSImageOnly’ undeclared (first use in this function)
AboutPanel.m:43: error: ‘NSImage’ undeclared (first use in this function)
AboutPanel.m:43: error: cannot find interface declaration for ‘NXConstantString’
AboutPanel.m:47: warning: ‘AboutPanel’ may not respond to ‘-contentView’
AboutPanel.m:47: warning: no ‘-addSubview:’ method found
AboutPanel.m:48: warning: implicit declaration of function ‘RELEASE’
AboutPanel.m:55: error: ‘NSLeftTextAlignment’ undeclared (first use in this func
tion)
AboutPanel.m:55: warning: passing argument 1 of ‘labelWidgetWithFrame:label:alig
nment:’ makes pointer from integer without a cast
AboutPanel.m:56: error: ‘NSFont’ undeclared (first use in this function)
AboutPanel.m:56: warning: ‘LabelWidget’ may not respond to ‘-setFont:’
AboutPanel.m:57: warning: ‘AboutPanel’ may not respond to ‘-contentView’
AboutPanel.m:57: warning: no ‘-addSubview:’ method found
AboutPanel.m:64: warning: implicit declaration of function ‘_’
AboutPanel.m:65: warning: passing argument 1 of ‘labelWidgetWithFrame:label:alig
nment:’ makes pointer from integer without a cast
AboutPanel.m:65: warning: passing argument 2 of ‘labelWidgetWithFrame:label:alig
nment:’ makes pointer from integer without a cast
AboutPanel.m:66: warning: ‘LabelWidget’ may not respond to ‘-setFont:’
AboutPanel.m:67: warning: ‘AboutPanel’ may not respond to ‘-contentView’
AboutPanel.m:67: warning: no ‘-addSubview:’ method found
AboutPanel.m:71: warning: passing argument 1 of ‘labelWidgetWithFrame:label:alig
nment:’ makes pointer from integer without a cast
AboutPanel.m:72: warning: ‘AboutPanel’ may not respond to ‘-contentView’
AboutPanel.m:72: warning: no ‘-addSubview:’ method found
AboutPanel.m:79: warning: passing argument 1 of ‘labelWidgetWithFrame:label:alig
nment:’ makes pointer from integer without a cast
AboutPanel.m:79: warning: passing argument 2 of ‘labelWidgetWithFrame:label:alig
nment:’ makes pointer from integer without a cast
AboutPanel.m:80: warning: ‘LabelWidget’ may not respond to ‘-setFont:’
AboutPanel.m:81: warning: ‘AboutPanel’ may not respond to ‘-contentView’
AboutPanel.m:81: warning: no ‘-addSubview:’ method found
AboutPanel.m:85: warning: passing argument 1 of ‘labelWidgetWithFrame:label:alig
nment:’ makes pointer from integer without a cast
AboutPanel.m:86: warning: ‘AboutPanel’ may not respond to ‘-contentView’
AboutPanel.m:86: warning: no ‘-addSubview:’ method found
AboutPanel.m:94: warning: passing argument 1 of ‘labelWidgetWithFrame:label:alig
nment:’ makes pointer from integer without a cast
AboutPanel.m:94: warning: passing argument 2 of ‘labelWidgetWithFrame:label:alig
nment:’ makes pointer from integer without a cast
AboutPanel.m:95: warning: ‘LabelWidget’ may not respond to ‘-setFont:’
AboutPanel.m:96: warning: ‘AboutPanel’ may not respond to ‘-contentView’
AboutPanel.m:96: warning: no ‘-addSubview:’ method found
AboutPanel.m:100: warning: passing argument 1 of ‘labelWidgetWithFrame:label:ali
gnment:’ makes pointer from integer without a cast
AboutPanel.m:101: warning: ‘AboutPanel’ may not respond to ‘-contentView’
AboutPanel.m:101: warning: no ‘-addSubview:’ method found
AboutPanel.m:107: error: ‘NSString’ undeclared (first use in this function)
AboutPanel.m:107: warning: implicit declaration of function ‘GNUMailVersion’
AboutPanel.m:108: warning: passing argument 1 of ‘labelWidgetWithFrame:label:ali



AboutPanel.m:66: warning: ‘LabelWidget’ may not respond to ‘-setFont:’
AboutPanel.m:67: warning: ‘AboutPanel’ may not respond to ‘-contentView’
AboutPanel.m:67: warning: no ‘-addSubview:’ method found
AboutPanel.m:71: warning: passing argument 1 of ‘labelWidgetWithFrame:label:alig
nment:’ makes pointer from integer without a cast
AboutPanel.m:72: warning: ‘AboutPanel’ may not respond to ‘-contentView’
AboutPanel.m:72: warning: no ‘-addSubview:’ method found
AboutPanel.m:79: warning: passing argument 1 of ‘labelWidgetWithFrame:label:alig
nment:’ makes pointer from integer without a cast
AboutPanel.m:79: warning: passing argument 2 of ‘labelWidgetWithFrame:label:alig
nment:’ makes pointer from integer without a cast
AboutPanel.m:80: warning: ‘LabelWidget’ may not respond to ‘-setFont:’
AboutPanel.m:81: warning: ‘AboutPanel’ may not respond to ‘-contentView’
AboutPanel.m:81: warning: no ‘-addSubview:’ method found
AboutPanel.m:85: warning: passing argument 1 of ‘labelWidgetWithFrame:label:alig
nment:’ makes pointer from integer without a cast
AboutPanel.m:86: warning: ‘AboutPanel’ may not respond to ‘-contentView’
AboutPanel.m:86: warning: no ‘-addSubview:’ method found
AboutPanel.m:94: warning: passing argument 1 of ‘labelWidgetWithFrame:label:alig
nment:’ makes pointer from integer without a cast
AboutPanel.m:94: warning: passing argument 2 of ‘labelWidgetWithFrame:label:alig
nment:’ makes pointer from integer without a cast
AboutPanel.m:95: warning: ‘LabelWidget’ may not respond to ‘-setFont:’
AboutPanel.m:96: warning: ‘AboutPanel’ may not respond to ‘-contentView’
AboutPanel.m:96: warning: no ‘-addSubview:’ method found
AboutPanel.m:100: warning: passing argument 1 of ‘labelWidgetWithFrame:label:ali
gnment:’ makes pointer from integer without a cast
AboutPanel.m:101: warning: ‘AboutPanel’ may not respond to ‘-contentView’
AboutPanel.m:101: warning: no ‘-addSubview:’ method found
AboutPanel.m:107: error: ‘NSString’ undeclared (first use in this function)
AboutPanel.m:107: warning: implicit declaration of function ‘GNUMailVersion’
AboutPanel.m:108: warning: passing argument 1 of ‘labelWidgetWithFrame:label:ali
gnment:’ makes pointer from integer without a cast
AboutPanel.m:109: warning: ‘LabelWidget’ may not respond to ‘-setTextColor:’
AboutPanel.m:110: warning: ‘AboutPanel’ may not respond to ‘-contentView’
AboutPanel.m:110: warning: no ‘-addSubview:’ method found
AboutPanel.m:114: warning: passing argument 1 of ‘labelWidgetWithFrame:label:ali
gnment:’ makes pointer from integer without a cast
AboutPanel.m:114: warning: passing argument 2 of ‘labelWidgetWithFrame:label:ali
gnment:’ makes pointer from integer without a cast
AboutPanel.m:115: warning: ‘LabelWidget’ may not respond to ‘-setTextColor:’
AboutPanel.m:116: warning: ‘AboutPanel’ may not respond to ‘-contentView’
AboutPanel.m:116: warning: no ‘-addSubview:’ method found
make[2]: *** [shared_obj/AboutPanel.o] Error 1
make[1]: *** [GNUMail.all.framework.variables] Error 2
make[1]: Leaving directory `/home/lontra/GNUMail/Framework/GNUMail'
make: *** [internal-all] Error 2