All pastes #248411 Raw Edit

Unnamed

public text v1 · immutable
#248411 ·published 2006-11-14 17:15 UTC
rendered paste body
[scarolan@sluggo:~/downloads/rtorrent-0.6.4]$ make
cd . && /bin/bash /home/scarolan/downloads/rtorrent-0.6.4/missing --run autoheader
rm -f stamp-h1
touch config.h.in
cd . && /bin/bash ./config.status config.h
config.status: creating config.h
config.status: config.h is unchanged
make  all-recursive
make[1]: Entering directory `/home/scarolan/downloads/rtorrent-0.6.4'
Making all in doc
make[2]: Entering directory `/home/scarolan/downloads/rtorrent-0.6.4/doc'
make[2]: Nothing to be done for `all'.
make[2]: Leaving directory `/home/scarolan/downloads/rtorrent-0.6.4/doc'
Making all in src
make[2]: Entering directory `/home/scarolan/downloads/rtorrent-0.6.4/src'
Making all in core
make[3]: Entering directory `/home/scarolan/downloads/rtorrent-0.6.4/src/core'
if g++ -DHAVE_CONFIG_H -I. -I. -I../.. -I. -I./.. -I../..    -O2 -Wall -g -DDEBUG -I/home/scarolan/slug/optware/staging/opt/include/sigc++-2.0 -I/home/scarolan/slug/optware/staging/opt/lib/sigc++-2.0/include -I/opt/include   -I/opt/include -MT curl_get.o -MD -MP -MF ".deps/curl_get.Tpo" -c -o curl_get.o curl_get.cc; \
        then mv -f ".deps/curl_get.Tpo" ".deps/curl_get.Po"; else rm -f ".deps/curl_get.Tpo"; exit 1; fi
In file included from curl_get.cc:44:
curl_get.h:43:26: torrent/http.h: No such file or directory
curl_get.h:44:27: sigc++/signal.h: No such file or directory
In file included from curl_get.cc:44:
curl_get.h:52: error: `torrent' is not a class or namespace
curl_get.h:52: error: `Http' is not a class or namespace
curl_get.h:52: error: invalid base-class specification
In file included from curl_get.cc:45:
curl_stack.h:42:25: sigc++/slot.h: No such file or directory
In file included from curl_get.cc:45:
curl_stack.h:53: error: ISO C++ forbids declaration of `sigc' with no type
curl_stack.h:53: error: parse error before `::' token
curl_stack.h:66: error: parse error before `)' token
curl_get.cc: In function `size_t core::curl_get_receive_write(void*, unsigned 
   int, unsigned int, void*)':
curl_get.cc:51: error: `stream' undeclared (first use this function)
curl_get.cc:51: error: (Each undeclared identifier is reported only once for 
   each function it appears in.)
curl_get.cc: In member function `void core::CurlGet::start()':
curl_get.cc:79: error: `m_stream' undeclared (first use this function)
curl_get.cc:84: error: `m_url' undeclared (first use this function)
curl_get.cc:88: error: `m_timeout' undeclared (first use this function)
curl_get.cc: In member function `void core::CurlGet::perform(CURLMsg*)':
curl_get.cc:151: error: `m_signalDone' undeclared (first use this function)
curl_get.cc:153: error: `m_signalFailed' undeclared (first use this function)
make[3]: *** [curl_get.o] Error 1
make[3]: Leaving directory `/home/scarolan/downloads/rtorrent-0.6.4/src/core'
make[2]: *** [all-recursive] Error 1
make[2]: Leaving directory `/home/scarolan/downloads/rtorrent-0.6.4/src'
make[1]: *** [all-recursive] Error 1
make[1]: Leaving directory `/home/scarolan/downloads/rtorrent-0.6.4'
make: *** [all] Error 2