rendered paste body fi
if g++ -DHAVE_CONFIG_H -I. -I. -I.. -I/usr/local/lib/wx/include/mac-unicode-release-2.6 -I/usr/local/include/wx-2.6 -D__WXMAC__ -D_FILE_OFFSET_BITS=64 -D_LARGE_FILES -DNO_GCC_PRAGMA -I./libs -DUSE_EMBEDDED_CRYPTO -W -Wall -Wshadow -Wundef -g -ggdb -fno-inline -D__DEBUG__ -fmessage-length=0 -D_GLIBCXX_DEBUG -D_GLIBCXX_DEBUG_PEDANTIC -DUSE_WX_EXTENSIONS -MT libmuleappcommon_a-CryptoPP.o -MD -MP -MF ".deps/libmuleappcommon_a-CryptoPP.Tpo" -c -o libmuleappcommon_a-CryptoPP.o `test -f 'extern/cryptopp/CryptoPP.cpp' || echo './'`extern/cryptopp/CryptoPP.cpp; \
then mv -f ".deps/libmuleappcommon_a-CryptoPP.Tpo" ".deps/libmuleappcommon_a-CryptoPP.Po"; else rm -f ".deps/libmuleappcommon_a-CryptoPP.Tpo"; exit 1; fi
extern/cryptopp/CryptoPP.cpp: In member function `virtual void CryptoPP::InvertibleRSAFunction::GenerateRandom(CryptoPP::RandomNumberGenerator&, const CryptoPP::NameValuePairs&)':
extern/cryptopp/CryptoPP.cpp:7827: error: cannot allocate an object of abstract type 'CryptoPP::NameValuePairs'
extern/cryptopp/CryptoPP.h:606: note: because the following virtual functions are pure within 'CryptoPP::NameValuePairs':
extern/cryptopp/CryptoPP.h:687: note: virtual bool CryptoPP::NameValuePairs::GetVoidValue(const char*, const std::type_info&, void*) const
make[3]: *** [libmuleappcommon_a-CryptoPP.o] Error 1
make[2]: *** [all-recursive] Error 1
make[1]: *** [all-recursive] Error 1
make: *** [all] Error 2