-Wall -Wno-switch -Wdisabled-optimization -Wpointer-arith -Wredundant-decls -O3 -c -o libnut.o libnut.c
In file included from /usr/src/RPM/BUILD/ffmpeg-0.5.0/libavutil/common.h:192,
from /usr/src/RPM/BUILD/ffmpeg-0.5.0/libavutil/avutil.h:44,
from /usr/src/RPM/BUILD/ffmpeg-0.5.0/libavcodec/avcodec.h:34,
from avformat.h:36,
from libnut.c:1:
/usr/src/RPM/BUILD/ffmpeg-0.5.0/libavutil/internal.h:197:1: warning: "sprintf" redefined
In file included from /usr/include/stdio.h:841,
from avformat.h:35,
from libnut.c:1:
/usr/include/bits/stdio2.h:30:1: warning: this is the location of the previous definition
In file included from /usr/src/RPM/BUILD/ffmpeg-0.5.0/libavutil/common.h:192,
from /usr/src/RPM/BUILD/ffmpeg-0.5.0/libavutil/avutil.h:44,
from /usr/src/RPM/BUILD/ffmpeg-0.5.0/libavcodec/avcodec.h:34,
from avformat.h:36,
from libnut.c:1:
/usr/src/RPM/BUILD/ffmpeg-0.5.0/libavutil/internal.h:198:1: warning: "strcat" redefined
In file included from /usr/include/string.h:440,
from /usr/src/RPM/BUILD/ffmpeg-0.5.0/libavutil/common.h:39,
from /usr/src/RPM/BUILD/ffmpeg-0.5.0/libavutil/avutil.h:44,
from /usr/src/RPM/BUILD/ffmpeg-0.5.0/libavcodec/avcodec.h:34,
from avformat.h:36,
from libnut.c:1:
/usr/include/bits/string3.h:164:1: warning: this is the location of the previous definition
In file included from libnut.c:1:
avformat.h:251: warning: 'AVFrac' is deprecated
libnut.c:5:1: warning: "ID_STRING" redefined
In file included from libnut.c:3:
/usr/src/RPM/BUILD/ffmpeg-0.5.0/libavformat/nut.h:36:1: warning: this is the location of the previous definition
libnut.c:9: error: expected specifier-qualifier-list before 'nut_context_t'
libnut.c:11: error: conflicting types for 'NUTContext'
/usr/src/RPM/BUILD/ffmpeg-0.5.0/libavformat/nut.h:88: error: previous declaration of 'NUTContext' was here
libnut.c:21: error: expected '=', ',', ';', 'asm' or '__attribute__' before 'ft_default'
libnut.c: In function 'nut_write_header':
libnut.c:59: error: 'nut_muxer_opts_t' undeclared (first use in this function)
libnut.c:59: error: (Each undeclared identifier is reported only once
libnut.c:59: error: for each function it appears in.)
libnut.c:59: error: expected ';' before 'mopts'
libnut.c:70: error: 'nut_stream_header_t' undeclared (first use in this function)
libnut.c:70: error: 's' undeclared (first use in this function)
libnut.c:71: warning: ISO C90 forbids mixed declarations and code
libnut.c:73: error: 'NUTContext' has no member named 's'
libnut.c:81: error: 'NUT_VIDEO_CLASS' undeclared (first use in this function)
libnut.c:81: error: 'NUT_AUDIO_CLASS' undeclared (first use in this function)
libnut.c:120: error: 'NUTContext' has no member named 'nut'
libnut.c:120: warning: implicit declaration of function 'nut_muxer_init'
libnut.c:120: error: 'mopts' undeclared (first use in this function)
libnut.c:58: warning: unused variable 'bc'
libnut.c: In function 'nut_write_packet':
libnut.c:127: error: 'nut_packet_t' undeclared (first use in this function)
libnut.c:127: error: expected ';' before 'p'
libnut.c:129: error: 'p' undeclared (first use in this function)
libnut.c:132: error: 'NUT_FLAG_KEY' undeclared (first use in this function)
libnut.c:135: warning: implicit declaration of function 'nut_write_frame_reorder'
libnut.c:135: error: 'NUTContext' has no member named 'nut'
libnut.c: In function 'nut_write_trailer':
libnut.c:145: warning: implicit declaration of function 'nut_muxer_uninit_reorder'
libnut.c:145: error: 'NUTContext' has no member named 'nut'
libnut.c:148: error: 'NUTContext' has no member named 's'
libnut.c:148: error: 'NUTContext' has no member named 's'
libnut.c:149: error: 'NUTContext' has no member named 's'
libnut.c: In function 'nut_read_header':
libnut.c:192: error: 'nut_demuxer_opts_t' undeclared (first use in this function)
libnut.c:192: error: expected ';' before 'dopts'
libnut.c:203: error: 'nut_context_t' undeclared (first use in this function)
libnut.c:203: error: 'nut' undeclared (first use in this function)
libnut.c:203: error: 'NUTContext' has no member named 'nut'
libnut.c:203: warning: implicit declaration of function 'nut_demuxer_init'
libnut.c:203: error: 'dopts' undeclared (first use in this function)
libnut.c:204: error: 'nut_stream_header_t' undeclared (first use in this function)
libnut.c:204: error: 's' undeclared (first use in this function)
libnut.c:205: warning: ISO C90 forbids mixed declarations and code
libnut.c:207: warning: implicit declaration of function 'nut_read_headers'
libnut.c:208: warning: implicit declaration of function 'nut_error'
libnut.c:208: warning: format '%s' expects type 'char *', but argument 4 has type 'int'
libnut.c:209: warning: implicit declaration of function 'nut_demuxer_uninit'
libnut.c:213: error: 'NUTContext' has no member named 's'
libnut.c:236: error: 'NUT_AUDIO_CLASS' undeclared (first use in this function)
libnut.c:243: error: 'NUT_VIDEO_CLASS' undeclared (first use in this function)
libnut.c:191: warning: unused variable 'bc'
libnut.c: In function 'nut_read_packet':
libnut.c:261: error: 'nut_packet_t' undeclared (first use in this function)
libnut.c:261: error: expected ';' before 'pd'
libnut.c:262: warning: ISO C90 forbids mixed declarations and code
libnut.c:264: warning: implicit declaration of function 'nut_read_next_packet'
libnut.c:264: error: 'NUTContext' has no member named 'nut'
libnut.c:264: error: 'pd' undeclared (first use in this function)
libnut.c:265: warning: format '%s' expects type 'char *', but argument 4 has type 'int'
libnut.c:269: error: 'NUT_FLAG_KEY' undeclared (first use in this function)
libnut.c:274: warning: implicit declaration of function 'nut_read_frame'
libnut.c:274: error: 'NUTContext' has no member named 'nut'
libnut.c: In function 'nut_read_seek':
libnut.c:282: error: 'NUTContext' has no member named 's'
libnut.c:282: error: 'NUTContext' has no member named 's'
libnut.c:284: warning: implicit declaration of function 'nut_seek'
libnut.c:284: error: 'NUTContext' has no member named 'nut'
libnut.c: In function 'nut_read_close':
libnut.c:292: error: 'NUTContext' has no member named 'nut'
libnut.c:293: error: 'NUTContext' has no member named 's'
make[1]: *** [libnut.o] Error 1
make[1]: Leaving directory `/usr/src/RPM/BUILD/ffmpeg-0.5.0/libavformat'
make: *** [lib] Error 2
make: Leaving directory `/usr/src/RPM/BUILD/ffmpeg-0.5.0'
error: Bad exit status from /usr/src/tmp/rpm-tmp.37077 (%build)
RPM build errors:
Bad exit status from /usr/src/tmp/rpm-tmp.37077 (%build)
214.19user 13.41system 4:32.61elapsed 83%CPU (0avgtext+0avgdata 0maxresident)k
0inputs+0outputs (10major+1847173minor)pagefaults 0swaps
rebuild: rebuild of `pkg.tar' failed.
удален `/hasher/sisyphus32/lockdir/pid'
удален каталог: `/hasher/sisyphus32/lockdir'
thresh@exchange devel/packages/ffmpeg $