All pastes #246480 Raw Edit

Unnamed

public text v1 · immutable
#246480 ·published 2006-11-12 06:56 UTC
rendered paste body
snake@ubuntu-edgy:~/beryl-3d-plugin$ ./makeall 
-e compiling : 3d.c -> build/lib3d.loPackage xdamage was not found in the pkg-config search path.
Perhaps you should add the directory containing `xdamage.pc'
to the PKG_CONFIG_PATH environment variable
Package 'xdamage', required by 'beryl', not found
3d.c:45:19: error: beryl.h: No such file or directory
3d.c:76: error: expected specifier-qualifier-list before 'CompWindow'
3d.c:92: error: expected specifier-qualifier-list before 'CompOption'
3d.c:143: error: expected '=', ',', ';', 'asm' or '__attribute__' before 'windowIs3D'
3d.c:171: error: expected ')' before '*' token
3d.c:231: error: expected ')' before '*' token
3d.c:269: error: expected ')' before '*' token
3d.c:338: error: expected '=', ',', ';', 'asm' or '__attribute__' before 'tdPaintWindow'
3d.c:414: error: expected ')' before '*' token
3d.c:430: error: expected '=', ',', ';', 'asm' or '__attribute__' before 'tdPaintScreen'
3d.c:449: error: expected ')' before '*' token
3d.c: In function 'tdScreenInitOptions':
3d.c:516: error: 'CompOption' undeclared (first use in this function)
3d.c:516: error: (Each undeclared identifier is reported only once
3d.c:516: error: for each function it appears in.)
3d.c:516: error: 'o' undeclared (first use in this function)
3d.c:518: error: 'tdScreen' has no member named 'opt'
3d.c:522: error: 'CompOptionTypeFloat' undeclared (first use in this function)
3d.c:528: error: 'tdScreen' has no member named 'opt'
3d.c:538: error: 'tdScreen' has no member named 'opt'
3d.c:542: error: 'CompOptionTypeBool' undeclared (first use in this function)
3d.c:543: error: 'TRUE' undeclared (first use in this function)
3d.c: At top level:
3d.c:546: error: expected '=', ',', ';', 'asm' or '__attribute__' before '*' token
3d.c:570: error: expected '=', ',', ';', 'asm' or '__attribute__' before 'tdSetScreenOption'
3d.c:603: error: expected '=', ',', ';', 'asm' or '__attribute__' before 'tdInitDisplay'
3d.c:625: error: expected ')' before '*' token
3d.c:636: error: expected '=', ',', ';', 'asm' or '__attribute__' before 'tdInitScreen'
3d.c:675: error: expected ')' before '*' token
3d.c:692: error: expected '=', ',', ';', 'asm' or '__attribute__' before 'tdInitWindow'
3d.c:712: error: expected ')' before '*' token
3d.c:720: error: expected '=', ',', ';', 'asm' or '__attribute__' before 'tdInit'
3d.c:730: error: expected ')' before '*' token
3d.c:736: error: expected '=', ',', ';', 'asm' or '__attribute__' before 'tdVTable'
3d.c:759: error: expected '=', ',', ';', 'asm' or '__attribute__' before '*' token
3d.c:763:2: warning: no newline at end of file
make: *** [build/lib3d.lo] Error 1
-e compiling : rotate.c -> build/librotate.loPackage xdamage was not found in the pkg-config search path.
Perhaps you should add the directory containing `xdamage.pc'
to the PKG_CONFIG_PATH environment variable
Package 'xdamage', required by 'beryl', not found
rotate.c:37:19: error: beryl.h: No such file or directory
rotate.c:174: error: expected specifier-qualifier-list before 'HandleEventProc'
rotate.c:201: error: expected specifier-qualifier-list before 'PreparePaintScreenProc'
rotate.c:278: error: expected '=', ',', ';', 'asm' or '__attribute__' before 'rotateSetScreenOption'
rotate.c: In function 'rotateScreenInitOptions':
rotate.c:403: error: 'CompOption' undeclared (first use in this function)
rotate.c:403: error: (Each undeclared identifier is reported only once
rotate.c:403: error: for each function it appears in.)
rotate.c:403: error: 'o' undeclared (first use in this function)
rotate.c:405: error: 'RotateScreen' has no member named 'opt'
rotate.c:407: warning: implicit declaration of function 'N_'
rotate.c:409: error: 'CompOptionTypeBool' undeclared (first use in this function)
rotate.c:410: error: 'FALSE' undeclared (first use in this function)
rotate.c:412: error: 'RotateScreen' has no member named 'opt'
rotate.c:416: error: 'CompOptionTypeFloat' undeclared (first use in this function)
rotate.c:422: error: 'RotateScreen' has no member named 'opt'
rotate.c:432: error: 'RotateScreen' has no member named 'opt'
rotate.c:437: error: 'TRUE' undeclared (first use in this function)
rotate.c:439: error: 'RotateScreen' has no member named 'opt'
rotate.c:446: error: 'RotateScreen' has no member named 'opt'
rotate.c:456: error: 'RotateScreen' has no member named 'opt'
rotate.c:466: error: 'RotateScreen' has no member named 'opt'
rotate.c:476: error: 'RotateScreen' has no member named 'opt'
rotate.c:486: error: 'RotateScreen' has no member named 'opt'
rotate.c:493: error: 'RotateScreen' has no member named 'opt'
rotate.c:500: error: 'RotateScreen' has no member named 'opt'
rotate.c:507: error: 'RotateScreen' has no member named 'opt'
rotate.c:511: error: 'CompOptionTypeInt' undeclared (first use in this function)
rotate.c: At top level:
rotate.c:518: error: expected '=', ',', ';', 'asm' or '__attribute__' before '*' token
rotate.c: In function 'adjustVelocity':
rotate.c:543: error: 'RotateScreen' has no member named 'moving'
rotate.c:545: error: 'RotateScreen' has no member named 'moveTo'
rotate.c:545: error: 'RotateScreen' has no member named 'xrot'
rotate.c:545: error: 'RotateScreen' has no member named 'baseXrot'
rotate.c:549: error: 'RotateScreen' has no member named 'xrot'
rotate.c:550: error: 'RotateScreen' has no member named 'xrot'
rotate.c:551: error: 'RotateScreen' has no member named 'xrot'
rotate.c:552: error: 'RotateScreen' has no member named 'xrot'
rotate.c:553: error: 'RotateScreen' has no member named 'xrot'
rotate.c:556: error: 'RotateScreen' has no member named 'acceleration'
rotate.c:563: error: 'RotateScreen' has no member named 'slow'
rotate.c:566: error: 'RotateScreen' has no member named 'xVelocity'
rotate.c:566: error: 'RotateScreen' has no member named 'xVelocity'
rotate.c:568: error: 'RotateScreen' has no member named 'movingVert'
rotate.c:570: error: 'RotateScreen' has no member named 'moveToY'
rotate.c:570: error: 'RotateScreen' has no member named 'yrot'
rotate.c:570: error: 'RotateScreen' has no member named 'baseYrot'
rotate.c:574: error: 'RotateScreen' has no member named 'snapTop'
rotate.c:574: error: 'RotateScreen' has no member named 'yrot'
rotate.c:575: error: 'RotateScreen' has no member named 'yrot'
rotate.c:576: error: 'RotateScreen' has no member named 'snapBottom'
rotate.c:576: error: 'RotateScreen' has no member named 'yrot'
rotate.c:577: error: 'RotateScreen' has no member named 'yrot'
rotate.c:579: error: 'RotateScreen' has no member named 'yrot'
rotate.c:582: error: 'RotateScreen' has no member named 'acceleration'
rotate.c:583: error: 'RotateScreen' has no member named 'yrot'
rotate.c:589: error: 'RotateScreen' has no member named 'yVelocity'
rotate.c:589: error: 'RotateScreen' has no member named 'yVelocity'
rotate.c:591: error: 'RotateScreen' has no member named 'xVelocity'
rotate.c:592: error: 'RotateScreen' has no member named 'yVelocity'
rotate.c: At top level:
rotate.c:596: error: expected ')' before '*' token
rotate.c:610: error: expected ')' before '*' token
rotate.c:957: error: expected ')' before '*' token
rotate.c:976: error: expected '=', ',', ';', 'asm' or '__attribute__' before 'rotatePaintScreen'
rotate.c:1025: error: expected '=', ',', ';', 'asm' or '__attribute__' before 'rotateInitiate'
rotate.c:1104: error: expected '=', ',', ';', 'asm' or '__attribute__' before 'rotateTerminate'
rotate.c:1141: error: expected '=', ',', ';', 'asm' or '__attribute__' before 'rotate'
rotate.c:1202: error: expected '=', ',', ';', 'asm' or '__attribute__' before 'rotateVert'
rotate.c:1268: error: expected '=', ',', ';', 'asm' or '__attribute__' before 'rotateWithWindow'
rotate.c:1348: error: expected '=', ',', ';', 'asm' or '__attribute__' before 'pointerNearScreenEdge'
rotate.c:1362: error: expected '=', ',', ';', 'asm' or '__attribute__' before 'rotateLeftWheel'
rotate.c:1413: error: expected '=', ',', ';', 'asm' or '__attribute__' before 'rotateRightWheel'
rotate.c:1466: error: expected '=', ',', ';', 'asm' or '__attribute__' before 'rotateLeft'
rotate.c:1494: error: expected '=', ',', ';', 'asm' or '__attribute__' before 'rotateRight'
rotate.c:1522: error: expected '=', ',', ';', 'asm' or '__attribute__' before 'rotateTop'
rotate.c:1550: error: expected '=', ',', ';', 'asm' or '__attribute__' before 'rotateDown'
rotate.c:1578: error: expected '=', ',', ';', 'asm' or '__attribute__' before 'rotateLeftWithWindow'
rotate.c:1610: error: expected '=', ',', ';', 'asm' or '__attribute__' before 'rotateRightWithWindow'
rotate.c:1643: error: expected '=', ',', ';', 'asm' or '__attribute__' before 'rotateFlipLeft'
rotate.c:1688: error: expected '=', ',', ';', 'asm' or '__attribute__' before 'rotateFlipRight'
rotate.c:1734: error: expected ')' before '*' token
rotate.c:1874: error: expected '=', ',', ';', 'asm' or '__attribute__' before 'rotateFlipTerminate'
rotate.c:1912: error: expected '=', ',', ';', 'asm' or '__attribute__' before 'rotateEdgeFlipLeft'
rotate.c:1929: error: expected '=', ',', ';', 'asm' or '__attribute__' before 'rotateEdgeFlipRight'
rotate.c:1946: error: expected ')' before '*' token
rotate.c:1962: error: expected '=', ',', ';', 'asm' or '__attribute__' before 'rotateTo'
rotate.c:2017: error: expected '=', ',', ';', 'asm' or '__attribute__' before 'rotateToWithWindow'
rotate.c:2076: error: expected ')' before '*' token
rotate.c:2246: error: expected ')' before '*' token
rotate.c:2260: error: expected ')' before '*' token
rotate.c:2273: error: expected ')' before '*' token
rotate.c:2293: error: expected '=', ',', ';', 'asm' or '__attribute__' before 'rotateSetScreenOptionForPlugin'
rotate.c:2312: error: expected '=', ',', ';', 'asm' or '__attribute__' before 'rotateSetDisplayOption'
rotate.c: In function 'rotateDisplayInitOptions':
rotate.c:2398: error: 'CompOption' undeclared (first use in this function)
rotate.c:2398: error: 'o' undeclared (first use in this function)
rotate.c:2401: error: 'RotateDisplay' has no member named 'opt'
rotate.c:2405: error: 'CompOptionTypeAction' undeclared (first use in this function)
rotate.c:2406: error: 'rotateInitiate' undeclared (first use in this function)
rotate.c:2407: error: 'rotateTerminate' undeclared (first use in this function)
rotate.c:2408: error: 'FALSE' undeclared (first use in this function)
rotate.c:2410: error: 'CompActionStateInitKey' undeclared (first use in this function)
rotate.c:2411: error: 'CompActionStateInitButton' undeclared (first use in this function)
rotate.c:2412: error: 'CompBindingTypeButton' undeclared (first use in this function)
rotate.c:2413: error: 'ControlMask' undeclared (first use in this function)
rotate.c:2413: error: 'CompAltMask' undeclared (first use in this function)
rotate.c:2414: error: 'Button1' undeclared (first use in this function)
rotate.c:2416: error: 'RotateDisplay' has no member named 'opt'
rotate.c:2420: error: 'CompOptionTypeInt' undeclared (first use in this function)
rotate.c:2425: error: 'RotateDisplay' has no member named 'opt'
rotate.c:2430: error: 'rotateLeftWheel' undeclared (first use in this function)
rotate.c:2437: error: 'Button5' undeclared (first use in this function)
rotate.c:2439: error: 'RotateDisplay' has no member named 'opt'
rotate.c:2444: error: 'rotateRightWheel' undeclared (first use in this function)
rotate.c:2451: error: 'Button4' undeclared (first use in this function)
rotate.c:2453: error: 'RotateDisplay' has no member named 'opt'
rotate.c:2458: error: 'rotateLeft' undeclared (first use in this function)
rotate.c:2462: error: 'CompActionStateInitEdge' undeclared (first use in this function)
rotate.c:2463: error: 'CompActionStateInitEdgeDnd' undeclared (first use in this function)
rotate.c:2466: error: 'CompBindingTypeKey' undeclared (first use in this function)
rotate.c:2469: warning: implicit declaration of function 'XStringToKeysym'
rotate.c:2471: error: 'RotateDisplay' has no member named 'opt'
rotate.c:2476: error: 'rotateRight' undeclared (first use in this function)
rotate.c:2489: error: 'RotateDisplay' has no member named 'opt'
rotate.c:2494: error: 'rotateTop' undeclared (first use in this function)
rotate.c:2507: error: 'RotateDisplay' has no member named 'opt'
rotate.c:2512: error: 'rotateDown' undeclared (first use in this function)
rotate.c:2525: error: 'RotateDisplay' has no member named 'opt'
rotate.c:2530: error: 'rotateLeftWithWindow' undeclared (first use in this function)
rotate.c:2539: error: 'ShiftMask' undeclared (first use in this function)
rotate.c:2543: error: 'RotateDisplay' has no member named 'opt'
rotate.c:2548: error: 'rotateRightWithWindow' undeclared (first use in this function)
rotate.c:2598: error: 'RotateDisplay' has no member named 'opt'
rotate.c:2598: warning: passing argument 2 of 'asprintf' makes pointer from integer without a cast
rotate.c:2598: warning: passing argument 2 of 'asprintf' makes pointer from integer without a cast
rotate.c:2598: error: 'rotateTo' undeclared (first use in this function)
rotate.c:2598: error: 'CompBindingTypeNone' undeclared (first use in this function)
rotate.c:2598: error: 'RotateDisplay' has no member named 'opt'
rotate.c:2598: warning: passing argument 2 of 'asprintf' makes pointer from integer without a cast
rotate.c:2598: warning: passing argument 2 of 'asprintf' makes pointer from integer without a cast
rotate.c:2598: error: 'rotateToWithWindow' undeclared (first use in this function)
rotate.c:2599: error: 'RotateDisplay' has no member named 'opt'
rotate.c:2599: warning: passing argument 2 of 'asprintf' makes pointer from integer without a cast
rotate.c:2599: warning: passing argument 2 of 'asprintf' makes pointer from integer without a cast
rotate.c:2599: error: 'RotateDisplay' has no member named 'opt'
rotate.c:2599: warning: passing argument 2 of 'asprintf' makes pointer from integer without a cast
rotate.c:2599: warning: passing argument 2 of 'asprintf' makes pointer from integer without a cast
rotate.c:2600: error: 'RotateDisplay' has no member named 'opt'
rotate.c:2600: warning: passing argument 2 of 'asprintf' makes pointer from integer without a cast
rotate.c:2600: warning: passing argument 2 of 'asprintf' makes pointer from integer without a cast
rotate.c:2600: error: 'RotateDisplay' has no member named 'opt'
rotate.c:2600: warning: passing argument 2 of 'asprintf' makes pointer from integer without a cast
rotate.c:2600: warning: passing argument 2 of 'asprintf' makes pointer from integer without a cast
rotate.c:2601: error: 'RotateDisplay' has no member named 'opt'
rotate.c:2601: warning: passing argument 2 of 'asprintf' makes pointer from integer without a cast
rotate.c:2601: warning: passing argument 2 of 'asprintf' makes pointer from integer without a cast
rotate.c:2601: error: 'RotateDisplay' has no member named 'opt'
rotate.c:2601: warning: passing argument 2 of 'asprintf' makes pointer from integer without a cast
rotate.c:2601: warning: passing argument 2 of 'asprintf' makes pointer from integer without a cast
rotate.c:2602: error: 'RotateDisplay' has no member named 'opt'
rotate.c:2602: warning: passing argument 2 of 'asprintf' makes pointer from integer without a cast
rotate.c:2602: warning: passing argument 2 of 'asprintf' makes pointer from integer without a cast
rotate.c:2602: error: 'RotateDisplay' has no member named 'opt'
rotate.c:2602: warning: passing argument 2 of 'asprintf' makes pointer from integer without a cast
rotate.c:2602: warning: passing argument 2 of 'asprintf' makes pointer from integer without a cast
rotate.c:2603: error: 'RotateDisplay' has no member named 'opt'
rotate.c:2603: warning: passing argument 2 of 'asprintf' makes pointer from integer without a cast
rotate.c:2603: warning: passing argument 2 of 'asprintf' makes pointer from integer without a cast
rotate.c:2603: error: 'RotateDisplay' has no member named 'opt'
rotate.c:2603: warning: passing argument 2 of 'asprintf' makes pointer from integer without a cast
rotate.c:2603: warning: passing argument 2 of 'asprintf' makes pointer from integer without a cast
rotate.c:2604: error: 'RotateDisplay' has no member named 'opt'
rotate.c:2604: warning: passing argument 2 of 'asprintf' makes pointer from integer without a cast
rotate.c:2604: warning: passing argument 2 of 'asprintf' makes pointer from integer without a cast
rotate.c:2604: error: 'RotateDisplay' has no member named 'opt'
rotate.c:2604: warning: passing argument 2 of 'asprintf' makes pointer from integer without a cast
rotate.c:2604: warning: passing argument 2 of 'asprintf' makes pointer from integer without a cast
rotate.c:2605: error: 'RotateDisplay' has no member named 'opt'
rotate.c:2605: warning: passing argument 2 of 'asprintf' makes pointer from integer without a cast
rotate.c:2605: warning: passing argument 2 of 'asprintf' makes pointer from integer without a cast
rotate.c:2605: error: 'RotateDisplay' has no member named 'opt'
rotate.c:2605: warning: passing argument 2 of 'asprintf' makes pointer from integer without a cast
rotate.c:2605: warning: passing argument 2 of 'asprintf' makes pointer from integer without a cast
rotate.c:2606: error: 'RotateDisplay' has no member named 'opt'
rotate.c:2606: warning: passing argument 2 of 'asprintf' makes pointer from integer without a cast
rotate.c:2606: warning: passing argument 2 of 'asprintf' makes pointer from integer without a cast
rotate.c:2606: error: 'RotateDisplay' has no member named 'opt'
rotate.c:2606: warning: passing argument 2 of 'asprintf' makes pointer from integer without a cast
rotate.c:2606: warning: passing argument 2 of 'asprintf' makes pointer from integer without a cast
rotate.c:2607: error: 'RotateDisplay' has no member named 'opt'
rotate.c:2607: warning: passing argument 2 of 'asprintf' makes pointer from integer without a cast
rotate.c:2607: warning: passing argument 2 of 'asprintf' makes pointer from integer without a cast
rotate.c:2607: error: 'RotateDisplay' has no member named 'opt'
rotate.c:2607: warning: passing argument 2 of 'asprintf' makes pointer from integer without a cast
rotate.c:2607: warning: passing argument 2 of 'asprintf' makes pointer from integer without a cast
rotate.c:2608: error: 'RotateDisplay' has no member named 'opt'
rotate.c:2608: warning: passing argument 2 of 'asprintf' makes pointer from integer without a cast
rotate.c:2608: warning: passing argument 2 of 'asprintf' makes pointer from integer without a cast
rotate.c:2608: error: 'RotateDisplay' has no member named 'opt'
rotate.c:2608: warning: passing argument 2 of 'asprintf' makes pointer from integer without a cast
rotate.c:2608: warning: passing argument 2 of 'asprintf' makes pointer from integer without a cast
rotate.c:2609: error: 'RotateDisplay' has no member named 'opt'
rotate.c:2609: warning: passing argument 2 of 'asprintf' makes pointer from integer without a cast
rotate.c:2609: warning: passing argument 2 of 'asprintf' makes pointer from integer without a cast
rotate.c:2609: error: 'RotateDisplay' has no member named 'opt'
rotate.c:2609: warning: passing argument 2 of 'asprintf' makes pointer from integer without a cast
rotate.c:2609: warning: passing argument 2 of 'asprintf' makes pointer from integer without a cast
rotate.c:2611: error: 'RotateDisplay' has no member named 'opt'
rotate.c:2623: error: 'RotateDisplay' has no member named 'opt'
rotate.c:2635: error: 'RotateDisplay' has no member named 'opt'
rotate.c:2640: error: 'rotateEdgeFlipLeft' undeclared (first use in this function)
rotate.c:2641: error: 'rotateFlipTerminate' undeclared (first use in this function)
rotate.c:2643: error: 'SCREEN_EDGE_LEFT' undeclared (first use in this function)
rotate.c:2650: error: 'RotateDisplay' has no member named 'opt'
rotate.c:2655: error: 'rotateEdgeFlipRight' undeclared (first use in this function)
rotate.c:2658: error: 'SCREEN_EDGE_RIGHT' undeclared (first use in this function)
rotate.c:2665: error: 'RotateDisplay' has no member named 'opt'
rotate.c:2670: error: 'CompOptionTypeBool' undeclared (first use in this function)
rotate.c:2673: error: 'RotateDisplay' has no member named 'opt'
rotate.c:2679: error: 'TRUE' undeclared (first use in this function)
rotate.c:2681: error: 'RotateDisplay' has no member named 'opt'
rotate.c:2689: error: 'RotateDisplay' has no member named 'opt'
rotate.c: At top level:
rotate.c:2699: error: expected '=', ',', ';', 'asm' or '__attribute__' before '*' token
rotate.c:2719: error: expected '=', ',', ';', 'asm' or '__attribute__' before 'rotateInitDisplay'
rotate.c:2750: error: expected ')' before '*' token
rotate.c:2762: error: expected '=', ',', ';', 'asm' or '__attribute__' before 'rotateInitScreen'
rotate.c:2870: error: expected ')' before '*' token
rotate.c:2885: error: expected '=', ',', ';', 'asm' or '__attribute__' before 'rotateInit'
rotate.c:2895: error: expected ')' before '*' token
rotate.c:2901: error: expected '=', ',', ';', 'asm' or '__attribute__' before 'rotateDeps'
rotate.c:2906: error: expected '=', ',', ';', 'asm' or '__attribute__' before 'rotateVTable'
rotate.c:2930: error: expected '=', ',', ';', 'asm' or '__attribute__' before '*' token
make: *** [build/librotate.lo] Error 1
-e compiling : zoom.c -> build/libzoom.loPackage xdamage was not found in the pkg-config search path.
Perhaps you should add the directory containing `xdamage.pc'
to the PKG_CONFIG_PATH environment variable
Package 'xdamage', required by 'beryl', not found
zoom.c:32:19: error: beryl.h: No such file or directory
zoom.c:90: error: expected specifier-qualifier-list before 'HandleEventProc'
zoom.c:108: error: expected specifier-qualifier-list before 'PreparePaintScreenProc'
zoom.c:164: error: expected '=', ',', ';', 'asm' or '__attribute__' before 'zoomSetScreenOption'
zoom.c: In function 'zoomScreenInitOptions':
zoom.c:243: error: 'CompOption' undeclared (first use in this function)
zoom.c:243: error: (Each undeclared identifier is reported only once
zoom.c:243: error: for each function it appears in.)
zoom.c:243: error: 'o' undeclared (first use in this function)
zoom.c:245: error: 'ZoomScreen' has no member named 'opt'
zoom.c:247: warning: implicit declaration of function 'N_'
zoom.c:249: error: 'CompOptionTypeBool' undeclared (first use in this function)
zoom.c:250: error: 'FALSE' undeclared (first use in this function)
zoom.c:252: error: 'ZoomScreen' has no member named 'opt'
zoom.c:256: error: 'CompOptionTypeFloat' undeclared (first use in this function)
zoom.c:262: error: 'ZoomScreen' has no member named 'opt'
zoom.c:272: error: 'ZoomScreen' has no member named 'opt'
zoom.c:284: error: 'ZoomScreen' has no member named 'opt'
zoom.c:294: error: 'ZoomScreen' has no member named 'opt'
zoom.c:304: error: 'ZoomScreen' has no member named 'opt'
zoom.c:314: error: 'ZoomScreen' has no member named 'opt'
zoom.c:319: error: 'TRUE' undeclared (first use in this function)
zoom.c:321: error: 'ZoomScreen' has no member named 'opt'
zoom.c: At top level:
zoom.c:328: error: expected '=', ',', ';', 'asm' or '__attribute__' before '*' token
zoom.c: In function 'adjustZoomVelocity':
zoom.c:353: error: 'ZoomScreen' has no member named 'newZoom'
zoom.c:353: error: 'ZoomScreen' has no member named 'currentZoom'
zoom.c:362: error: 'ZoomScreen' has no member named 'zVelocity'
zoom.c:362: error: 'ZoomScreen' has no member named 'zVelocity'
zoom.c:364: error: 'ZoomScreen' has no member named 'zVelocity'
zoom.c: At top level:
zoom.c:368: error: expected ')' before '*' token
zoom.c:482: error: expected ')' before '*' token
zoom.c:499: error: expected '=', ',', ';', 'asm' or '__attribute__' before 'zoomPaintScreen'
zoom.c:551: error: expected '=', ',', ';', 'asm' or '__attribute__' before 'zoomIn'
zoom.c:616: error: expected '=', ',', ';', 'asm' or '__attribute__' before 'zoomInitiate'
zoom.c:632: error: expected '=', ',', ';', 'asm' or '__attribute__' before 'zoomOut'
zoom.c:703: error: expected '=', ',', ';', 'asm' or '__attribute__' before 'zoomTerminate'
zoom.c:734: error: expected ')' before '*' token
zoom.c:785: error: expected ')' before '*' token
zoom.c:809: error: expected '=', ',', ';', 'asm' or '__attribute__' before 'zoomSetScreenOptionForPlugin'
zoom.c:828: error: expected '=', ',', ';', 'asm' or '__attribute__' before 'zoomSetDisplayOption'
zoom.c: In function 'zoomDisplayInitOptions':
zoom.c:860: error: 'CompOption' undeclared (first use in this function)
zoom.c:860: error: 'o' undeclared (first use in this function)
zoom.c:862: error: 'ZoomDisplay' has no member named 'opt'
zoom.c:866: error: 'CompOptionTypeAction' undeclared (first use in this function)
zoom.c:867: error: 'zoomInitiate' undeclared (first use in this function)
zoom.c:868: error: 'zoomTerminate' undeclared (first use in this function)
zoom.c:869: error: 'FALSE' undeclared (first use in this function)
zoom.c:871: error: 'CompActionStateInitKey' undeclared (first use in this function)
zoom.c:872: error: 'CompActionStateInitButton' undeclared (first use in this function)
zoom.c:873: error: 'CompBindingTypeButton' undeclared (first use in this function)
zoom.c:874: error: 'CompSuperMask' undeclared (first use in this function)
zoom.c:875: error: 'Button3' undeclared (first use in this function)
zoom.c:877: error: 'ZoomDisplay' has no member named 'opt'
zoom.c:882: error: 'zoomIn' undeclared (first use in this function)
zoom.c:890: error: 'Button4' undeclared (first use in this function)
zoom.c:892: error: 'ZoomDisplay' has no member named 'opt'
zoom.c:897: error: 'zoomOut' undeclared (first use in this function)
zoom.c:905: error: 'Button5' undeclared (first use in this function)
zoom.c: At top level:
zoom.c:908: error: expected '=', ',', ';', 'asm' or '__attribute__' before '*' token
zoom.c:928: error: expected '=', ',', ';', 'asm' or '__attribute__' before 'zoomInitDisplay'
zoom.c:953: error: expected ')' before '*' token
zoom.c:965: error: expected '=', ',', ';', 'asm' or '__attribute__' before 'zoomInitScreen'
zoom.c:1027: error: expected ')' before '*' token
zoom.c:1040: error: expected '=', ',', ';', 'asm' or '__attribute__' before 'zoomInit'
zoom.c:1050: error: expected ')' before '*' token
zoom.c:1056: error: expected '=', ',', ';', 'asm' or '__attribute__' before 'zoomVTable'
zoom.c:1080: error: expected '=', ',', ';', 'asm' or '__attribute__' before '*' token
make: *** [build/libzoom.lo] Error 1
-e compiling : 3d.c -> build/lib3d.loPackage xdamage was not found in the pkg-config search path.
Perhaps you should add the directory containing `xdamage.pc'
to the PKG_CONFIG_PATH environment variable
Package 'xdamage', required by 'beryl', not found
3d.c:45:19: error: beryl.h: No such file or directory
3d.c:76: error: expected specifier-qualifier-list before 'CompWindow'
3d.c:92: error: expected specifier-qualifier-list before 'CompOption'
3d.c:143: error: expected '=', ',', ';', 'asm' or '__attribute__' before 'windowIs3D'
3d.c:171: error: expected ')' before '*' token
3d.c:231: error: expected ')' before '*' token
3d.c:269: error: expected ')' before '*' token
3d.c:338: error: expected '=', ',', ';', 'asm' or '__attribute__' before 'tdPaintWindow'
3d.c:414: error: expected ')' before '*' token
3d.c:430: error: expected '=', ',', ';', 'asm' or '__attribute__' before 'tdPaintScreen'
3d.c:449: error: expected ')' before '*' token
3d.c: In function 'tdScreenInitOptions':
3d.c:516: error: 'CompOption' undeclared (first use in this function)
3d.c:516: error: (Each undeclared identifier is reported only once
3d.c:516: error: for each function it appears in.)
3d.c:516: error: 'o' undeclared (first use in this function)
3d.c:518: error: 'tdScreen' has no member named 'opt'
3d.c:522: error: 'CompOptionTypeFloat' undeclared (first use in this function)
3d.c:528: error: 'tdScreen' has no member named 'opt'
3d.c:538: error: 'tdScreen' has no member named 'opt'
3d.c:542: error: 'CompOptionTypeBool' undeclared (first use in this function)
3d.c:543: error: 'TRUE' undeclared (first use in this function)
3d.c: At top level:
3d.c:546: error: expected '=', ',', ';', 'asm' or '__attribute__' before '*' token
3d.c:570: error: expected '=', ',', ';', 'asm' or '__attribute__' before 'tdSetScreenOption'
3d.c:603: error: expected '=', ',', ';', 'asm' or '__attribute__' before 'tdInitDisplay'
3d.c:625: error: expected ')' before '*' token
3d.c:636: error: expected '=', ',', ';', 'asm' or '__attribute__' before 'tdInitScreen'
3d.c:675: error: expected ')' before '*' token
3d.c:692: error: expected '=', ',', ';', 'asm' or '__attribute__' before 'tdInitWindow'
3d.c:712: error: expected ')' before '*' token
3d.c:720: error: expected '=', ',', ';', 'asm' or '__attribute__' before 'tdInit'
3d.c:730: error: expected ')' before '*' token
3d.c:736: error: expected '=', ',', ';', 'asm' or '__attribute__' before 'tdVTable'
3d.c:759: error: expected '=', ',', ';', 'asm' or '__attribute__' before '*' token
3d.c:763:2: warning: no newline at end of file
make: *** [build/lib3d.lo] Error 1
-e compiling : rotate.c -> build/librotate.loPackage xdamage was not found in the pkg-config search path.
Perhaps you should add the directory containing `xdamage.pc'
to the PKG_CONFIG_PATH environment variable
Package 'xdamage', required by 'beryl', not found
rotate.c:37:19: error: beryl.h: No such file or directory
rotate.c:174: error: expected specifier-qualifier-list before 'HandleEventProc'
rotate.c:201: error: expected specifier-qualifier-list before 'PreparePaintScreenProc'
rotate.c:278: error: expected '=', ',', ';', 'asm' or '__attribute__' before 'rotateSetScreenOption'
rotate.c: In function 'rotateScreenInitOptions':
rotate.c:403: error: 'CompOption' undeclared (first use in this function)
rotate.c:403: error: (Each undeclared identifier is reported only once
rotate.c:403: error: for each function it appears in.)
rotate.c:403: error: 'o' undeclared (first use in this function)
rotate.c:405: error: 'RotateScreen' has no member named 'opt'
rotate.c:407: warning: implicit declaration of function 'N_'
rotate.c:409: error: 'CompOptionTypeBool' undeclared (first use in this function)
rotate.c:410: error: 'FALSE' undeclared (first use in this function)
rotate.c:412: error: 'RotateScreen' has no member named 'opt'
rotate.c:416: error: 'CompOptionTypeFloat' undeclared (first use in this function)
rotate.c:422: error: 'RotateScreen' has no member named 'opt'
rotate.c:432: error: 'RotateScreen' has no member named 'opt'
rotate.c:437: error: 'TRUE' undeclared (first use in this function)
rotate.c:439: error: 'RotateScreen' has no member named 'opt'
rotate.c:446: error: 'RotateScreen' has no member named 'opt'
rotate.c:456: error: 'RotateScreen' has no member named 'opt'
rotate.c:466: error: 'RotateScreen' has no member named 'opt'
rotate.c:476: error: 'RotateScreen' has no member named 'opt'
rotate.c:486: error: 'RotateScreen' has no member named 'opt'
rotate.c:493: error: 'RotateScreen' has no member named 'opt'
rotate.c:500: error: 'RotateScreen' has no member named 'opt'
rotate.c:507: error: 'RotateScreen' has no member named 'opt'
rotate.c:511: error: 'CompOptionTypeInt' undeclared (first use in this function)
rotate.c: At top level:
rotate.c:518: error: expected '=', ',', ';', 'asm' or '__attribute__' before '*' token
rotate.c: In function 'adjustVelocity':
rotate.c:543: error: 'RotateScreen' has no member named 'moving'
rotate.c:545: error: 'RotateScreen' has no member named 'moveTo'
rotate.c:545: error: 'RotateScreen' has no member named 'xrot'
rotate.c:545: error: 'RotateScreen' has no member named 'baseXrot'
rotate.c:549: error: 'RotateScreen' has no member named 'xrot'
rotate.c:550: error: 'RotateScreen' has no member named 'xrot'
rotate.c:551: error: 'RotateScreen' has no member named 'xrot'
rotate.c:552: error: 'RotateScreen' has no member named 'xrot'
rotate.c:553: error: 'RotateScreen' has no member named 'xrot'
rotate.c:556: error: 'RotateScreen' has no member named 'acceleration'
rotate.c:563: error: 'RotateScreen' has no member named 'slow'
rotate.c:566: error: 'RotateScreen' has no member named 'xVelocity'
rotate.c:566: error: 'RotateScreen' has no member named 'xVelocity'
rotate.c:568: error: 'RotateScreen' has no member named 'movingVert'
rotate.c:570: error: 'RotateScreen' has no member named 'moveToY'
rotate.c:570: error: 'RotateScreen' has no member named 'yrot'
rotate.c:570: error: 'RotateScreen' has no member named 'baseYrot'
rotate.c:574: error: 'RotateScreen' has no member named 'snapTop'
rotate.c:574: error: 'RotateScreen' has no member named 'yrot'
rotate.c:575: error: 'RotateScreen' has no member named 'yrot'
rotate.c:576: error: 'RotateScreen' has no member named 'snapBottom'
rotate.c:576: error: 'RotateScreen' has no member named 'yrot'
rotate.c:577: error: 'RotateScreen' has no member named 'yrot'
rotate.c:579: error: 'RotateScreen' has no member named 'yrot'
rotate.c:582: error: 'RotateScreen' has no member named 'acceleration'
rotate.c:583: error: 'RotateScreen' has no member named 'yrot'
rotate.c:589: error: 'RotateScreen' has no member named 'yVelocity'
rotate.c:589: error: 'RotateScreen' has no member named 'yVelocity'
rotate.c:591: error: 'RotateScreen' has no member named 'xVelocity'
rotate.c:592: error: 'RotateScreen' has no member named 'yVelocity'
rotate.c: At top level:
rotate.c:596: error: expected ')' before '*' token
rotate.c:610: error: expected ')' before '*' token
rotate.c:957: error: expected ')' before '*' token
rotate.c:976: error: expected '=', ',', ';', 'asm' or '__attribute__' before 'rotatePaintScreen'
rotate.c:1025: error: expected '=', ',', ';', 'asm' or '__attribute__' before 'rotateInitiate'
rotate.c:1104: error: expected '=', ',', ';', 'asm' or '__attribute__' before 'rotateTerminate'
rotate.c:1141: error: expected '=', ',', ';', 'asm' or '__attribute__' before 'rotate'
rotate.c:1202: error: expected '=', ',', ';', 'asm' or '__attribute__' before 'rotateVert'
rotate.c:1268: error: expected '=', ',', ';', 'asm' or '__attribute__' before 'rotateWithWindow'
rotate.c:1348: error: expected '=', ',', ';', 'asm' or '__attribute__' before 'pointerNearScreenEdge'
rotate.c:1362: error: expected '=', ',', ';', 'asm' or '__attribute__' before 'rotateLeftWheel'
rotate.c:1413: error: expected '=', ',', ';', 'asm' or '__attribute__' before 'rotateRightWheel'
rotate.c:1466: error: expected '=', ',', ';', 'asm' or '__attribute__' before 'rotateLeft'
rotate.c:1494: error: expected '=', ',', ';', 'asm' or '__attribute__' before 'rotateRight'
rotate.c:1522: error: expected '=', ',', ';', 'asm' or '__attribute__' before 'rotateTop'
rotate.c:1550: error: expected '=', ',', ';', 'asm' or '__attribute__' before 'rotateDown'
rotate.c:1578: error: expected '=', ',', ';', 'asm' or '__attribute__' before 'rotateLeftWithWindow'
rotate.c:1610: error: expected '=', ',', ';', 'asm' or '__attribute__' before 'rotateRightWithWindow'
rotate.c:1643: error: expected '=', ',', ';', 'asm' or '__attribute__' before 'rotateFlipLeft'
rotate.c:1688: error: expected '=', ',', ';', 'asm' or '__attribute__' before 'rotateFlipRight'
rotate.c:1734: error: expected ')' before '*' token
rotate.c:1874: error: expected '=', ',', ';', 'asm' or '__attribute__' before 'rotateFlipTerminate'
rotate.c:1912: error: expected '=', ',', ';', 'asm' or '__attribute__' before 'rotateEdgeFlipLeft'
rotate.c:1929: error: expected '=', ',', ';', 'asm' or '__attribute__' before 'rotateEdgeFlipRight'
rotate.c:1946: error: expected ')' before '*' token
rotate.c:1962: error: expected '=', ',', ';', 'asm' or '__attribute__' before 'rotateTo'
rotate.c:2017: error: expected '=', ',', ';', 'asm' or '__attribute__' before 'rotateToWithWindow'
rotate.c:2076: error: expected ')' before '*' token
rotate.c:2246: error: expected ')' before '*' token
rotate.c:2260: error: expected ')' before '*' token
rotate.c:2273: error: expected ')' before '*' token
rotate.c:2293: error: expected '=', ',', ';', 'asm' or '__attribute__' before 'rotateSetScreenOptionForPlugin'
rotate.c:2312: error: expected '=', ',', ';', 'asm' or '__attribute__' before 'rotateSetDisplayOption'
rotate.c: In function 'rotateDisplayInitOptions':
rotate.c:2398: error: 'CompOption' undeclared (first use in this function)
rotate.c:2398: error: 'o' undeclared (first use in this function)
rotate.c:2401: error: 'RotateDisplay' has no member named 'opt'
rotate.c:2405: error: 'CompOptionTypeAction' undeclared (first use in this function)
rotate.c:2406: error: 'rotateInitiate' undeclared (first use in this function)
rotate.c:2407: error: 'rotateTerminate' undeclared (first use in this function)
rotate.c:2408: error: 'FALSE' undeclared (first use in this function)
rotate.c:2410: error: 'CompActionStateInitKey' undeclared (first use in this function)
rotate.c:2411: error: 'CompActionStateInitButton' undeclared (first use in this function)
rotate.c:2412: error: 'CompBindingTypeButton' undeclared (first use in this function)
rotate.c:2413: error: 'ControlMask' undeclared (first use in this function)
rotate.c:2413: error: 'CompAltMask' undeclared (first use in this function)
rotate.c:2414: error: 'Button1' undeclared (first use in this function)
rotate.c:2416: error: 'RotateDisplay' has no member named 'opt'
rotate.c:2420: error: 'CompOptionTypeInt' undeclared (first use in this function)
rotate.c:2425: error: 'RotateDisplay' has no member named 'opt'
rotate.c:2430: error: 'rotateLeftWheel' undeclared (first use in this function)
rotate.c:2437: error: 'Button5' undeclared (first use in this function)
rotate.c:2439: error: 'RotateDisplay' has no member named 'opt'
rotate.c:2444: error: 'rotateRightWheel' undeclared (first use in this function)
rotate.c:2451: error: 'Button4' undeclared (first use in this function)
rotate.c:2453: error: 'RotateDisplay' has no member named 'opt'
rotate.c:2458: error: 'rotateLeft' undeclared (first use in this function)
rotate.c:2462: error: 'CompActionStateInitEdge' undeclared (first use in this function)
rotate.c:2463: error: 'CompActionStateInitEdgeDnd' undeclared (first use in this function)
rotate.c:2466: error: 'CompBindingTypeKey' undeclared (first use in this function)
rotate.c:2469: warning: implicit declaration of function 'XStringToKeysym'
rotate.c:2471: error: 'RotateDisplay' has no member named 'opt'
rotate.c:2476: error: 'rotateRight' undeclared (first use in this function)
rotate.c:2489: error: 'RotateDisplay' has no member named 'opt'
rotate.c:2494: error: 'rotateTop' undeclared (first use in this function)
rotate.c:2507: error: 'RotateDisplay' has no member named 'opt'
rotate.c:2512: error: 'rotateDown' undeclared (first use in this function)
rotate.c:2525: error: 'RotateDisplay' has no member named 'opt'
rotate.c:2530: error: 'rotateLeftWithWindow' undeclared (first use in this function)
rotate.c:2539: error: 'ShiftMask' undeclared (first use in this function)
rotate.c:2543: error: 'RotateDisplay' has no member named 'opt'
rotate.c:2548: error: 'rotateRightWithWindow' undeclared (first use in this function)
rotate.c:2598: error: 'RotateDisplay' has no member named 'opt'
rotate.c:2598: warning: passing argument 2 of 'asprintf' makes pointer from integer without a cast
rotate.c:2598: warning: passing argument 2 of 'asprintf' makes pointer from integer without a cast
rotate.c:2598: error: 'rotateTo' undeclared (first use in this function)
rotate.c:2598: error: 'CompBindingTypeNone' undeclared (first use in this function)
rotate.c:2598: error: 'RotateDisplay' has no member named 'opt'
rotate.c:2598: warning: passing argument 2 of 'asprintf' makes pointer from integer without a cast
rotate.c:2598: warning: passing argument 2 of 'asprintf' makes pointer from integer without a cast
rotate.c:2598: error: 'rotateToWithWindow' undeclared (first use in this function)
rotate.c:2599: error: 'RotateDisplay' has no member named 'opt'
rotate.c:2599: warning: passing argument 2 of 'asprintf' makes pointer from integer without a cast
rotate.c:2599: warning: passing argument 2 of 'asprintf' makes pointer from integer without a cast
rotate.c:2599: error: 'RotateDisplay' has no member named 'opt'
rotate.c:2599: warning: passing argument 2 of 'asprintf' makes pointer from integer without a cast
rotate.c:2599: warning: passing argument 2 of 'asprintf' makes pointer from integer without a cast
rotate.c:2600: error: 'RotateDisplay' has no member named 'opt'
rotate.c:2600: warning: passing argument 2 of 'asprintf' makes pointer from integer without a cast
rotate.c:2600: warning: passing argument 2 of 'asprintf' makes pointer from integer without a cast
rotate.c:2600: error: 'RotateDisplay' has no member named 'opt'
rotate.c:2600: warning: passing argument 2 of 'asprintf' makes pointer from integer without a cast
rotate.c:2600: warning: passing argument 2 of 'asprintf' makes pointer from integer without a cast
rotate.c:2601: error: 'RotateDisplay' has no member named 'opt'
rotate.c:2601: warning: passing argument 2 of 'asprintf' makes pointer from integer without a cast
rotate.c:2601: warning: passing argument 2 of 'asprintf' makes pointer from integer without a cast
rotate.c:2601: error: 'RotateDisplay' has no member named 'opt'
rotate.c:2601: warning: passing argument 2 of 'asprintf' makes pointer from integer without a cast
rotate.c:2601: warning: passing argument 2 of 'asprintf' makes pointer from integer without a cast
rotate.c:2602: error: 'RotateDisplay' has no member named 'opt'
rotate.c:2602: warning: passing argument 2 of 'asprintf' makes pointer from integer without a cast
rotate.c:2602: warning: passing argument 2 of 'asprintf' makes pointer from integer without a cast
rotate.c:2602: error: 'RotateDisplay' has no member named 'opt'
rotate.c:2602: warning: passing argument 2 of 'asprintf' makes pointer from integer without a cast
rotate.c:2602: warning: passing argument 2 of 'asprintf' makes pointer from integer without a cast
rotate.c:2603: error: 'RotateDisplay' has no member named 'opt'
rotate.c:2603: warning: passing argument 2 of 'asprintf' makes pointer from integer without a cast
rotate.c:2603: warning: passing argument 2 of 'asprintf' makes pointer from integer without a cast
rotate.c:2603: error: 'RotateDisplay' has no member named 'opt'
rotate.c:2603: warning: passing argument 2 of 'asprintf' makes pointer from integer without a cast
rotate.c:2603: warning: passing argument 2 of 'asprintf' makes pointer from integer without a cast
rotate.c:2604: error: 'RotateDisplay' has no member named 'opt'
rotate.c:2604: warning: passing argument 2 of 'asprintf' makes pointer from integer without a cast
rotate.c:2604: warning: passing argument 2 of 'asprintf' makes pointer from integer without a cast
rotate.c:2604: error: 'RotateDisplay' has no member named 'opt'
rotate.c:2604: warning: passing argument 2 of 'asprintf' makes pointer from integer without a cast
rotate.c:2604: warning: passing argument 2 of 'asprintf' makes pointer from integer without a cast
rotate.c:2605: error: 'RotateDisplay' has no member named 'opt'
rotate.c:2605: warning: passing argument 2 of 'asprintf' makes pointer from integer without a cast
rotate.c:2605: warning: passing argument 2 of 'asprintf' makes pointer from integer without a cast
rotate.c:2605: error: 'RotateDisplay' has no member named 'opt'
rotate.c:2605: warning: passing argument 2 of 'asprintf' makes pointer from integer without a cast
rotate.c:2605: warning: passing argument 2 of 'asprintf' makes pointer from integer without a cast
rotate.c:2606: error: 'RotateDisplay' has no member named 'opt'
rotate.c:2606: warning: passing argument 2 of 'asprintf' makes pointer from integer without a cast
rotate.c:2606: warning: passing argument 2 of 'asprintf' makes pointer from integer without a cast
rotate.c:2606: error: 'RotateDisplay' has no member named 'opt'
rotate.c:2606: warning: passing argument 2 of 'asprintf' makes pointer from integer without a cast
rotate.c:2606: warning: passing argument 2 of 'asprintf' makes pointer from integer without a cast
rotate.c:2607: error: 'RotateDisplay' has no member named 'opt'
rotate.c:2607: warning: passing argument 2 of 'asprintf' makes pointer from integer without a cast
rotate.c:2607: warning: passing argument 2 of 'asprintf' makes pointer from integer without a cast
rotate.c:2607: error: 'RotateDisplay' has no member named 'opt'
rotate.c:2607: warning: passing argument 2 of 'asprintf' makes pointer from integer without a cast
rotate.c:2607: warning: passing argument 2 of 'asprintf' makes pointer from integer without a cast
rotate.c:2608: error: 'RotateDisplay' has no member named 'opt'
rotate.c:2608: warning: passing argument 2 of 'asprintf' makes pointer from integer without a cast
rotate.c:2608: warning: passing argument 2 of 'asprintf' makes pointer from integer without a cast
rotate.c:2608: error: 'RotateDisplay' has no member named 'opt'
rotate.c:2608: warning: passing argument 2 of 'asprintf' makes pointer from integer without a cast
rotate.c:2608: warning: passing argument 2 of 'asprintf' makes pointer from integer without a cast
rotate.c:2609: error: 'RotateDisplay' has no member named 'opt'
rotate.c:2609: warning: passing argument 2 of 'asprintf' makes pointer from integer without a cast
rotate.c:2609: warning: passing argument 2 of 'asprintf' makes pointer from integer without a cast
rotate.c:2609: error: 'RotateDisplay' has no member named 'opt'
rotate.c:2609: warning: passing argument 2 of 'asprintf' makes pointer from integer without a cast
rotate.c:2609: warning: passing argument 2 of 'asprintf' makes pointer from integer without a cast
rotate.c:2611: error: 'RotateDisplay' has no member named 'opt'
rotate.c:2623: error: 'RotateDisplay' has no member named 'opt'
rotate.c:2635: error: 'RotateDisplay' has no member named 'opt'
rotate.c:2640: error: 'rotateEdgeFlipLeft' undeclared (first use in this function)
rotate.c:2641: error: 'rotateFlipTerminate' undeclared (first use in this function)
rotate.c:2643: error: 'SCREEN_EDGE_LEFT' undeclared (first use in this function)
rotate.c:2650: error: 'RotateDisplay' has no member named 'opt'
rotate.c:2655: error: 'rotateEdgeFlipRight' undeclared (first use in this function)
rotate.c:2658: error: 'SCREEN_EDGE_RIGHT' undeclared (first use in this function)
rotate.c:2665: error: 'RotateDisplay' has no member named 'opt'
rotate.c:2670: error: 'CompOptionTypeBool' undeclared (first use in this function)
rotate.c:2673: error: 'RotateDisplay' has no member named 'opt'
rotate.c:2679: error: 'TRUE' undeclared (first use in this function)
rotate.c:2681: error: 'RotateDisplay' has no member named 'opt'
rotate.c:2689: error: 'RotateDisplay' has no member named 'opt'
rotate.c: At top level:
rotate.c:2699: error: expected '=', ',', ';', 'asm' or '__attribute__' before '*' token
rotate.c:2719: error: expected '=', ',', ';', 'asm' or '__attribute__' before 'rotateInitDisplay'
rotate.c:2750: error: expected ')' before '*' token
rotate.c:2762: error: expected '=', ',', ';', 'asm' or '__attribute__' before 'rotateInitScreen'
rotate.c:2870: error: expected ')' before '*' token
rotate.c:2885: error: expected '=', ',', ';', 'asm' or '__attribute__' before 'rotateInit'
rotate.c:2895: error: expected ')' before '*' token
rotate.c:2901: error: expected '=', ',', ';', 'asm' or '__attribute__' before 'rotateDeps'
rotate.c:2906: error: expected '=', ',', ';', 'asm' or '__attribute__' before 'rotateVTable'
rotate.c:2930: error: expected '=', ',', ';', 'asm' or '__attribute__' before '*' token
make: *** [build/librotate.lo] Error 1
-e compiling : zoom.c -> build/libzoom.loPackage xdamage was not found in the pkg-config search path.
Perhaps you should add the directory containing `xdamage.pc'
to the PKG_CONFIG_PATH environment variable
Package 'xdamage', required by 'beryl', not found
zoom.c:32:19: error: beryl.h: No such file or directory
zoom.c:90: error: expected specifier-qualifier-list before 'HandleEventProc'
zoom.c:108: error: expected specifier-qualifier-list before 'PreparePaintScreenProc'
zoom.c:164: error: expected '=', ',', ';', 'asm' or '__attribute__' before 'zoomSetScreenOption'
zoom.c: In function 'zoomScreenInitOptions':
zoom.c:243: error: 'CompOption' undeclared (first use in this function)
zoom.c:243: error: (Each undeclared identifier is reported only once
zoom.c:243: error: for each function it appears in.)
zoom.c:243: error: 'o' undeclared (first use in this function)
zoom.c:245: error: 'ZoomScreen' has no member named 'opt'
zoom.c:247: warning: implicit declaration of function 'N_'
zoom.c:249: error: 'CompOptionTypeBool' undeclared (first use in this function)
zoom.c:250: error: 'FALSE' undeclared (first use in this function)
zoom.c:252: error: 'ZoomScreen' has no member named 'opt'
zoom.c:256: error: 'CompOptionTypeFloat' undeclared (first use in this function)
zoom.c:262: error: 'ZoomScreen' has no member named 'opt'
zoom.c:272: error: 'ZoomScreen' has no member named 'opt'
zoom.c:284: error: 'ZoomScreen' has no member named 'opt'
zoom.c:294: error: 'ZoomScreen' has no member named 'opt'
zoom.c:304: error: 'ZoomScreen' has no member named 'opt'
zoom.c:314: error: 'ZoomScreen' has no member named 'opt'
zoom.c:319: error: 'TRUE' undeclared (first use in this function)
zoom.c:321: error: 'ZoomScreen' has no member named 'opt'
zoom.c: At top level:
zoom.c:328: error: expected '=', ',', ';', 'asm' or '__attribute__' before '*' token
zoom.c: In function 'adjustZoomVelocity':
zoom.c:353: error: 'ZoomScreen' has no member named 'newZoom'
zoom.c:353: error: 'ZoomScreen' has no member named 'currentZoom'
zoom.c:362: error: 'ZoomScreen' has no member named 'zVelocity'
zoom.c:362: error: 'ZoomScreen' has no member named 'zVelocity'
zoom.c:364: error: 'ZoomScreen' has no member named 'zVelocity'
zoom.c: At top level:
zoom.c:368: error: expected ')' before '*' token
zoom.c:482: error: expected ')' before '*' token
zoom.c:499: error: expected '=', ',', ';', 'asm' or '__attribute__' before 'zoomPaintScreen'
zoom.c:551: error: expected '=', ',', ';', 'asm' or '__attribute__' before 'zoomIn'
zoom.c:616: error: expected '=', ',', ';', 'asm' or '__attribute__' before 'zoomInitiate'
zoom.c:632: error: expected '=', ',', ';', 'asm' or '__attribute__' before 'zoomOut'
zoom.c:703: error: expected '=', ',', ';', 'asm' or '__attribute__' before 'zoomTerminate'
zoom.c:734: error: expected ')' before '*' token
zoom.c:785: error: expected ')' before '*' token
zoom.c:809: error: expected '=', ',', ';', 'asm' or '__attribute__' before 'zoomSetScreenOptionForPlugin'
zoom.c:828: error: expected '=', ',', ';', 'asm' or '__attribute__' before 'zoomSetDisplayOption'
zoom.c: In function 'zoomDisplayInitOptions':
zoom.c:860: error: 'CompOption' undeclared (first use in this function)
zoom.c:860: error: 'o' undeclared (first use in this function)
zoom.c:862: error: 'ZoomDisplay' has no member named 'opt'
zoom.c:866: error: 'CompOptionTypeAction' undeclared (first use in this function)
zoom.c:867: error: 'zoomInitiate' undeclared (first use in this function)
zoom.c:868: error: 'zoomTerminate' undeclared (first use in this function)
zoom.c:869: error: 'FALSE' undeclared (first use in this function)
zoom.c:871: error: 'CompActionStateInitKey' undeclared (first use in this function)
zoom.c:872: error: 'CompActionStateInitButton' undeclared (first use in this function)
zoom.c:873: error: 'CompBindingTypeButton' undeclared (first use in this function)
zoom.c:874: error: 'CompSuperMask' undeclared (first use in this function)
zoom.c:875: error: 'Button3' undeclared (first use in this function)
zoom.c:877: error: 'ZoomDisplay' has no member named 'opt'
zoom.c:882: error: 'zoomIn' undeclared (first use in this function)
zoom.c:890: error: 'Button4' undeclared (first use in this function)
zoom.c:892: error: 'ZoomDisplay' has no member named 'opt'
zoom.c:897: error: 'zoomOut' undeclared (first use in this function)
zoom.c:905: error: 'Button5' undeclared (first use in this function)
zoom.c: At top level:
zoom.c:908: error: expected '=', ',', ';', 'asm' or '__attribute__' before '*' token
zoom.c:928: error: expected '=', ',', ';', 'asm' or '__attribute__' before 'zoomInitDisplay'
zoom.c:953: error: expected ')' before '*' token
zoom.c:965: error: expected '=', ',', ';', 'asm' or '__attribute__' before 'zoomInitScreen'
zoom.c:1027: error: expected ')' before '*' token
zoom.c:1040: error: expected '=', ',', ';', 'asm' or '__attribute__' before 'zoomInit'
zoom.c:1050: error: expected ')' before '*' token
zoom.c:1056: error: expected '=', ',', ';', 'asm' or '__attribute__' before 'zoomVTable'
zoom.c:1080: error: expected '=', ',', ';', 'asm' or '__attribute__' before '*' token
make: *** [build/libzoom.lo] Error 1
snake@ubuntu-edgy:~/beryl-3d-plugin$