snake@ubuntu-edgy:~/beryl-3d-plugin$ ./makeall
-e compiling : 3d.c -> build/lib3d.loPackage xcomposite was not found in the pkg-config search path.
Perhaps you should add the directory containing `xcomposite.pc'
to the PKG_CONFIG_PATH environment variable
Package 'xcomposite', required by 'beryl', not found
/bin/sh: libtool: not found
make: *** [build/lib3d.lo] Error 127
-e compiling : rotate.c -> build/librotate.loPackage xcomposite was not found in the pkg-config search path.
Perhaps you should add the directory containing `xcomposite.pc'
to the PKG_CONFIG_PATH environment variable
Package 'xcomposite', required by 'beryl', not found
/bin/sh: libtool: not found
make: *** [build/librotate.lo] Error 127
-e compiling : zoom.c -> build/libzoom.loPackage xcomposite was not found in the pkg-config search path.
Perhaps you should add the directory containing `xcomposite.pc'
to the PKG_CONFIG_PATH environment variable
Package 'xcomposite', required by 'beryl', not found
/bin/sh: libtool: not found
make: *** [build/libzoom.lo] Error 127
-e compiling : 3d.c -> build/lib3d.loPackage xcomposite was not found in the pkg-config search path.
Perhaps you should add the directory containing `xcomposite.pc'
to the PKG_CONFIG_PATH environment variable
Package 'xcomposite', required by 'beryl', not found
/bin/sh: libtool: not found
make: *** [build/lib3d.lo] Error 127
-e compiling : rotate.c -> build/librotate.loPackage xcomposite was not found in the pkg-config search path.
Perhaps you should add the directory containing `xcomposite.pc'
to the PKG_CONFIG_PATH environment variable
Package 'xcomposite', required by 'beryl', not found
/bin/sh: libtool: not found
make: *** [build/librotate.lo] Error 127
-e compiling : zoom.c -> build/libzoom.loPackage xcomposite was not found in the pkg-config search path.
Perhaps you should add the directory containing `xcomposite.pc'
to the PKG_CONFIG_PATH environment variable
Package 'xcomposite', required by 'beryl', not found
/bin/sh: libtool: not found
make: *** [build/libzoom.lo] Error 127