Using 2.6.x kernel build system.
make: Entering directory `/tmp/vmware-config15/vmmon-only'
make -C /lib/modules/2.6.18.1-grsec/build/include/.. SUBDIRS=$PWD SRCROOT=$PWD/. modules
make[1]: Entering directory `/usr/src/linux-2.6.18.1'
CC [M] /tmp/vmware-config15/vmmon-only/linux/driver.o
In file included from /tmp/vmware-config15/vmmon-only/linux/driver.h:20,
from /tmp/vmware-config15/vmmon-only/linux/driver.c:49:
/tmp/vmware-config15/vmmon-only/include/compat_wait.h:37:5: warning: "VMW_HAVE_EPOLL" is not defined
/tmp/vmware-config15/vmmon-only/include/compat_wait.h:43:5: warning: "VMW_HAVE_EPOLL" is not defined
In file included from /tmp/vmware-config15/vmmon-only/linux/driver.h:20,
from /tmp/vmware-config15/vmmon-only/linux/driver.c:49:
/tmp/vmware-config15/vmmon-only/include/compat_wait.h:60: error: conflicting types for `poll_initwait'
include/linux/poll.h:62: error: previous declaration of `poll_initwait'
/tmp/vmware-config15/vmmon-only/linux/driver.c:145: warning: initialization from incompatible pointer type
/tmp/vmware-config15/vmmon-only/linux/driver.c:149: warning: initialization from incompatible pointer type
/tmp/vmware-config15/vmmon-only/linux/driver.c: In function `LinuxDriverComputeTSCFreq':
/tmp/vmware-config15/vmmon-only/linux/driver.c:310: warning: unused parameter `data'
/tmp/vmware-config15/vmmon-only/linux/driver.c: In function `LinuxDriver_Open':
/tmp/vmware-config15/vmmon-only/linux/driver.c:501: warning: unused parameter `inode'
/tmp/vmware-config15/vmmon-only/linux/driver.c: In function `LinuxDriver_Close':
/tmp/vmware-config15/vmmon-only/linux/driver.c:610: warning: unused parameter `inode'
/tmp/vmware-config15/vmmon-only/linux/driver.c: In function `LinuxDriverPollTimeout':
/tmp/vmware-config15/vmmon-only/linux/driver.c:953: warning: unused parameter `clientData'
/tmp/vmware-config15/vmmon-only/linux/driver.c: In function `LinuxDriverIPIHandler':
/tmp/vmware-config15/vmmon-only/linux/driver.c:969: warning: unused parameter `info'
/tmp/vmware-config15/vmmon-only/linux/driver.c: In function `LinuxDriverNoPage':
/tmp/vmware-config15/vmmon-only/linux/driver.c:999: warning: unused parameter `unused'
/tmp/vmware-config15/vmmon-only/linux/driver.c: In function `LinuxDriverLockedNoPage':
/tmp/vmware-config15/vmmon-only/linux/driver.c:1049: warning: unused parameter `unused'
/tmp/vmware-config15/vmmon-only/linux/driver.c: In function `LinuxDriverAllocLockedMem':
/tmp/vmware-config15/vmmon-only/linux/driver.c:1189: warning: unused parameter `filp'
/tmp/vmware-config15/vmmon-only/linux/driver.c:1191: warning: unused parameter `vmHost'
/tmp/vmware-config15/vmmon-only/linux/driver.c: In function `LinuxDriver_Ioctl':
/tmp/vmware-config15/vmmon-only/linux/driver.c:1331: warning: unused parameter `inode'
include/linux/debug_locks.h: In function `debug_show_held_locks':
include/linux/debug_locks.h:56: warning: unused parameter `task'
include/linux/debug_locks.h: In function `debug_check_no_locks_freed':
include/linux/debug_locks.h:61: warning: unused parameter `from'
include/linux/debug_locks.h:61: warning: unused parameter `len'
include/linux/debug_locks.h: In function `debug_check_no_locks_held':
include/linux/debug_locks.h:66: warning: unused parameter `task'
include/linux/wait.h: In function `__remove_wait_queue':
include/linux/wait.h:129: warning: unused parameter `head'
include/asm/rwsem.h: In function `__down_write_nested':
include/asm/rwsem.h:145: warning: unused parameter `subclass'
include/asm/io_apic.h: In function `disable_edge_ioapic_irq':
include/asm/io_apic.h:36: warning: unused parameter `irq'
include/asm/io_apic.h: In function `mask_and_ack_level_ioapic_irq':
include/asm/io_apic.h:37: warning: unused parameter `irq'
include/asm/io_apic.h: In function `end_edge_ioapic_irq':
include/asm/io_apic.h:38: warning: unused parameter `irq'
include/linux/memory_hotplug.h: In function `pgdat_resize_lock':
include/linux/memory_hotplug.h:140: warning: unused parameter `p'
include/linux/memory_hotplug.h:140: warning: unused parameter `f'
include/linux/memory_hotplug.h: In function `pgdat_resize_unlock':
include/linux/memory_hotplug.h:141: warning: unused parameter `p'
include/linux/memory_hotplug.h:141: warning: unused parameter `f'
include/linux/memory_hotplug.h: In function `pgdat_resize_init':
include/linux/memory_hotplug.h:142: warning: unused parameter `pgdat'
include/linux/memory_hotplug.h: In function `zone_span_seqbegin':
include/linux/memory_hotplug.h:144: warning: unused parameter `zone'
include/linux/memory_hotplug.h: In function `zone_span_seqretry':
include/linux/memory_hotplug.h:148: warning: unused parameter `zone'
include/linux/memory_hotplug.h:148: warning: unused parameter `iv'
include/linux/memory_hotplug.h: In function `zone_span_writelock':
include/linux/memory_hotplug.h:152: warning: unused parameter `zone'
include/linux/memory_hotplug.h: In function `zone_span_writeunlock':
include/linux/memory_hotplug.h:153: warning: unused parameter `zone'
include/linux/memory_hotplug.h: In function `zone_seqlock_init':
include/linux/memory_hotplug.h:154: warning: unused parameter `zone'
include/linux/memory_hotplug.h: In function `__remove_pages':
include/linux/memory_hotplug.h:164: warning: unused parameter `zone'
include/linux/memory_hotplug.h:164: warning: unused parameter `start_pfn'
include/linux/memory_hotplug.h:165: warning: unused parameter `nr_pages'
include/linux/mmzone.h: In function `memory_present':
include/linux/mmzone.h:360: warning: unused parameter `nid'
include/linux/mmzone.h:360: warning: unused parameter `start'
include/linux/mmzone.h:360: warning: unused parameter `end'
include/linux/gfp.h: In function `arch_free_page':
include/linux/gfp.h:102: warning: unused parameter `page'
include/linux/gfp.h:102: warning: unused parameter `order'
include/linux/gfp.h: In function `drain_node_pages':
include/linux/gfp.h:163: warning: unused parameter `node'
include/linux/slab.h: In function `kmem_cache_alloc_node':
include/linux/slab.h:208: warning: unused parameter `node'
include/linux/slab.h: In function `kmalloc_node':
include/linux/slab.h:212: warning: unused parameter `node'
include/linux/plist.h: In function `plist_head_init':
include/linux/plist.h:129: warning: unused parameter `lock'
include/linux/rtmutex.h: In function `rt_mutex_debug_check_no_locks_freed':
include/linux/rtmutex.h:46: warning: unused parameter `from'
include/linux/rtmutex.h:47: warning: unused parameter `len'
include/linux/sched.h: In function `prefetch_stack':
include/linux/sched.h:787: warning: unused parameter `t'
include/linux/sched.h: In function `lock_need_resched':
include/linux/sched.h:1515: warning: unused parameter `lock'
include/asm-generic/pgtable-nopud.h: In function `pgd_none':
include/asm-generic/pgtable-nopud.h:25: warning: unused parameter `pgd'
include/asm-generic/pgtable-nopud.h: In function `pgd_bad':
include/asm-generic/pgtable-nopud.h:26: warning: unused parameter `pgd'
include/asm-generic/pgtable-nopud.h: In function `pgd_present':
include/asm-generic/pgtable-nopud.h:27: warning: unused parameter `pgd'
include/asm-generic/pgtable-nopud.h: In function `pgd_clear':
include/asm-generic/pgtable-nopud.h:28: warning: unused parameter `pgd'
include/asm-generic/pgtable-nopud.h: In function `pud_offset':
include/asm-generic/pgtable-nopud.h:38: warning: unused parameter `address'
include/asm-generic/pgtable-nopmd.h: In function `pud_none':
include/asm-generic/pgtable-nopmd.h:27: warning: unused parameter `pud'
include/asm-generic/pgtable-nopmd.h: In function `pud_bad':
include/asm-generic/pgtable-nopmd.h:28: warning: unused parameter `pud'
include/asm-generic/pgtable-nopmd.h: In function `pud_present':
include/asm-generic/pgtable-nopmd.h:29: warning: unused parameter `pud'
include/asm-generic/pgtable-nopmd.h: In function `pud_clear':
include/asm-generic/pgtable-nopmd.h:30: warning: unused parameter `pud'
include/asm-generic/pgtable-nopmd.h: In function `pmd_offset':
include/asm-generic/pgtable-nopmd.h:41: warning: unused parameter `address'
include/asm/pgtable-2level.h: In function `pte_exec_kernel':
include/asm/pgtable-2level.h:43: warning: unused parameter `pte'
include/asm/pgtable.h: In function `ptep_test_and_clear_dirty':
include/asm/pgtable.h:264: warning: unused parameter `vma'
include/asm/pgtable.h:264: warning: unused parameter `addr'
include/asm/pgtable.h: In function `ptep_test_and_clear_young':
include/asm/pgtable.h:271: warning: unused parameter `vma'
include/asm/pgtable.h:271: warning: unused parameter `addr'
include/asm/pgtable.h: In function `ptep_get_and_clear_full':
include/asm/pgtable.h:278: warning: unused parameter `mm'
include/asm/pgtable.h:278: warning: unused parameter `addr'
include/asm/pgtable.h: In function `ptep_set_wrprotect':
include/asm/pgtable.h:290: warning: unused parameter `mm'
include/asm/pgtable.h:290: warning: unused parameter `addr'
include/asm/pgtable.h: In function `set_kernel_exec':
include/asm/pgtable.h:406: warning: unused parameter `vaddr'
include/asm/pgtable.h:406: warning: unused parameter `enable'
include/linux/kdev_t.h: In function `new_valid_dev':
include/linux/kdev_t.h:36: warning: unused parameter `dev'
include/linux/kdev_t.h: In function `huge_valid_dev':
include/linux/kdev_t.h:55: warning: unused parameter `dev'
include/linux/fs.h: In function `__simple_attr_check_format':
include/linux/fs.h:1908: warning: unused parameter `fmt'
include/linux/fs.h: In function `free_secdata':
include/linux/fs.h:1939: warning: unused parameter `secdata'
include/asm/tlbflush.h: In function `flush_tlb_range':
include/asm/tlbflush.h:121: warning: unused parameter `start'
include/asm/tlbflush.h:121: warning: unused parameter `end'
include/asm/tlbflush.h: In function `flush_tlb_pgtables':
include/asm/tlbflush.h:142: warning: unused parameter `mm'
include/asm/tlbflush.h:143: warning: unused parameter `start'
include/asm/tlbflush.h:143: warning: unused parameter `end'
include/linux/profile.h: In function `task_handoff_register':
include/linux/profile.h:65: warning: unused parameter `n'
include/linux/profile.h: In function `task_handoff_unregister':
include/linux/profile.h:70: warning: unused parameter `n'
include/linux/profile.h: In function `profile_event_register':
include/linux/profile.h:75: warning: unused parameter `t'
include/linux/profile.h:75: warning: unused parameter `n'
include/linux/profile.h: In function `profile_event_unregister':
include/linux/profile.h:80: warning: unused parameter `t'
include/linux/profile.h:80: warning: unused parameter `n'
include/linux/profile.h: In function `register_timer_hook':
include/linux/profile.h:89: warning: unused parameter `hook'
include/linux/profile.h: In function `unregister_timer_hook':
include/linux/profile.h:94: warning: unused parameter `hook'
include/linux/irq.h: In function `set_balance_irq_affinity':
include/linux/irq.h:271: warning: unused parameter `irq'
include/linux/irq.h:271: warning: unused parameter `mask'
include/linux/irq.h: In function `select_smp_affinity':
include/linux/irq.h:279: warning: unused parameter `irq'
include/linux/hardirq.h: In function `account_system_vtime':
include/linux/hardirq.h:93: warning: unused parameter `tsk'
include/linux/highmem.h: In function `flush_anon_page':
include/linux/highmem.h:10: warning: unused parameter `page'
include/linux/highmem.h:10: warning: unused parameter `vmaddr'
include/linux/highmem.h: In function `flush_kernel_dcache_page':
include/linux/highmem.h:16: warning: unused parameter `page'
include/linux/highmem.h: In function `clear_user_highpage':
include/linux/highmem.h:48: warning: unused parameter `vaddr'
include/linux/highmem.h: In function `copy_user_highpage':
include/linux/highmem.h:92: warning: unused parameter `vaddr'
make[2]: *** [/tmp/vmware-config15/vmmon-only/linux/driver.o] Error 1
make[1]: *** [_module_/tmp/vmware-config15/vmmon-only] Error 2
make[1]: Leaving directory `/usr/src/linux-2.6.18.1'
make: *** [vmmon.ko] Error 2
make: Leaving directory `/tmp/vmware-config15/vmmon-only'
Unable to build the vmmon module.
For more information on how to troubleshoot module-related problems, please
visit our Web site at "http://www.vmware.com/download/modules/modules.html" and
"http://www.vmware.com/support/reference/linux/prebuilt_modules_linux.html".
Execution aborted.