LD lib/zlib_inflate/built-in.o
CC lib/audit.o
In file included from lib/audit.c:7:
include/asm-generic/audit_dir_write.h:9: error: ‘__NR_mkdirat’ undeclared here (not in a function)
include/asm-generic/audit_dir_write.h:10: error: ‘__NR_mknodat’ undeclared here (not in a function)
include/asm-generic/audit_dir_write.h:11: error: ‘__NR_unlinkat’ undeclared here (not in a function)
include/asm-generic/audit_dir_write.h:12: error: ‘__NR_renameat’ undeclared here (not in a function)
include/asm-generic/audit_dir_write.h:13: error: ‘__NR_linkat’ undeclared here (not in a function)
include/asm-generic/audit_dir_write.h:14: error: ‘__NR_symlinkat’ undeclared here (not in a function)
In file included from include/asm-generic/audit_write.h:1,
from lib/audit.c:17:
include/asm-generic/audit_dir_write.h:9: error: initializer element is not constant
include/asm-generic/audit_dir_write.h:9: error: (near initialization for ‘write_class[8]’)
include/asm-generic/audit_dir_write.h:10: error: initializer element is not constant
include/asm-generic/audit_dir_write.h:10: error: (near initialization for ‘write_class[9]’)
include/asm-generic/audit_dir_write.h:11: error: initializer element is not constant
include/asm-generic/audit_dir_write.h:11: error: (near initialization for ‘write_class[10]’)
include/asm-generic/audit_dir_write.h:12: error: initializer element is not constant
include/asm-generic/audit_dir_write.h:12: error: (near initialization for ‘write_class[11]’)
include/asm-generic/audit_dir_write.h:13: error: initializer element is not constant
include/asm-generic/audit_dir_write.h:13: error: (near initialization for ‘write_class[12]’)
include/asm-generic/audit_dir_write.h:14: error: initializer element is not constant
include/asm-generic/audit_dir_write.h:14: error: (near initialization for ‘write_class[13]’)
In file included from lib/audit.c:22:
include/asm-generic/audit_change_attr.h:12: error: ‘__NR_fchownat’ undeclared here (not in a function)
include/asm-generic/audit_change_attr.h:12: error: initializer element is not constant
include/asm-generic/audit_change_attr.h:12: error: (near initialization for ‘chattr_class[11]’)
include/asm-generic/audit_change_attr.h:13: error: ‘__NR_fchmodat’ undeclared here (not in a function)
include/asm-generic/audit_change_attr.h:13: error: initializer element is not constant
include/asm-generic/audit_change_attr.h:13: error: (near initialization for ‘chattr_class[12]’)
lib/audit.c: In function ‘audit_classify_syscall’:
lib/audit.c:31: error: ‘__NR_openat’ undeclared (first use in this function)
lib/audit.c:31: error: (Each undeclared identifier is reported only once
lib/audit.c:31: error: for each function it appears in.)
make[1]: *** [lib/audit.o] Fejl 1
make: *** [lib] Fejl 2